{
	"orderID" : "ID1234",
	"prodcutID" : "IDp1131966" ,
	"quantity" : 2,
	"price" : 125,
	"subTotal" : "125 * 2 = 250"

}

{
	"orderID" : "ID4321",
	"prodcutID" : "IDp1131696" ,
	"quantity" : 1,
	"price" : 560,
	"subTotal" :  "560 * 1 = 560"
}