
{
	"_id": "MarkA0706",
	"firstName": "Mark",
	"lastName": "Alcantara",
	"email": "MAlcantara6@yahoo.com",
	"password": "ma07061993",
	"isAdmin": false,
	"mobileNumber": "09775162208"
},

{
	"_id": "Sofia_Rose",
	"firstName": "Sofia",
	"lastName": "Dela Cruz",
	"email": "sofiadl@gmail.com",
	"password": "rosesarered",
	"isAdmin": false,
	"mobileNumber": "09153668532"
}