
{
	"_id": "order_prod123",
	"orderID": "orderID(F1sd640654E)",
	"productID": ["Cl-00313", "Cl-00314", "Cl-00276"],
	"quantity": {
		"Cl-00313": 2,
		"Cl-00314": 1,
		"Cl-00276": 1,
	},
	"price": {
		"Cl-00313": 1300,
		"Cl-00314": 799,
		"Cl-00276": 999,
	},
	"total": 3098
},

{
	"_id": "order_prod123",
	"orderID": "orderID(D5rf542151T)",
	"productID": "Bag-NkSp-450",
	"quantity": 1,
	"price": 1450,
	"total": 1450
},

{
	"_id": "order_prod123",
	"orderID": "orderID(S2wx724623P)",
	"productID": "Bag-LV306",
	"quantity": 1,
	"price": 2499,
	"total": 2499
}