{
	"_id": "orderproducts1",
	"orderId": "order1",
	"productId": "product1",
	"quantity": 1,
	"price": 750,
	"subtotal": 750
}

{
	"_id": "orderproducts2",
	"orderId": "order1",
	"productId": "product2",
	"quantity": 2,
	"price": 125,
	"subtotal": 250
}