{
	"info": {
		"_postman_id": "7aefe150-755d-4f40-92b0-8cd6d7e39163",
		"name": "s35-Activity",
		"schema": "https://schema.getpostman.com/json/collection/v2.1.0/collection.json",
		"_exporter_id": "21674199"
	},
	"item": [
		{
			"name": "register a user",
			"request": {
				"method": "POST",
				"header": [],
				"body": {
					"mode": "raw",
					"raw": "{\r\n    \"username\" : \"kris07\",\r\n    \"password\" : \"password123\"\r\n}",
					"options": {
						"raw": {
							"language": "json"
						}
					}
				},
				"url": {
					"raw": "{{s35-activity}}/signup",
					"host": [
						"{{s35-activity}}"
					],
					"path": [
						"signup"
					]
				}
			},
			"response": []
		}
	]
}