{
  "variants": {
    "facing=east": {
      "model": "block_n_code:block/code_base",
      "y": 270
    },
    "facing=north": {
      "model": "block_n_code:block/code_base",
      "y": 180
    },
    "facing=south": {
      "model": "block_n_code:block/code_base"
    },
    "facing=west": {
      "model": "block_n_code:block/code_base",
      "y": 90
    }
  }
}