{
  "parent": "block/cube_directional",
  "textures": {
    "particle": "block_n_code:block/logic_base",
    "down": "block_n_code:block/logic_base",
    "up": "block_n_code:block/boolean_math",
    "north": "block_n_code:block/code_alt_output",
    "east": "block_n_code:block/logic_base",
    "south": "block_n_code:block/code_alt_output",
    "west": "block_n_code:block/logic_base"
  }
}