{
  "parent": "block/cube_directional",
  "textures": {
    "particle": "block_n_code:block/code_robot_instruction",
    "down": "block_n_code:block/code_robot_instruction",
    "up": "block_n_code:block/code_robot_instruction",
    "north": "block_n_code:block/code_robot_instruction",
    "east": "block_n_code:block/code_robot_instruction",
    "south": "block_n_code:block/code_output",
    "west": "block_n_code:block/code_robot_instruction"
  }
}