{
  "parent": "block/cube_directional",
  "textures": {
    "particle": "block_n_code:block/input_number",
    "down": "block_n_code:block/input_number",
    "up": "block_n_code:block/input_number",
    "north": "block_n_code:block/input_number",
    "east": "block_n_code:block/input_number",
    "south": "block_n_code:block/input_number",
    "west": "block_n_code:block/input_number"
  }
}