{
  "parent": "minecraft:recipes/root",
  "rewards": {
    "recipes": [
      "minecraft:input_boolean_from_code_base_stonecutting"
    ]
  },
  "criteria": {
    "has_code_base": {
      "trigger": "minecraft:inventory_changed",
      "conditions": {
        "items": [
          {
            "items": [
              "block_n_code:code_base"
            ]
          }
        ]
      }
    },
    "has_the_recipe": {
      "trigger": "minecraft:recipe_unlocked",
      "conditions": {
        "recipe": "minecraft:input_boolean_from_code_base_stonecutting"
      }
    }
  },
  "requirements": [
    [
      "has_code_base",
      "has_the_recipe"
    ]
  ]
}