"Id","User agent","Software","OS","Layout engine","Popularity"
"0","Mozilla / 5.0(X11; Linux x86_64; rv: 69.0) Gecko / 20100101 Firefox / 69.0","Firefox 69","Linux","Gecko","The Best Ever"
"1","Mozilla/5.0 (Windows NT 10.0; Win64; x64) AppleWebKit/537.36 (KHTML, like Gecko) Chrome/60.0.3112.113 Safari/537.36","Chrome 60","Windows","Blink","Very common"
"2","Mozilla/5.0 (Windows NT 5.1; rv:7.0.1) Gecko/20100101 Firefox/7.0.1","Firefox 7","Windows","Gecko","Very common"
"3","Mozilla/5.0 (Windows NT 6.1; WOW64; rv:54.0) Gecko/20100101 Firefox/54.0","Firefox 54","Windows","Gecko","Very common"
"4","Mozilla/5.0 (Windows NT 6.1; Win64; x64) AppleWebKit/537.36 (KHTML, like Gecko) Chrome/60.0.3112.90 Safari/537.36","Chrome 60","Windows","Blink","Very common"
"5","Mozilla/5.0 (X11; Linux x86_64) AppleWebKit/537.36 (KHTML, like Gecko) Chrome/44.0.2403.157 Safari/537.36","Chrome 44","Linux","Blink","Very common"
"6","Mozilla/5.0 (Windows NT 6.1; WOW64; rv:40.0) Gecko/20100101 Firefox/40.1","Firefox 40.1","Windows","Gecko","Very common"
"7","Mozilla/4.0 (compatible; MSIE 9.0; Windows NT 6.1)","Internet Explorer 9","Windows","Trident","Very common"
"8","Mozilla/5.0 (Windows NT 5.1; Win64; x64) AppleWebKit/537.36 (KHTML, like Gecko) Chrome/60.0.3112.90 Safari/537.36","Chrome 60","Windows","Blink","Very common"
"9","Mozilla/5.0 (Windows NT 6.2; Win64; x64) AppleWebKit/537.36 (KHTML, like Gecko) Chrome/60.0.3112.90 Safari/537.36","Chrome 60","Windows","Blink","Very common"
"10","Mozilla/5.0 (Windows NT 10.0; Win64; x64) AppleWebKit/537.36 (KHTML, like Gecko) Chrome/51.0.2704.79 Safari/537.36 Edge/14.14393","Edge 38","Windows","EdgeHTML","Very common"
"11","Mozilla/5.0 (Windows NT 6.3; Win64; x64) AppleWebKit/537.36 (KHTML, like Gecko) Chrome/60.0.3112.113 Safari/537.36","Chrome 60","Windows","Blink","Very common"
"12","Mozilla/5.0 (Windows NT 6.1; WOW64; Trident/7.0; rv:11.0) like Gecko","Internet Explorer 11","Windows","Trident","Very common"
"13","Mozilla/5.0 (Windows NT 10.0; Win64; x64) AppleWebKit/537.36 (KHTML, like Gecko) Chrome/52.0.2743.116 Safari/537.36 Edge/15.15063","Edge 40","Windows","EdgeHTML","Very common"
"14","Mozilla/5.0 (Macintosh; Intel Mac OS X 10_12_6) AppleWebKit/603.3.8 (KHTML, like Gecko)","Webkit based browser","Mac OS X","Webkit","Very common"
"15","Mozilla/5.0 (Windows NT 10.0; WOW64; rv:50.0) Gecko/20100101 Firefox/50.0","Firefox 50","Windows","Gecko","Very common"
"16","Mozilla/5.0 (Windows NT 10.0; WOW64; rv:52.0) Gecko/20100101 Firefox/52.0","Firefox 52","Windows","Gecko","Very common"
"17","Mozilla/5.0 (Windows NT 6.1; WOW64; rv:50.0) Gecko/20100101 Firefox/50.0","Firefox 50","Windows","Gecko","Very common"
"18","Mozilla/5.0 (Windows NT 6.1; Win64; x64) AppleWebKit/537.36 (KHTML, like Gecko) Chrome/51.0.2704.79 Safari/537.36 Edge/14.14393","Edge 38","Windows","EdgeHTML","Very common"
"19","Mozilla/5.0 (Windows NT 6.1; Win64; x64) AppleWebKit/537.36 (KHTML, like Gecko) Chrome/46.0.2486.0 Safari/537.36 Edge/13.10586","Edge 25","Windows","EdgeHTML","Very common"
"20","Mozilla/5.0 (Windows NT 10.0; WOW64; rv:54.0) Gecko/20100101 Firefox/54.0","Firefox 54","Windows","Gecko","Very common"
"21","Mozilla/5.0 (Windows NT 10.0; Win64; x64) AppleWebKit/537.36 (KHTML, like Gecko) Chrome/57.0.2987.133 Safari/537.36","Chrome 57","Windows","Blink","Very common"
"22","Mozilla/5.0 (Windows NT 10.0; Win64; x64) AppleWebKit/537.36 (KHTML, like Gecko) Chrome/60.0.3112.90 Safari/537.36","Chrome 60","Windows","Blink","Very common"
"23","Mozilla/5.0 (Windows NT 6.1; Trident/7.0; rv:11.0) like Gecko","Internet Explorer 11","Windows","Trident","Very common"
"24","Mozilla/5.0 (Windows NT 10.0; Win64; x64) AppleWebKit/537.36 (KHTML, like Gecko) Chrome/46.0.2486.0 Safari/537.36 Edge/13.10586","Edge 25","Windows","EdgeHTML","Very common"
"25","Mozilla/5.0 (compatible; MSIE 9.0; Windows NT 6.1; WOW64; Trident/5.0)","Internet Explorer 9","Windows","Trident","Very common"
"26","Mozilla/5.0 (Windows NT 6.1; Win64; x64) AppleWebKit/537.36 (KHTML, like Gecko) Chrome/57.0.2987.133 Safari/537.36","Chrome 57","Windows","Blink","Very common"
"27","Mozilla/5.0 (Windows NT 10.0; Win64; x64) AppleWebKit/537.36 (KHTML, like Gecko) Chrome/55.0.2883.87 Safari/537.36","Chrome 55","Windows","Blink","Very common"
"28","Mozilla/5.0 (Windows NT 10.0; WOW64; Trident/7.0; rv:11.0) like Gecko","Internet Explorer 11","Windows","Trident","Very common"
"29","Mozilla/5.0 (Windows NT 6.1; WOW64; rv:52.0) Gecko/20100101 Firefox/52.0","Firefox 52","Windows","Gecko","Very common"
"30","Mozilla/5.0 (Windows NT 6.2; WOW64; Trident/7.0; rv:11.0) like Gecko","Internet Explorer 11","Windows","Trident","Very common"
"31","Mozilla/5.0 (Windows NT 10.0; Win64; x64) AppleWebKit/537.36 (KHTML, like Gecko) Chrome/63.0.3239.84 Safari/537.36","Chrome 63","Windows","Blink","Very common"
"32","Mozilla/5.0 (Windows NT 6.1; Win64; x64) AppleWebKit/537.36 (KHTML, like Gecko) Chrome/55.0.2883.87 Safari/537.36","Chrome 55","Windows","Blink","Very common"
"33","Mozilla/5.0 (Windows NT 6.1; Win64; x64) AppleWebKit/537.36 (KHTML, like Gecko) Chrome/42.0.2311.135 Safari/537.36 Edge/12.10240","Edge 20","Windows","EdgeHTML","Very common"
"34","Mozilla/5.0 (Windows NT 6.3; Win64; x64) AppleWebKit/537.36 (KHTML, like Gecko) Chrome/46.0.2486.0 Safari/537.36 Edge/13.10586","Edge 25","Windows","EdgeHTML","Very common"
"35","Mozilla/5.0 (Windows NT 6.1; Win64; x64) AppleWebKit/537.36 (KHTML, like Gecko) Chrome/52.0.2743.116 Safari/537.36 Edge/15.15063","Edge 40","Windows","EdgeHTML","Very common"
"36","Mozilla/5.0 (Windows NT 6.1; WOW64; rv:41.0) Gecko/20100101 Firefox/41.0","Firefox 41","Windows","Gecko","Very common"
"37","Mozilla/5.0 (Windows NT 6.1; WOW64) AppleWebKit/537.36 (KHTML, like Gecko) Chrome/46.0.2490.80 Safari/537.36","Chrome 46","Windows","Blink","Very common"
"38","Mozilla/5.0 (Windows NT 6.3; WOW64; Trident/7.0; rv:11.0) like Gecko","Internet Explorer 11","Windows","Trident","Very common"
"39","Mozilla/5.0 (Windows NT 6.1; WOW64; rv:46.0) Gecko/20100101 Firefox/46.0","Firefox 46","Windows","Gecko","Very common"
"40","Mozilla/5.0 (Windows NT 5.1; Win64; x64) AppleWebKit/537.36 (KHTML, like Gecko) Chrome/51.0.2704.79 Safari/537.36 Edge/14.14393","Edge 38","Windows","EdgeHTML","Very common"
"41","Mozilla/5.0 (Windows NT 6.0; Win64; x64) AppleWebKit/537.36 (KHTML, like Gecko) Chrome/51.0.2704.79 Safari/537.36 Edge/14.14393","Edge 38","Windows","EdgeHTML","Very common"
"42","Mozilla/5.0 (Windows NT 6.2; Win64; x64) AppleWebKit/537.36 (KHTML, like Gecko) Chrome/51.0.2704.79 Safari/537.36 Edge/14.14393","Edge 38","Windows","EdgeHTML","Very common"
"43","Mozilla/5.0 (compatible; MSIE 9.0; Windows NT 6.0; Trident/5.0)","Internet Explorer 9","Windows","Trident","Very common"
"44","Mozilla/5.0 (Windows NT 6.1; WOW64) AppleWebKit/537.36 (KHTML, like Gecko) Chrome/51.0.2704.106 Safari/537.36","Chrome 51","Windows","Blink","Very common"
"45","Mozilla/5.0 (Windows NT 6.1; WOW64; rv:44.0) Gecko/20100101 Firefox/44.0","Firefox 44","Windows","Gecko","Very common"
"46","Mozilla/5.0 (Windows NT 6.3; Win64; x64) AppleWebKit/537.36 (KHTML, like Gecko) Chrome/51.0.2704.79 Safari/537.36 Edge/14.14393","Edge 38","Windows","EdgeHTML","Very common"
"47","Mozilla/5.0 (Windows NT 6.1; WOW64) AppleWebKit/537.36 (KHTML, like Gecko) Chrome/48.0.2564.109 Safari/537.36","Chrome 48","Windows","Blink","Very common"
"48","Mozilla/5.0 (Macintosh; Intel Mac OS X 10_11_6) AppleWebKit/601.7.7 (KHTML, like Gecko) Version/9.1.2 Safari/601.7.7","Safari 9.1","Mac OS X","Webkit","Very common"
"49","Mozilla/5.0 (iPad; CPU OS 9_3_2 like Mac OS X) AppleWebKit/601.1.46 (KHTML, like Gecko) Version/9.0 Mobile/13F69 Safari/601.1","Safari 9","iOS","Webkit","Very common"
"50","Mozilla/5.0 (Windows NT 10.0; Win64; x64) AppleWebKit/537.36 (KHTML, like Gecko) Chrome/63.0.3239.132 Safari/537.36","Chrome 63","Windows","Blink","Very common"