<?xml version='1.0' encoding='UTF-8' standalone='yes' ?>
<gpx version="1.1" creator="OsmAnd+ 3.7.4" xmlns="http://www.topografix.com/GPX/1/1" xmlns:xsi="http://www.w3.org/2001/XMLSchema-instance" xsi:schemaLocation="http://www.topografix.com/GPX/1/1 http://www.topografix.com/GPX/1/1/gpx.xsd">
  <metadata>
    <name>2020-09-15_18-10_Tue</name>
  </metadata>
  <trk>
    <trkseg>
      <trkpt lat="48.8487709" lon="2.4150785">
        <ele>115.102</ele>
        <time>2020-09-15T16:10:53Z</time>
        <hdop>47.168</hdop>
      </trkpt>
      <trkpt lat="48.8487506" lon="2.415096">
        <ele>113.977</ele>
        <time>2020-09-15T16:10:59Z</time>
        <hdop>35.376</hdop>
      </trkpt>
      <trkpt lat="48.8488507" lon="2.41525">
        <ele>91.959</ele>
        <time>2020-09-15T16:11:04Z</time>
        <hdop>25.728</hdop>
        <extensions>
          <speed>0.89</speed>
        </extensions>
      </trkpt>
      <trkpt lat="48.8490033" lon="2.4152746">
        <ele>75.298</ele>
        <time>2020-09-15T16:11:10Z</time>
        <hdop>17.152</hdop>
        <extensions>
          <speed>3.4</speed>
        </extensions>
      </trkpt>
      <trkpt lat="48.8490792" lon="2.4151417">
        <ele>66.759</ele>
        <time>2020-09-15T16:11:15Z</time>
        <hdop>11.792</hdop>
        <extensions>
          <speed>4.16</speed>
        </extensions>
      </trkpt>
      <trkpt lat="48.8491313" lon="2.4148586">
        <ele>63.475</ele>
        <time>2020-09-15T16:11:21Z</time>
        <hdop>7.504</hdop>
        <extensions>
          <speed>4.6</speed>
        </extensions>
      </trkpt>
      <trkpt lat="48.8491879" lon="2.4145269">
        <ele>61.297</ele>
        <time>2020-09-15T16:11:27Z</time>
        <hdop>5.36</hdop>
        <extensions>
          <speed>5.12</speed>
        </extensions>
      </trkpt>
      <trkpt lat="48.8492156" lon="2.4141964">
        <ele>56.197</ele>
        <time>2020-09-15T16:11:32Z</time>
        <hdop>4.288</hdop>
        <extensions>
          <speed>5.7</speed>
        </extensions>
      </trkpt>
      <trkpt lat="48.8492106" lon="2.413759">
        <ele>49.701</ele>
        <time>2020-09-15T16:11:38Z</time>
        <hdop>3.216</hdop>
        <extensions>
          <speed>5.49</speed>
        </extensions>
      </trkpt>
      <trkpt lat="48.8491734" lon="2.413374">
        <ele>50.635</ele>
        <time>2020-09-15T16:11:43Z</time>
        <hdop>3.216</hdop>
        <extensions>
          <speed>6.14</speed>
        </extensions>
      </trkpt>
      <trkpt lat="48.8491021" lon="2.412935">
        <ele>51.571</ele>
        <time>2020-09-15T16:11:49Z</time>
        <hdop>3.216</hdop>
        <extensions>
          <speed>6.41</speed>
        </extensions>
      </trkpt>
      <trkpt lat="48.8491251" lon="2.4125763">
        <ele>49.649</ele>
        <time>2020-09-15T16:11:54Z</time>
        <hdop>3.216</hdop>
        <extensions>
          <speed>5.83</speed>
        </extensions>
      </trkpt>
      <trkpt lat="48.8491199" lon="2.4121594">
        <ele>50.799</ele>
        <time>2020-09-15T16:12:00Z</time>
        <hdop>4.288</hdop>
        <extensions>
          <speed>4.75</speed>
        </extensions>
      </trkpt>
      <trkpt lat="48.8491196" lon="2.4119006">
        <ele>50.573</ele>
        <time>2020-09-15T16:12:05Z</time>
        <hdop>4.288</hdop>
        <extensions>
          <speed>1.78</speed>
        </extensions>
      </trkpt>
      <trkpt lat="48.8491084" lon="2.411674">
        <ele>49.231</ele>
        <time>2020-09-15T16:12:11Z</time>
        <hdop>3.216</hdop>
        <extensions>
          <speed>0.88</speed>
        </extensions>
      </trkpt>
      <trkpt lat="48.849001" lon="2.4116236">
        <ele>49.519</ele>
        <time>2020-09-15T16:12:16Z</time>
        <hdop>4.288</hdop>
        <extensions>
          <speed>3.94</speed>
        </extensions>
      </trkpt>
      <trkpt lat="48.848693" lon="2.4116005">
        <ele>51.509</ele>
        <time>2020-09-15T16:12:22Z</time>
        <hdop>6.432</hdop>
        <extensions>
          <speed>5.09</speed>
        </extensions>
      </trkpt>
      <trkpt lat="48.8484372" lon="2.411582">
        <ele>50.505</ele>
        <time>2020-09-15T16:12:28Z</time>
        <hdop>4.288</hdop>
        <extensions>
          <speed>1.51</speed>
        </extensions>
      </trkpt>
      <trkpt lat="48.8480406" lon="2.4114824">
        <ele>50.289</ele>
        <time>2020-09-15T16:12:34Z</time>
        <hdop>9.648</hdop>
        <extensions>
          <speed>6.48</speed>
        </extensions>
      </trkpt>
      <trkpt lat="48.8477817" lon="2.4114657">
        <ele>48.434</ele>
        <time>2020-09-15T16:12:39Z</time>
        <hdop>4.288</hdop>
        <extensions>
          <speed>5.47</speed>
        </extensions>
      </trkpt>
      <trkpt lat="48.8475546" lon="2.4114899">
        <ele>44.69</ele>
        <time>2020-09-15T16:12:44Z</time>
        <hdop>4.288</hdop>
        <extensions>
          <speed>3.62</speed>
        </extensions>
      </trkpt>
      <trkpt lat="48.8473125" lon="2.4114747">
        <ele>42.498</ele>
        <time>2020-09-15T16:12:50Z</time>
        <hdop>3.216</hdop>
        <extensions>
          <speed>2.64</speed>
        </extensions>
      </trkpt>
      <trkpt lat="48.8472554" lon="2.4113512">
        <ele>45.783</ele>
        <time>2020-09-15T16:12:55Z</time>
        <hdop>3.216</hdop>
        <extensions>
          <speed>1.05</speed>
        </extensions>
      </trkpt>
      <trkpt lat="48.8472612" lon="2.4111996">
        <ele>46.377</ele>
        <time>2020-09-15T16:13:01Z</time>
        <hdop>3.216</hdop>
        <extensions>
          <speed>2.6</speed>
        </extensions>
      </trkpt>
      <trkpt lat="48.847185" lon="2.4109896">
        <ele>47.71</ele>
        <time>2020-09-15T16:13:06Z</time>
        <hdop>3.216</hdop>
        <extensions>
          <speed>3.91</speed>
        </extensions>
      </trkpt>
      <trkpt lat="48.8471694" lon="2.4108063">
        <ele>47.206</ele>
        <time>2020-09-15T16:13:12Z</time>
        <hdop>3.216</hdop>
        <extensions>
          <speed>0.91</speed>
        </extensions>
      </trkpt>
      <trkpt lat="48.8471674" lon="2.4108274">
        <ele>45.279</ele>
        <time>2020-09-15T16:13:17Z</time>
        <hdop>3.216</hdop>
      </trkpt>
      <trkpt lat="48.8471643" lon="2.41083">
        <ele>44.471</ele>
        <time>2020-09-15T16:13:23Z</time>
        <hdop>3.216</hdop>
      </trkpt>
      <trkpt lat="48.8471596" lon="2.4108177">
        <ele>46.147</ele>
        <time>2020-09-15T16:13:28Z</time>
        <hdop>3.216</hdop>
      </trkpt>
      <trkpt lat="48.8471565" lon="2.4108058">
        <ele>45.888</ele>
        <time>2020-09-15T16:13:34Z</time>
        <hdop>3.216</hdop>
      </trkpt>
      <trkpt lat="48.8471548" lon="2.4108139">
        <ele>45.193</ele>
        <time>2020-09-15T16:13:39Z</time>
        <hdop>3.216</hdop>
      </trkpt>
      <trkpt lat="48.8470716" lon="2.410801">
        <ele>47.264</ele>
        <time>2020-09-15T16:13:45Z</time>
        <hdop>3.216</hdop>
        <extensions>
          <speed>3.51</speed>
        </extensions>
      </trkpt>
      <trkpt lat="48.8468972" lon="2.4107765">
        <ele>48.004</ele>
        <time>2020-09-15T16:13:50Z</time>
        <hdop>3.216</hdop>
        <extensions>
          <speed>3.19</speed>
        </extensions>
      </trkpt>
      <trkpt lat="48.8468036" lon="2.4107938">
        <ele>50.338</ele>
        <time>2020-09-15T16:13:56Z</time>
        <hdop>3.216</hdop>
        <extensions>
          <speed>1.57</speed>
        </extensions>
      </trkpt>
      <trkpt lat="48.8466967" lon="2.4108293">
        <ele>49.189</ele>
        <time>2020-09-15T16:14:01Z</time>
        <hdop>3.216</hdop>
        <extensions>
          <speed>4.27</speed>
        </extensions>
      </trkpt>
      <trkpt lat="48.8464482" lon="2.410819">
        <ele>49.678</ele>
        <time>2020-09-15T16:14:07Z</time>
        <hdop>3.216</hdop>
        <extensions>
          <speed>4.42</speed>
        </extensions>
      </trkpt>
      <trkpt lat="48.8462437" lon="2.4107469">
        <ele>49.191</ele>
        <time>2020-09-15T16:14:12Z</time>
        <hdop>3.216</hdop>
        <extensions>
          <speed>4.67</speed>
        </extensions>
      </trkpt>
      <trkpt lat="48.8459953" lon="2.4106785">
        <ele>50.385</ele>
        <time>2020-09-15T16:14:18Z</time>
        <hdop>3.216</hdop>
        <extensions>
          <speed>4.6</speed>
        </extensions>
      </trkpt>
      <trkpt lat="48.8457849" lon="2.4106201">
        <ele>53.844</ele>
        <time>2020-09-15T16:14:23Z</time>
        <hdop>3.216</hdop>
        <extensions>
          <speed>4.71</speed>
        </extensions>
      </trkpt>
      <trkpt lat="48.8455089" lon="2.4105349">
        <ele>54.01</ele>
        <time>2020-09-15T16:14:29Z</time>
        <hdop>3.216</hdop>
        <extensions>
          <speed>5.98</speed>
        </extensions>
      </trkpt>
      <trkpt lat="48.8452382" lon="2.4105005">
        <ele>54.774</ele>
        <time>2020-09-15T16:14:34Z</time>
        <hdop>4.288</hdop>
        <extensions>
          <speed>6.11</speed>
        </extensions>
      </trkpt>
      <trkpt lat="48.8449184" lon="2.4103794">
        <ele>54.452</ele>
        <time>2020-09-15T16:14:40Z</time>
        <hdop>4.288</hdop>
        <extensions>
          <speed>6.55</speed>
        </extensions>
      </trkpt>
      <trkpt lat="48.844702" lon="2.4102564">
        <ele>55.829</ele>
        <time>2020-09-15T16:14:45Z</time>
        <hdop>4.288</hdop>
        <extensions>
          <speed>3.47</speed>
        </extensions>
      </trkpt>
      <trkpt lat="48.8445096" lon="2.410166">
        <ele>55.77</ele>
        <time>2020-09-15T16:14:51Z</time>
        <hdop>3.216</hdop>
        <extensions>
          <speed>3.81</speed>
        </extensions>
      </trkpt>
      <trkpt lat="48.844362" lon="2.4100709">
        <ele>53.767</ele>
        <time>2020-09-15T16:14:56Z</time>
        <hdop>3.216</hdop>
        <extensions>
          <speed>4.02</speed>
        </extensions>
      </trkpt>
      <trkpt lat="48.8443506" lon="2.409664">
        <ele>50.919</ele>
        <time>2020-09-15T16:15:02Z</time>
        <hdop>3.216</hdop>
        <extensions>
          <speed>6.45</speed>
        </extensions>
      </trkpt>
      <trkpt lat="48.8444124" lon="2.4092254">
        <ele>51.208</ele>
        <time>2020-09-15T16:15:07Z</time>
        <hdop>3.216</hdop>
        <extensions>
          <speed>6.84</speed>
        </extensions>
      </trkpt>
      <trkpt lat="48.8444537" lon="2.4086448">
        <ele>47.831</ele>
        <time>2020-09-15T16:15:13Z</time>
        <hdop>3.216</hdop>
        <extensions>
          <speed>7.5</speed>
        </extensions>
      </trkpt>
      <trkpt lat="48.8444996" lon="2.4081459">
        <ele>46.558</ele>
        <time>2020-09-15T16:15:18Z</time>
        <hdop>3.216</hdop>
        <extensions>
          <speed>7.38</speed>
        </extensions>
      </trkpt>
      <trkpt lat="48.844581" lon="2.407529">
        <ele>46.392</ele>
        <time>2020-09-15T16:15:24Z</time>
        <hdop>3.216</hdop>
        <extensions>
          <speed>7.86</speed>
        </extensions>
      </trkpt>
      <trkpt lat="48.8446232" lon="2.4070244">
        <ele>45.648</ele>
        <time>2020-09-15T16:15:29Z</time>
        <hdop>3.216</hdop>
        <extensions>
          <speed>7.85</speed>
        </extensions>
      </trkpt>
      <trkpt lat="48.8446592" lon="2.4064943">
        <ele>44.707</ele>
        <time>2020-09-15T16:15:34Z</time>
        <hdop>3.216</hdop>
        <extensions>
          <speed>7.21</speed>
        </extensions>
      </trkpt>
      <trkpt lat="48.8446818" lon="2.4061467">
        <ele>44.929</ele>
        <time>2020-09-15T16:15:40Z</time>
        <hdop>3.216</hdop>
        <extensions>
          <speed>3.82</speed>
        </extensions>
      </trkpt>
      <trkpt lat="48.8447002" lon="2.4060103">
        <ele>45.256</ele>
        <time>2020-09-15T16:15:46Z</time>
        <hdop>3.216</hdop>
      </trkpt>
      <trkpt lat="48.844707" lon="2.4059921">
        <ele>45.929</ele>
        <time>2020-09-15T16:15:51Z</time>
        <hdop>3.216</hdop>
      </trkpt>
      <trkpt lat="48.8447042" lon="2.4059797">
        <ele>46.649</ele>
        <time>2020-09-15T16:15:57Z</time>
        <hdop>3.216</hdop>
      </trkpt>
      <trkpt lat="48.8447036" lon="2.4059774">
        <ele>46.898</ele>
        <time>2020-09-15T16:16:02Z</time>
        <hdop>3.216</hdop>
      </trkpt>
      <trkpt lat="48.8447035" lon="2.4059766">
        <ele>46.984</ele>
        <time>2020-09-15T16:16:08Z</time>
        <hdop>3.216</hdop>
      </trkpt>
      <trkpt lat="48.8447028" lon="2.4059733">
        <ele>47.291</ele>
        <time>2020-09-15T16:16:13Z</time>
        <hdop>3.216</hdop>
      </trkpt>
      <trkpt lat="48.844709" lon="2.4059274">
        <ele>48.088</ele>
        <time>2020-09-15T16:16:19Z</time>
        <hdop>3.216</hdop>
        <extensions>
          <speed>2.47</speed>
        </extensions>
      </trkpt>
      <trkpt lat="48.8447412" lon="2.4056785">
        <ele>48.964</ele>
        <time>2020-09-15T16:16:24Z</time>
        <hdop>3.216</hdop>
        <extensions>
          <speed>4.62</speed>
        </extensions>
      </trkpt>
      <trkpt lat="48.8447707" lon="2.4052429">
        <ele>47.846</ele>
        <time>2020-09-15T16:16:30Z</time>
        <hdop>3.216</hdop>
        <extensions>
          <speed>5.94</speed>
        </extensions>
      </trkpt>
      <trkpt lat="48.8447933" lon="2.4048479">
        <ele>46.351</ele>
        <time>2020-09-15T16:16:35Z</time>
        <hdop>3.216</hdop>
        <extensions>
          <speed>5.05</speed>
        </extensions>
      </trkpt>
      <trkpt lat="48.8448367" lon="2.4044141">
        <ele>45.624</ele>
        <time>2020-09-15T16:16:41Z</time>
        <hdop>3.216</hdop>
        <extensions>
          <speed>5.09</speed>
        </extensions>
      </trkpt>
      <trkpt lat="48.8448786" lon="2.4040749">
        <ele>44.116</ele>
        <time>2020-09-15T16:16:46Z</time>
        <hdop>3.216</hdop>
        <extensions>
          <speed>4.87</speed>
        </extensions>
      </trkpt>
      <trkpt lat="48.844899" lon="2.4037026">
        <ele>43.044</ele>
        <time>2020-09-15T16:16:52Z</time>
        <hdop>4.288</hdop>
        <extensions>
          <speed>5.1</speed>
        </extensions>
      </trkpt>
      <trkpt lat="48.8449338" lon="2.4033497">
        <ele>44.076</ele>
        <time>2020-09-15T16:16:57Z</time>
        <hdop>3.216</hdop>
        <extensions>
          <speed>5.34</speed>
        </extensions>
      </trkpt>
      <trkpt lat="48.8449783" lon="2.4029432">
        <ele>43.614</ele>
        <time>2020-09-15T16:17:03Z</time>
        <hdop>3.216</hdop>
        <extensions>
          <speed>4.72</speed>
        </extensions>
      </trkpt>
      <trkpt lat="48.8450492" lon="2.4026425">
        <ele>44.102</ele>
        <time>2020-09-15T16:17:08Z</time>
        <hdop>3.216</hdop>
        <extensions>
          <speed>5.39</speed>
        </extensions>
      </trkpt>
      <trkpt lat="48.8451609" lon="2.4022868">
        <ele>47.276</ele>
        <time>2020-09-15T16:17:14Z</time>
        <hdop>3.216</hdop>
        <extensions>
          <speed>4.59</speed>
        </extensions>
      </trkpt>
      <trkpt lat="48.8450482" lon="2.4020053">
        <ele>47.978</ele>
        <time>2020-09-15T16:17:19Z</time>
        <hdop>3.216</hdop>
        <extensions>
          <speed>5.04</speed>
        </extensions>
      </trkpt>
      <trkpt lat="48.8448079" lon="2.4019832">
        <ele>48.071</ele>
        <time>2020-09-15T16:17:25Z</time>
        <hdop>3.216</hdop>
        <extensions>
          <speed>0.45</speed>
        </extensions>
      </trkpt>
      <trkpt lat="48.8446964" lon="2.4020272">
        <ele>48.836</ele>
        <time>2020-09-15T16:17:30Z</time>
        <hdop>3.216</hdop>
        <extensions>
          <speed>4.25</speed>
        </extensions>
      </trkpt>
      <trkpt lat="48.8444419" lon="2.4019039">
        <ele>49.319</ele>
        <time>2020-09-15T16:17:36Z</time>
        <hdop>3.216</hdop>
        <extensions>
          <speed>5.39</speed>
        </extensions>
      </trkpt>
      <trkpt lat="48.8441875" lon="2.4018032">
        <ele>49.804</ele>
        <time>2020-09-15T16:17:41Z</time>
        <hdop>3.216</hdop>
        <extensions>
          <speed>5.76</speed>
        </extensions>
      </trkpt>
      <trkpt lat="48.843869" lon="2.4016682">
        <ele>49.3</ele>
        <time>2020-09-15T16:17:47Z</time>
        <hdop>3.216</hdop>
        <extensions>
          <speed>5.95</speed>
        </extensions>
      </trkpt>
      <trkpt lat="48.8435997" lon="2.4015727">
        <ele>48.927</ele>
        <time>2020-09-15T16:17:52Z</time>
        <hdop>3.216</hdop>
        <extensions>
          <speed>5.99</speed>
        </extensions>
      </trkpt>
      <trkpt lat="48.8432665" lon="2.40146">
        <ele>50.089</ele>
        <time>2020-09-15T16:17:58Z</time>
        <hdop>5.36</hdop>
        <extensions>
          <speed>5.47</speed>
        </extensions>
      </trkpt>
      <trkpt lat="48.8430108" lon="2.4013896">
        <ele>49.867</ele>
        <time>2020-09-15T16:18:03Z</time>
        <hdop>4.288</hdop>
        <extensions>
          <speed>5.55</speed>
        </extensions>
      </trkpt>
      <trkpt lat="48.8427278" lon="2.4012856">
        <ele>49.872</ele>
        <time>2020-09-15T16:18:09Z</time>
        <hdop>3.216</hdop>
        <extensions>
          <speed>5.69</speed>
        </extensions>
      </trkpt>
      <trkpt lat="48.8424343" lon="2.4011706">
        <ele>50.757</ele>
        <time>2020-09-15T16:18:15Z</time>
        <hdop>3.216</hdop>
        <extensions>
          <speed>5.92</speed>
        </extensions>
      </trkpt>
      <trkpt lat="48.8421497" lon="2.4010697">
        <ele>49.348</ele>
        <time>2020-09-15T16:18:21Z</time>
        <hdop>3.216</hdop>
        <extensions>
          <speed>5.08</speed>
        </extensions>
      </trkpt>
      <trkpt lat="48.8419099" lon="2.4009861">
        <ele>49.811</ele>
        <time>2020-09-15T16:18:26Z</time>
        <hdop>3.216</hdop>
        <extensions>
          <speed>5.32</speed>
        </extensions>
      </trkpt>
      <trkpt lat="48.8416441" lon="2.4008894">
        <ele>50.561</ele>
        <time>2020-09-15T16:18:32Z</time>
        <hdop>3.216</hdop>
        <extensions>
          <speed>5.12</speed>
        </extensions>
      </trkpt>
      <trkpt lat="48.8414183" lon="2.4008248">
        <ele>51.945</ele>
        <time>2020-09-15T16:18:37Z</time>
        <hdop>3.216</hdop>
        <extensions>
          <speed>5.14</speed>
        </extensions>
      </trkpt>
      <trkpt lat="48.8411558" lon="2.400749">
        <ele>52.755</ele>
        <time>2020-09-15T16:18:43Z</time>
        <hdop>3.216</hdop>
        <extensions>
          <speed>5.03</speed>
        </extensions>
      </trkpt>
      <trkpt lat="48.8409375" lon="2.400655">
        <ele>53.549</ele>
        <time>2020-09-15T16:18:48Z</time>
        <hdop>3.216</hdop>
        <extensions>
          <speed>4.68</speed>
        </extensions>
      </trkpt>
      <trkpt lat="48.8406606" lon="2.4005522">
        <ele>54.917</ele>
        <time>2020-09-15T16:18:54Z</time>
        <hdop>3.216</hdop>
        <extensions>
          <speed>5.65</speed>
        </extensions>
      </trkpt>
      <trkpt lat="48.8403967" lon="2.4004577">
        <ele>55.764</ele>
        <time>2020-09-15T16:19:00Z</time>
        <hdop>3.216</hdop>
        <extensions>
          <speed>4.87</speed>
        </extensions>
      </trkpt>
      <trkpt lat="48.8401341" lon="2.4003646">
        <ele>56.719</ele>
        <time>2020-09-15T16:19:06Z</time>
        <hdop>3.216</hdop>
        <extensions>
          <speed>4.51</speed>
        </extensions>
      </trkpt>
      <trkpt lat="48.8399089" lon="2.4001862">
        <ele>57.907</ele>
        <time>2020-09-15T16:19:12Z</time>
        <hdop>3.216</hdop>
        <extensions>
          <speed>5.04</speed>
        </extensions>
      </trkpt>
      <trkpt lat="48.8397306" lon="2.3998354">
        <ele>56.229</ele>
        <time>2020-09-15T16:19:18Z</time>
        <hdop>3.216</hdop>
        <extensions>
          <speed>5.8</speed>
        </extensions>
      </trkpt>
      <trkpt lat="48.8396927" lon="2.3994381">
        <ele>52.662</ele>
        <time>2020-09-15T16:19:23Z</time>
        <hdop>6.432</hdop>
        <extensions>
          <speed>5.69</speed>
        </extensions>
      </trkpt>
      <trkpt lat="48.8396574" lon="2.3989174">
        <ele>51.364</ele>
        <time>2020-09-15T16:19:29Z</time>
        <hdop>6.432</hdop>
        <extensions>
          <speed>6.26</speed>
        </extensions>
      </trkpt>
      <trkpt lat="48.8396692" lon="2.3984011">
        <ele>51.471</ele>
        <time>2020-09-15T16:19:35Z</time>
        <hdop>6.432</hdop>
        <extensions>
          <speed>5.87</speed>
        </extensions>
      </trkpt>
      <trkpt lat="48.839648" lon="2.3979129">
        <ele>49.78</ele>
        <time>2020-09-15T16:19:41Z</time>
        <hdop>5.36</hdop>
        <extensions>
          <speed>5.58</speed>
        </extensions>
      </trkpt>
      <trkpt lat="48.8396395" lon="2.3975047">
        <ele>49.322</ele>
        <time>2020-09-15T16:19:46Z</time>
        <hdop>3.216</hdop>
        <extensions>
          <speed>5.72</speed>
        </extensions>
      </trkpt>
      <trkpt lat="48.8396318" lon="2.3970967">
        <ele>48.58</ele>
        <time>2020-09-15T16:19:51Z</time>
        <hdop>3.216</hdop>
        <extensions>
          <speed>6.3</speed>
        </extensions>
      </trkpt>
      <trkpt lat="48.8396765" lon="2.3966068">
        <ele>48.917</ele>
        <time>2020-09-15T16:19:57Z</time>
        <hdop>3.216</hdop>
        <extensions>
          <speed>5.66</speed>
        </extensions>
      </trkpt>
      <trkpt lat="48.8397704" lon="2.3962408">
        <ele>49.759</ele>
        <time>2020-09-15T16:20:02Z</time>
        <hdop>3.216</hdop>
        <extensions>
          <speed>5.61</speed>
        </extensions>
      </trkpt>
      <trkpt lat="48.8397919" lon="2.3957558">
        <ele>50.171</ele>
        <time>2020-09-15T16:20:08Z</time>
        <hdop>3.216</hdop>
        <extensions>
          <speed>6.24</speed>
        </extensions>
      </trkpt>
      <trkpt lat="48.8396758" lon="2.3953566">
        <ele>50.037</ele>
        <time>2020-09-15T16:20:13Z</time>
        <hdop>3.216</hdop>
        <extensions>
          <speed>6.11</speed>
        </extensions>
      </trkpt>
      <trkpt lat="48.8395429" lon="2.394894">
        <ele>49.318</ele>
        <time>2020-09-15T16:20:19Z</time>
        <hdop>3.216</hdop>
        <extensions>
          <speed>5.95</speed>
        </extensions>
      </trkpt>
      <trkpt lat="48.8394862" lon="2.3945397">
        <ele>48.433</ele>
        <time>2020-09-15T16:20:24Z</time>
        <hdop>3.216</hdop>
        <extensions>
          <speed>5.84</speed>
        </extensions>
      </trkpt>
      <trkpt lat="48.8394545" lon="2.3940707">
        <ele>47.845</ele>
        <time>2020-09-15T16:20:30Z</time>
        <hdop>3.216</hdop>
        <extensions>
          <speed>6.03</speed>
        </extensions>
      </trkpt>
      <trkpt lat="48.8394125" lon="2.3936123">
        <ele>50.707</ele>
        <time>2020-09-15T16:20:35Z</time>
        <hdop>3.216</hdop>
        <extensions>
          <speed>6.99</speed>
        </extensions>
      </trkpt>
      <trkpt lat="48.839347" lon="2.3930551">
        <ele>51.759</ele>
        <time>2020-09-15T16:20:41Z</time>
        <hdop>3.216</hdop>
        <extensions>
          <speed>6.99</speed>
        </extensions>
      </trkpt>
      <trkpt lat="48.8392873" lon="2.3926702">
        <ele>54.16</ele>
        <time>2020-09-15T16:20:46Z</time>
        <hdop>3.216</hdop>
        <extensions>
          <speed>4.72</speed>
        </extensions>
      </trkpt>
      <trkpt lat="48.8392876" lon="2.3922555">
        <ele>52.2</ele>
        <time>2020-09-15T16:20:52Z</time>
        <hdop>3.216</hdop>
        <extensions>
          <speed>6.61</speed>
        </extensions>
      </trkpt>
      <trkpt lat="48.8392571" lon="2.3917072">
        <ele>50.767</ele>
        <time>2020-09-15T16:20:58Z</time>
        <hdop>3.216</hdop>
        <extensions>
          <speed>7.09</speed>
        </extensions>
      </trkpt>
      <trkpt lat="48.8392033" lon="2.3911093">
        <ele>50.151</ele>
        <time>2020-09-15T16:21:04Z</time>
        <hdop>3.216</hdop>
        <extensions>
          <speed>7.41</speed>
        </extensions>
      </trkpt>
      <trkpt lat="48.839167" lon="2.3904907">
        <ele>49.326</ele>
        <time>2020-09-15T16:21:10Z</time>
        <hdop>3.216</hdop>
        <extensions>
          <speed>7.8</speed>
        </extensions>
      </trkpt>
      <trkpt lat="48.8391072" lon="2.3899234">
        <ele>47.149</ele>
        <time>2020-09-15T16:21:16Z</time>
        <hdop>3.216</hdop>
        <extensions>
          <speed>7.03</speed>
        </extensions>
      </trkpt>
      <trkpt lat="48.8390564" lon="2.389414">
        <ele>44.934</ele>
        <time>2020-09-15T16:21:22Z</time>
        <hdop>3.216</hdop>
        <extensions>
          <speed>5.26</speed>
        </extensions>
      </trkpt>
      <trkpt lat="48.839023" lon="2.3889627">
        <ele>41.058</ele>
        <time>2020-09-15T16:21:28Z</time>
        <hdop>3.216</hdop>
        <extensions>
          <speed>6.77</speed>
        </extensions>
      </trkpt>
      <trkpt lat="48.8389992" lon="2.3884109">
        <ele>39.93</ele>
        <time>2020-09-15T16:21:34Z</time>
        <hdop>3.216</hdop>
        <extensions>
          <speed>5.79</speed>
        </extensions>
      </trkpt>
      <trkpt lat="48.8390944" lon="2.3879042">
        <ele>39.525</ele>
        <time>2020-09-15T16:21:40Z</time>
        <hdop>3.216</hdop>
        <extensions>
          <speed>5.27</speed>
        </extensions>
      </trkpt>
      <trkpt lat="48.8391639" lon="2.3875498">
        <ele>38.396</ele>
        <time>2020-09-15T16:21:45Z</time>
        <hdop>3.216</hdop>
        <extensions>
          <speed>6.2</speed>
        </extensions>
      </trkpt>
      <trkpt lat="48.8392341" lon="2.3871749">
        <ele>38.999</ele>
        <time>2020-09-15T16:21:50Z</time>
        <hdop>4.288</hdop>
        <extensions>
          <speed>4.55</speed>
        </extensions>
      </trkpt>
      <trkpt lat="48.839355" lon="2.3866389">
        <ele>39.557</ele>
        <time>2020-09-15T16:21:56Z</time>
        <hdop>5.36</hdop>
        <extensions>
          <speed>8.17</speed>
        </extensions>
      </trkpt>
      <trkpt lat="48.83948" lon="2.3862855">
        <ele>38.118</ele>
        <time>2020-09-15T16:22:01Z</time>
        <hdop>12.864</hdop>
        <extensions>
          <speed>5.5</speed>
        </extensions>
      </trkpt>
      <trkpt lat="48.8395756" lon="2.3858224">
        <ele>30.775</ele>
        <time>2020-09-15T16:22:07Z</time>
        <hdop>9.648</hdop>
        <extensions>
          <speed>5.47</speed>
        </extensions>
      </trkpt>
      <trkpt lat="48.8396783" lon="2.3852001">
        <ele>27.831</ele>
        <time>2020-09-15T16:22:12Z</time>
        <hdop>10.72</hdop>
        <extensions>
          <speed>9.73</speed>
        </extensions>
      </trkpt>
      <trkpt lat="48.839754" lon="2.3842999">
        <ele>30.369</ele>
        <time>2020-09-15T16:22:18Z</time>
        <hdop>4.288</hdop>
        <extensions>
          <speed>8.48</speed>
        </extensions>
      </trkpt>
      <trkpt lat="48.839861" lon="2.3837212">
        <ele>33.029</ele>
        <time>2020-09-15T16:22:23Z</time>
        <hdop>3.216</hdop>
        <extensions>
          <speed>8.17</speed>
        </extensions>
      </trkpt>
      <trkpt lat="48.8398498" lon="2.3827682">
        <ele>33.002</ele>
        <time>2020-09-15T16:22:32Z</time>
        <hdop>15.008</hdop>
        <extensions>
          <speed>8.3</speed>
        </extensions>
      </trkpt>
      <trkpt lat="48.8399967" lon="2.3824879">
        <ele>31.286</ele>
        <time>2020-09-15T16:22:38Z</time>
        <hdop>3.216</hdop>
        <extensions>
          <speed>5.48</speed>
        </extensions>
      </trkpt>
      <trkpt lat="48.840085" lon="2.3820171">
        <ele>31.773</ele>
        <time>2020-09-15T16:22:44Z</time>
        <hdop>3.216</hdop>
        <extensions>
          <speed>6.32</speed>
        </extensions>
      </trkpt>
      <trkpt lat="48.8401533" lon="2.3816085">
        <ele>32.612</ele>
        <time>2020-09-15T16:22:49Z</time>
        <hdop>3.216</hdop>
        <extensions>
          <speed>6.13</speed>
        </extensions>
      </trkpt>
      <trkpt lat="48.8402196" lon="2.3811147">
        <ele>34.451</ele>
        <time>2020-09-15T16:22:55Z</time>
        <hdop>3.216</hdop>
        <extensions>
          <speed>6.12</speed>
        </extensions>
      </trkpt>
      <trkpt lat="48.8402865" lon="2.3806343">
        <ele>35.922</ele>
        <time>2020-09-15T16:23:01Z</time>
        <hdop>3.216</hdop>
        <extensions>
          <speed>5.98</speed>
        </extensions>
      </trkpt>
      <trkpt lat="48.8403675" lon="2.3801946">
        <ele>36.619</ele>
        <time>2020-09-15T16:23:07Z</time>
        <hdop>3.216</hdop>
        <extensions>
          <speed>5.1</speed>
        </extensions>
      </trkpt>
      <trkpt lat="48.8404357" lon="2.3798532">
        <ele>36.045</ele>
        <time>2020-09-15T16:23:12Z</time>
        <hdop>3.216</hdop>
        <extensions>
          <speed>5.5</speed>
        </extensions>
      </trkpt>
      <trkpt lat="48.8404994" lon="2.3793754">
        <ele>36.127</ele>
        <time>2020-09-15T16:23:18Z</time>
        <hdop>3.216</hdop>
        <extensions>
          <speed>5.85</speed>
        </extensions>
      </trkpt>
      <trkpt lat="48.8403993" lon="2.3789257">
        <ele>37.481</ele>
        <time>2020-09-15T16:23:24Z</time>
        <hdop>3.216</hdop>
        <extensions>
          <speed>5.9</speed>
        </extensions>
      </trkpt>
      <trkpt lat="48.840247" lon="2.378563">
        <ele>37.067</ele>
        <time>2020-09-15T16:23:29Z</time>
        <hdop>3.216</hdop>
        <extensions>
          <speed>6.81</speed>
        </extensions>
      </trkpt>
      <trkpt lat="48.8400321" lon="2.3781426">
        <ele>36.143</ele>
        <time>2020-09-15T16:23:35Z</time>
        <hdop>3.216</hdop>
        <extensions>
          <speed>6.74</speed>
        </extensions>
      </trkpt>
      <trkpt lat="48.8398477" lon="2.3777945">
        <ele>34.031</ele>
        <time>2020-09-15T16:23:40Z</time>
        <hdop>3.216</hdop>
        <extensions>
          <speed>6.34</speed>
        </extensions>
      </trkpt>
      <trkpt lat="48.8396651" lon="2.3774693">
        <ele>33.804</ele>
        <time>2020-09-15T16:23:45Z</time>
        <hdop>3.216</hdop>
        <extensions>
          <speed>6.24</speed>
        </extensions>
      </trkpt>
      <trkpt lat="48.839452" lon="2.3770722">
        <ele>34.708</ele>
        <time>2020-09-15T16:23:51Z</time>
        <hdop>3.216</hdop>
        <extensions>
          <speed>5.82</speed>
        </extensions>
      </trkpt>
      <trkpt lat="48.839305" lon="2.3767744">
        <ele>35.031</ele>
        <time>2020-09-15T16:23:56Z</time>
        <hdop>3.216</hdop>
        <extensions>
          <speed>5.38</speed>
        </extensions>
      </trkpt>
      <trkpt lat="48.8391213" lon="2.3764381">
        <ele>34.714</ele>
        <time>2020-09-15T16:24:02Z</time>
        <hdop>3.216</hdop>
        <extensions>
          <speed>5.52</speed>
        </extensions>
      </trkpt>
      <trkpt lat="48.838968" lon="2.376166">
        <ele>34.641</ele>
        <time>2020-09-15T16:24:07Z</time>
        <hdop>3.216</hdop>
        <extensions>
          <speed>5.58</speed>
        </extensions>
      </trkpt>
      <trkpt lat="48.8387808" lon="2.3758461">
        <ele>34.911</ele>
        <time>2020-09-15T16:24:13Z</time>
        <hdop>3.216</hdop>
        <extensions>
          <speed>5.19</speed>
        </extensions>
      </trkpt>
      <trkpt lat="48.8386274" lon="2.3756082">
        <ele>35.529</ele>
        <time>2020-09-15T16:24:18Z</time>
        <hdop>3.216</hdop>
        <extensions>
          <speed>5.21</speed>
        </extensions>
      </trkpt>
      <trkpt lat="48.8384496" lon="2.375281">
        <ele>35.6</ele>
        <time>2020-09-15T16:24:24Z</time>
        <hdop>3.216</hdop>
        <extensions>
          <speed>5.18</speed>
        </extensions>
      </trkpt>
      <trkpt lat="48.8382982" lon="2.3750118">
        <ele>35.269</ele>
        <time>2020-09-15T16:24:29Z</time>
        <hdop>3.216</hdop>
        <extensions>
          <speed>4.72</speed>
        </extensions>
      </trkpt>
      <trkpt lat="48.8381376" lon="2.3747158">
        <ele>35.861</ele>
        <time>2020-09-15T16:24:35Z</time>
        <hdop>3.216</hdop>
        <extensions>
          <speed>4.65</speed>
        </extensions>
      </trkpt>
      <trkpt lat="48.8379632" lon="2.3744056">
        <ele>36.282</ele>
        <time>2020-09-15T16:24:41Z</time>
        <hdop>3.216</hdop>
        <extensions>
          <speed>4.83</speed>
        </extensions>
      </trkpt>
      <trkpt lat="48.8378699" lon="2.3742313">
        <ele>35.882</ele>
        <time>2020-09-15T16:24:46Z</time>
        <hdop>3.216</hdop>
        <extensions>
          <speed>2.73</speed>
        </extensions>
      </trkpt>
      <trkpt lat="48.8377998" lon="2.3740996">
        <ele>35.633</ele>
        <time>2020-09-15T16:24:51Z</time>
        <hdop>3.216</hdop>
      </trkpt>
      <trkpt lat="48.8377421" lon="2.3740108">
        <ele>35.06</ele>
        <time>2020-09-15T16:24:57Z</time>
        <hdop>3.216</hdop>
        <extensions>
          <speed>1.68</speed>
        </extensions>
      </trkpt>
      <trkpt lat="48.8376358" lon="2.3738034">
        <ele>37.177</ele>
        <time>2020-09-15T16:25:02Z</time>
        <hdop>3.216</hdop>
        <extensions>
          <speed>4.71</speed>
        </extensions>
      </trkpt>
      <trkpt lat="48.8374821" lon="2.3734206">
        <ele>38.22</ele>
        <time>2020-09-15T16:25:08Z</time>
        <hdop>3.216</hdop>
        <extensions>
          <speed>5.7</speed>
        </extensions>
      </trkpt>
      <trkpt lat="48.8373527" lon="2.373109">
        <ele>39.219</ele>
        <time>2020-09-15T16:25:13Z</time>
        <hdop>3.216</hdop>
        <extensions>
          <speed>5.2</speed>
        </extensions>
      </trkpt>
      <trkpt lat="48.8372079" lon="2.3728188">
        <ele>38.961</ele>
        <time>2020-09-15T16:25:18Z</time>
        <hdop>3.216</hdop>
        <extensions>
          <speed>5.31</speed>
        </extensions>
      </trkpt>
      <trkpt lat="48.8370309" lon="2.3724648">
        <ele>39.257</ele>
        <time>2020-09-15T16:25:24Z</time>
        <hdop>3.216</hdop>
        <extensions>
          <speed>5.37</speed>
        </extensions>
      </trkpt>
      <trkpt lat="48.8368863" lon="2.3721818">
        <ele>38.761</ele>
        <time>2020-09-15T16:25:29Z</time>
        <hdop>3.216</hdop>
        <extensions>
          <speed>5.15</speed>
        </extensions>
      </trkpt>
      <trkpt lat="48.8367489" lon="2.3719312">
        <ele>38.038</ele>
        <time>2020-09-15T16:25:34Z</time>
        <hdop>3.216</hdop>
        <extensions>
          <speed>4.09</speed>
        </extensions>
      </trkpt>
      <trkpt lat="48.8366119" lon="2.3716902">
        <ele>39.265</ele>
        <time>2020-09-15T16:25:40Z</time>
        <hdop>4.288</hdop>
        <extensions>
          <speed>3.7</speed>
        </extensions>
      </trkpt>
      <trkpt lat="48.8365203" lon="2.3715063">
        <ele>40.869</ele>
        <time>2020-09-15T16:25:45Z</time>
        <hdop>3.216</hdop>
        <extensions>
          <speed>2.93</speed>
        </extensions>
      </trkpt>
      <trkpt lat="48.8364534" lon="2.3713913">
        <ele>42.122</ele>
        <time>2020-09-15T16:25:51Z</time>
        <hdop>3.216</hdop>
        <extensions>
          <speed>0.59</speed>
        </extensions>
      </trkpt>
      <trkpt lat="48.8364369" lon="2.3713583">
        <ele>42.363</ele>
        <time>2020-09-15T16:25:56Z</time>
        <hdop>3.216</hdop>
        <extensions>
          <speed>1.98</speed>
        </extensions>
      </trkpt>
      <trkpt lat="48.8363159" lon="2.3712538">
        <ele>44.188</ele>
        <time>2020-09-15T16:26:02Z</time>
        <hdop>3.216</hdop>
        <extensions>
          <speed>2.9</speed>
        </extensions>
      </trkpt>
      <trkpt lat="48.8362092" lon="2.3710978">
        <ele>46.226</ele>
        <time>2020-09-15T16:26:07Z</time>
        <hdop>3.216</hdop>
        <extensions>
          <speed>3.74</speed>
        </extensions>
      </trkpt>
      <trkpt lat="48.8360737" lon="2.3708252">
        <ele>46.049</ele>
        <time>2020-09-15T16:26:13Z</time>
        <hdop>3.216</hdop>
        <extensions>
          <speed>4.71</speed>
        </extensions>
      </trkpt>
      <trkpt lat="48.835938" lon="2.370531">
        <ele>46.034</ele>
        <time>2020-09-15T16:26:18Z</time>
        <hdop>3.216</hdop>
        <extensions>
          <speed>5.75</speed>
        </extensions>
      </trkpt>
      <trkpt lat="48.8357546" lon="2.3700995">
        <ele>43.602</ele>
        <time>2020-09-15T16:26:24Z</time>
        <hdop>3.216</hdop>
        <extensions>
          <speed>6.15</speed>
        </extensions>
      </trkpt>
      <trkpt lat="48.8355926" lon="2.3696218">
        <ele>39.844</ele>
        <time>2020-09-15T16:26:30Z</time>
        <hdop>3.216</hdop>
        <extensions>
          <speed>7.19</speed>
        </extensions>
      </trkpt>
      <trkpt lat="48.8354665" lon="2.3692202">
        <ele>39.059</ele>
        <time>2020-09-15T16:26:35Z</time>
        <hdop>3.216</hdop>
        <extensions>
          <speed>5.9</speed>
        </extensions>
      </trkpt>
      <trkpt lat="48.8353409" lon="2.3688273">
        <ele>39.048</ele>
        <time>2020-09-15T16:26:41Z</time>
        <hdop>3.216</hdop>
        <extensions>
          <speed>5.26</speed>
        </extensions>
      </trkpt>
      <trkpt lat="48.8352519" lon="2.3685555">
        <ele>39.073</ele>
        <time>2020-09-15T16:26:46Z</time>
        <hdop>3.216</hdop>
        <extensions>
          <speed>4.23</speed>
        </extensions>
      </trkpt>
      <trkpt lat="48.8351712" lon="2.3682632">
        <ele>40.657</ele>
        <time>2020-09-15T16:26:52Z</time>
        <hdop>3.216</hdop>
        <extensions>
          <speed>3.75</speed>
        </extensions>
      </trkpt>
      <trkpt lat="48.8350929" lon="2.3680395">
        <ele>42.002</ele>
        <time>2020-09-15T16:26:57Z</time>
        <hdop>3.216</hdop>
        <extensions>
          <speed>3.34</speed>
        </extensions>
      </trkpt>
      <trkpt lat="48.8350521" lon="2.3679042">
        <ele>42.59</ele>
        <time>2020-09-15T16:27:03Z</time>
        <hdop>3.216</hdop>
        <extensions>
          <speed>0.45</speed>
        </extensions>
      </trkpt>
      <trkpt lat="48.8350602" lon="2.3679017">
        <ele>45.32</ele>
        <time>2020-09-15T16:27:08Z</time>
        <hdop>3.216</hdop>
      </trkpt>
      <trkpt lat="48.8351206" lon="2.3678469">
        <ele>47.275</ele>
        <time>2020-09-15T16:27:14Z</time>
        <hdop>3.216</hdop>
        <extensions>
          <speed>2.53</speed>
        </extensions>
      </trkpt>
      <trkpt lat="48.8352969" lon="2.3676944">
        <ele>49.73</ele>
        <time>2020-09-15T16:27:19Z</time>
        <hdop>4.288</hdop>
        <extensions>
          <speed>4.07</speed>
        </extensions>
      </trkpt>
      <trkpt lat="48.8354886" lon="2.3675021">
        <ele>47.942</ele>
        <time>2020-09-15T16:27:25Z</time>
        <hdop>4.288</hdop>
        <extensions>
          <speed>1.72</speed>
        </extensions>
      </trkpt>
      <trkpt lat="48.8355529" lon="2.3674601">
        <ele>48.406</ele>
        <time>2020-09-15T16:27:30Z</time>
        <hdop>3.216</hdop>
        <extensions>
          <speed>1.73</speed>
        </extensions>
      </trkpt>
      <trkpt lat="48.835749" lon="2.36736">
        <ele>47.628</ele>
        <time>2020-09-15T16:27:36Z</time>
        <hdop>3.216</hdop>
        <extensions>
          <speed>5.08</speed>
        </extensions>
      </trkpt>
      <trkpt lat="48.8359959" lon="2.3672391">
        <ele>47.169</ele>
        <time>2020-09-15T16:27:41Z</time>
        <hdop>3.216</hdop>
        <extensions>
          <speed>5.83</speed>
        </extensions>
      </trkpt>
      <trkpt lat="48.8362446" lon="2.3670839">
        <ele>46.025</ele>
        <time>2020-09-15T16:27:46Z</time>
        <hdop>3.216</hdop>
        <extensions>
          <speed>5.9</speed>
        </extensions>
      </trkpt>
      <trkpt lat="48.8365454" lon="2.3668734">
        <ele>45.698</ele>
        <time>2020-09-15T16:27:52Z</time>
        <hdop>3.216</hdop>
        <extensions>
          <speed>5.92</speed>
        </extensions>
      </trkpt>
      <trkpt lat="48.8367954" lon="2.3666584">
        <ele>43.969</ele>
        <time>2020-09-15T16:27:57Z</time>
        <hdop>3.216</hdop>
        <extensions>
          <speed>6.51</speed>
        </extensions>
      </trkpt>
      <trkpt lat="48.8370717" lon="2.366432">
        <ele>44.943</ele>
        <time>2020-09-15T16:28:03Z</time>
        <hdop>3.216</hdop>
        <extensions>
          <speed>5.69</speed>
        </extensions>
      </trkpt>
      <trkpt lat="48.8372713" lon="2.3662678">
        <ele>47.865</ele>
        <time>2020-09-15T16:28:08Z</time>
        <hdop>3.216</hdop>
        <extensions>
          <speed>4.41</speed>
        </extensions>
      </trkpt>
      <trkpt lat="48.8374274" lon="2.3666462">
        <ele>44.312</ele>
        <time>2020-09-15T16:28:14Z</time>
        <hdop>3.216</hdop>
        <extensions>
          <speed>4.01</speed>
        </extensions>
      </trkpt>
      <trkpt lat="48.8375616" lon="2.3667636">
        <ele>40.88</ele>
        <time>2020-09-15T16:28:19Z</time>
        <hdop>3.216</hdop>
        <extensions>
          <speed>2.02</speed>
        </extensions>
      </trkpt>
      <trkpt lat="48.8376996" lon="2.3666839">
        <ele>40.619</ele>
        <time>2020-09-15T16:28:25Z</time>
        <hdop>3.216</hdop>
        <extensions>
          <speed>2.22</speed>
        </extensions>
      </trkpt>
      <trkpt lat="48.8378027" lon="2.3666146">
        <ele>40.534</ele>
        <time>2020-09-15T16:28:30Z</time>
        <hdop>4.288</hdop>
        <extensions>
          <speed>1.53</speed>
        </extensions>
      </trkpt>
      <trkpt lat="48.8378378" lon="2.3665397">
        <ele>43.114</ele>
        <time>2020-09-15T16:28:36Z</time>
        <hdop>4.288</hdop>
      </trkpt>
      <trkpt lat="48.8378776" lon="2.3664716">
        <ele>45.291</ele>
        <time>2020-09-15T16:28:42Z</time>
        <hdop>5.36</hdop>
        <extensions>
          <speed>1.25</speed>
        </extensions>
      </trkpt>
      <trkpt lat="48.8378595" lon="2.366365">
        <ele>47.494</ele>
        <time>2020-09-15T16:28:47Z</time>
        <hdop>4.288</hdop>
      </trkpt>
      <trkpt lat="48.8378317" lon="2.3663581">
        <ele>47.582</ele>
        <time>2020-09-15T16:28:53Z</time>
        <hdop>3.216</hdop>
      </trkpt>
      <trkpt lat="48.8378317" lon="2.3663498">
        <ele>47.527</ele>
        <time>2020-09-15T16:28:58Z</time>
        <hdop>3.216</hdop>
      </trkpt>
      <trkpt lat="48.8378309" lon="2.3663497">
        <ele>47.482</ele>
        <time>2020-09-15T16:29:04Z</time>
        <hdop>3.216</hdop>
      </trkpt>
      <trkpt lat="48.8378312" lon="2.3663495">
        <ele>47.467</ele>
        <time>2020-09-15T16:29:09Z</time>
        <hdop>3.216</hdop>
      </trkpt>
      <trkpt lat="48.8378312" lon="2.3663496">
        <ele>47.447</ele>
        <time>2020-09-15T16:29:15Z</time>
        <hdop>3.216</hdop>
      </trkpt>
      <trkpt lat="48.8378313" lon="2.3663493">
        <ele>47.413</ele>
        <time>2020-09-15T16:29:20Z</time>
        <hdop>3.216</hdop>
      </trkpt>
      <trkpt lat="48.8378391" lon="2.3663364">
        <ele>46.179</ele>
        <time>2020-09-15T16:29:26Z</time>
        <hdop>4.288</hdop>
        <extensions>
          <speed>0.41</speed>
        </extensions>
      </trkpt>
      <trkpt lat="48.8378542" lon="2.3662911">
        <ele>45.335</ele>
        <time>2020-09-15T16:29:31Z</time>
        <hdop>3.216</hdop>
      </trkpt>
      <trkpt lat="48.8378448" lon="2.3662809">
        <ele>44.289</ele>
        <time>2020-09-15T16:29:37Z</time>
        <hdop>3.216</hdop>
      </trkpt>
      <trkpt lat="48.8378397" lon="2.3662811">
        <ele>43.714</ele>
        <time>2020-09-15T16:29:43Z</time>
        <hdop>10.72</hdop>
      </trkpt>
      <trkpt lat="48.8378445" lon="2.36628">
        <ele>45.761</ele>
        <time>2020-09-15T16:29:49Z</time>
        <hdop>9.648</hdop>
      </trkpt>
      <trkpt lat="48.8378445" lon="2.3662696">
        <ele>47.047</ele>
        <time>2020-09-15T16:29:55Z</time>
        <hdop>9.648</hdop>
      </trkpt>
      <trkpt lat="48.8378421" lon="2.3662767">
        <ele>47.467</ele>
        <time>2020-09-15T16:30:01Z</time>
        <hdop>9.648</hdop>
      </trkpt>
    </trkseg>
  </trk>
</gpx>