{
	"id": "3be60424-b3e2-4586-97a3-d7d6314b3703",
	"name": "Symfony Dummy Stage",
	"values": [
		{
			"key": "baseUrl",
			"value": "symfony3.basit.me",
			"enabled": true
		}
	],
	"_postman_variable_scope": "environment",
	"_postman_exported_at": "2019-08-09T14:51:48.181Z",
	"_postman_exported_using": "Postman/7.2.2"
}
