<?xml version="1.0" standalone="no"?>
<!DOCTYPE svg PUBLIC "-//W3C//DTD SVG 20010904//EN"
 "http://www.w3.org/TR/2001/REC-SVG-20010904/DTD/svg10.dtd">
<svg version="1.0" xmlns="http://www.w3.org/2000/svg"
 width="500.000000pt" height="500.000000pt" viewBox="0 0 500.000000 500.000000"
 preserveAspectRatio="xMidYMid meet">
<metadata>
Created by potrace 1.11, written by Peter Selinger 2001-2013
</metadata>
<g transform="translate(0.000000,500.000000) scale(0.100000,-0.100000)"
fill="#000000" stroke="none">
<path d="M2281 4465 c-56 -13 -103 -35 -75 -35 5 0 20 -9 33 -19 l23 -18 -66
-23 c-36 -13 -66 -28 -66 -32 0 -5 11 -26 25 -46 l25 -36 -23 -13 c-31 -17
-31 -17 -61 28 l-27 40 -33 -19 c-28 -17 -46 -18 -135 -14 -81 4 -105 2 -112
-9 -25 -40 1 -227 44 -322 l24 -52 17 34 c17 32 17 35 -3 81 -26 60 -26 60 0
60 15 0 19 4 15 15 -3 8 -9 21 -12 29 -3 9 4 16 21 20 26 7 26 8 11 31 -9 13
-16 27 -16 30 0 14 109 3 149 -16 l45 -20 -35 -30 -34 -29 48 31 c130 85 270
101 423 48 112 -38 194 -37 248 4 l33 26 12 -26 c7 -15 25 -43 42 -64 34 -44
28 -49 -59 -49 -31 0 -88 -7 -127 -16 -93 -20 -173 -20 -270 1 -91 19 -334 23
-377 7 -14 -6 -38 -27 -53 -46 -26 -35 -27 -38 -15 -84 18 -73 31 -92 75 -115
35 -19 56 -22 180 -22 184 0 205 9 255 113 34 72 35 73 70 70 33 -3 37 -8 70
-73 50 -100 73 -110 250 -110 188 0 233 21 255 122 9 44 20 48 43 18 11 -14
22 -25 25 -25 12 0 57 122 66 180 12 73 14 150 5 174 -8 21 -138 22 -203 2
-33 -9 -52 -10 -73 -2 -26 10 -31 8 -52 -19 -21 -26 -26 -28 -50 -17 -25 11
-25 12 -8 41 16 28 16 30 -2 50 -34 38 -150 111 -211 133 -77 28 -241 34 -334
13z m829 -270 c0 -3 -7 -17 -16 -30 -15 -23 -15 -24 11 -31 17 -4 24 -11 21
-20 -3 -8 -9 -21 -12 -29 -4 -11 0 -15 16 -15 23 0 22 -17 -7 -74 l-15 -29
-59 66 c-33 37 -76 80 -96 96 l-37 30 45 20 c40 19 149 30 149 16z m-738 -173
c34 -14 40 -36 25 -96 -19 -76 -44 -90 -178 -94 -205 -8 -249 12 -257 115 -5
65 -2 70 52 84 43 11 325 4 358 -9z m646 -1 c18 -10 22 -20 22 -61 0 -61 -14
-94 -49 -111 -35 -17 -254 -24 -309 -9 -54 14 -82 56 -82 121 0 42 3 48 28 57
43 18 78 20 227 18 87 -1 149 -7 163 -15z"/>
<path d="M1725 3466 c-16 -7 -35 -24 -42 -37 -7 -15 -13 -109 -17 -251 l-5
-228 109 0 110 0 -6 223 c-3 122 -10 234 -16 249 -9 25 -61 58 -90 58 -7 -1
-26 -7 -43 -14z"/>
<path d="M3184 3464 c-17 -8 -36 -25 -42 -37 -6 -12 -13 -122 -16 -249 l-5
-228 109 0 109 0 -6 233 c-7 253 -10 267 -65 286 -40 14 -47 14 -84 -5z"/>
<path d="M1980 2669 c0 -587 3 -812 12 -841 17 -59 48 -78 124 -78 l64 0 0
-530 0 -531 113 3 112 3 3 528 2 527 90 0 90 0 2 -527 3 -528 113 -3 112 -3 0
531 0 530 64 0 c70 0 83 7 114 63 16 29 17 97 20 845 2 675 0 812 -11 812 -17
0 -50 -35 -132 -145 -37 -49 -71 -94 -75 -98 -4 -5 7 34 25 85 47 134 51 158
28 158 -14 0 -29 -30 -72 -149 l-53 -149 -36 10 c-20 6 -68 7 -106 4 -39 -4
-82 -6 -96 -5 -14 1 -70 1 -125 1 l-101 1 -38 111 c-54 159 -62 176 -85 176
-18 0 -17 -9 25 -132 24 -73 44 -134 44 -137 0 -2 -19 22 -41 55 -78 110 -165
214 -181 214 -4 0 -8 -361 -8 -801z m500 376 c0 -8 -4 -15 -10 -15 -5 0 -10 7
-10 15 0 8 5 15 10 15 6 0 10 -7 10 -15z m237 -10 c1 0 -7 -6 -17 -13 -18 -11
-20 -9 -18 12 2 21 5 23 18 13 8 -6 16 -12 17 -12z m-404 -18 c-3 -5 -9 -3
-14 4 -4 7 -5 17 -2 22 3 5 9 3 14 -4 4 -7 5 -17 2 -22z m205 -114 c-2 -10
-12 -18 -23 -18 -11 0 -21 8 -23 18 -3 13 3 17 23 17 20 0 26 -4 23 -17z"/>
<path d="M2121 523 c3 -33 -1 -36 -21 -18 -20 19 -29 8 -9 -12 8 -8 7 -13 -2
-18 -7 -5 -18 0 -27 11 -13 18 -14 18 -7 -3 4 -17 2 -23 -8 -23 -9 0 -18 6
-21 13 -3 6 -3 2 0 -10 7 -28 -13 -31 -32 -5 -13 15 -14 15 -8 0 9 -27 -6 -42
-21 -21 -13 17 -14 16 -8 -4 6 -27 -12 -31 -26 -5 -10 16 -10 16 -11 0 0 -19
-26 -25 -32 -8 -5 16 -52 -13 -65 -41 -22 -45 -8 -66 50 -73 68 -8 437 -8 516
0 l61 7 0 66 c0 65 -12 137 -25 149 -3 4 -23 -3 -44 -15 -73 -42 -155 -39
-196 7 -23 26 -67 27 -64 3z"/>
<path d="M2815 520 c-23 -26 -88 -43 -128 -34 -18 3 -49 16 -69 28 -20 11 -40
18 -43 14 -13 -12 -25 -84 -25 -149 l0 -66 61 -7 c79 -8 448 -8 516 0 58 7 72
28 50 73 -13 28 -60 57 -65 41 -6 -17 -32 -11 -32 8 -1 16 -1 16 -11 0 -14
-26 -32 -22 -26 5 6 21 5 21 -8 3 -13 -17 -15 -17 -21 -3 -3 9 -3 22 1 29 4 7
0 5 -8 -4 -20 -26 -40 -23 -33 5 3 12 3 16 0 10 -3 -7 -12 -13 -21 -13 -10 0
-12 6 -8 23 7 22 7 22 -8 2 -12 -15 -19 -17 -27 -9 -8 8 -9 14 -1 18 6 4 11
12 11 18 0 6 -9 3 -20 -7 -20 -18 -24 -15 -21 18 3 24 -41 22 -64 -3z"/>
</g>
</svg>
