<svg width="175.524" height="65.813" xmlns="http://www.w3.org/2000/svg">

 <g>
  <path id="svg_4" d="m6.38624,58.51093l-1.5748,-33.4134c0.01433,0.12341 -2.19633,-20.94291 4.95581,-6.11846c7.15215,14.82445 8.84265,21.06632 8.82832,20.94291c0.01433,0.12341 4.17558,8.05579 6.38624,-0.9169c2.21066,-8.97269 23.40702,-35.37061 26.39792,-33.81015c2.9909,1.56047 1.30039,9.23277 1.30039,10.6632c0,1.43043 -7.6723,41.35241 -7.68664,41.22899" opacity="NaN" stroke="#000" fill="#fff"/>
  <path id="svg_6" d="m64.25361,18.58895c3.64109,-2.47074 11.70351,-7.41222 20.93628,-8.06242c9.23277,-0.6502 8.97269,3.64109 9.49285,4.16125c0.52016,0.52016 -4.94148,12.35371 -5.98179,13.6541c-1.04031,1.30039 -20.02601,28.73862 -20.04034,28.61521c0.01433,0.12341 -7.13781,7.27556 7.29652,3.89455c14.43433,-3.38101 18.3355,-3.77113 18.32117,-3.89455" opacity="NaN" stroke="#000" fill="#fff"/>
  <path id="svg_7" d="m108.07676,62.54214l2.97656,-0.25345" opacity="NaN" stroke="#000" fill="#fff"/>
  <path id="svg_8" d="m125.63202,57.7307l0.1157,-27.56165" opacity="NaN" stroke="#000" fill="#fff"/>
  <path id="svg_9" d="m125.8921,17.28856l-0.27442,-4.28466" opacity="NaN" stroke="#000" fill="#fff"/>
  <path id="svg_11" d="m-884.95674,-117.30949c1.56047,0 17.55527,5.20156 13.39402,19.63589c-4.16125,14.43433 -6.76203,13.91418 -6.50195,14.56437c0.26008,0.6502 -8.45254,7.41222 -10.79324,7.15215c-2.3407,-0.26008 -10.14304,-3.90117 -11.18336,-9.75293c-1.04031,-5.85176 -2.73082,-18.20546 1.04031,-21.3264c3.77113,-3.12094 12.48375,-10.27308 14.04421,-10.27308z" opacity="NaN" stroke="#000" fill="#fff"/>
  <path id="svg_16" d="m155.15088,21.44981c2.08062,0 15.60468,2.47074 15.60468,13.26398c0,10.79324 -6.24187,19.76593 -6.89207,20.41613c-0.6502,0.6502 -5.3316,8.84265 -10.79324,7.93238c-5.46164,-0.91027 -12.74382,-10.79324 -11.18336,-18.07542c1.56047,-7.28219 1.56047,-16.77503 5.07152,-21.58648c3.51105,-4.81144 10.27308,-2.9909 11.05332,-3.25098" opacity="NaN" stroke="#000" fill="#fff"/>
 </g>
</svg>
