{
    "client": {
        " host ": "10.101.53.35"
    },
    "server": {
        "current_time": "current_time",
        "services": [{
            "name": "Weather",
            "widget": [{
                "name": "city temperature",
                "description" : "Display temperature for a city ",
                "params": [{
                    "name": "city",
                    "type": "string"
                }]
            }]
        }, {
            "name": "News",
            "widget": [{
                "name": "News per city",
                "description": "get news for your city",
                "params": [{
                    "name": "city",
                    "type": "string"
                }] 
            }]
        }, {
            "name": "Wikipedia",
            "widget": [{
                "name": "Wikipedia search engine",
                "description": "Search what you want on wikipedia"
            }]
        }, {
            "name": "Spotify",
            "widget": [{
                "name": "Spotify player",
                "description": "See what you are listening to",
                "params": [{
                    "name": "token",
                    "type": "string"
                }]
            }]
        }]
    }
}