#ifndef HELP_HEADER
"        \6AleVT Online Help System       ",
"  \22`p0`0    p `0pppp                    ",
"\4\35\22\177 \177j5`p  \177 j5 j5           \7Version \34",
"\4\35\22\177,\177j5\177.! +t>! j5           \7  1.1.2 \34",
"  \22# #\42!\42#   \42   \42!                     ",
#else
HELP_HEADER
#endif
"                                        ",
"\6\15Cut & Paste:                          ",
"\6\15Cut & Paste:                          ",
"\24 ####################################  ",
"\6 AleVT supports the X11 selection      ",
"\6 protocol for text and graphics.       ",
"\6                                       ",
"\6 You may mark a rectangular area of    ",
"\6 a window with the\7left\6mouse button   ",
"\6 and paste that area into another      ",
"\6 application like xterm, xpaint, or    ",
"\6 xmag.  Unfortunately, gimp doesn't    ",
"\6 support pasting from external appli-  ",
"\6 cations.                              ",
"\6                                       ",
"\24 pppppppppppppppppppppppppppppppppppp  ",
"                                        ",
"                                        ",
"\4\35\7Back 914\13    Index 900    Next 999  \34",
"\1Page 100 \2Page 200 \3Page 300 \6Page 400\34",
