#define icon_width 64
#define icon_height 20
static unsigned char icon_bits[] = {
  0xff, 0xff, 0xff, 0xff, 0xff, 0xff, 0xff, 0xff, 0xff, 0xff, 0xff, 0xff,
  0xff, 0xff, 0xff, 0xff, 0x07, 0x78, 0xf8, 0xff, 0x87, 0x1f, 0x06, 0x80,
  0x07, 0x78, 0xf8, 0xff, 0x87, 0x1f, 0x06, 0x80, 0xe1, 0x61, 0xa8, 0xaa,
  0x86, 0x1a, 0x7a, 0xf8, 0x61, 0x61, 0xd8, 0x5f, 0x85, 0x15, 0x56, 0x58,
  0xa1, 0x61, 0x68, 0xa0, 0x86, 0x1a, 0x6a, 0xa8, 0x61, 0x61, 0x78, 0x60,
  0x85, 0x15, 0x56, 0x58, 0xa1, 0x61, 0x18, 0x86, 0x86, 0x1a, 0x6a, 0xa8,
  0x61, 0x61, 0x18, 0x86, 0x85, 0x15, 0x56, 0x58, 0xa1, 0x61, 0x18, 0x86,
  0x86, 0x1a, 0x6a, 0xa8, 0xe1, 0x61, 0x18, 0x86, 0x85, 0x1f, 0x56, 0x58,
  0x01, 0x60, 0x18, 0xe0, 0x1a, 0x86, 0x6b, 0xa8, 0x01, 0x60, 0x18, 0x60,
  0x15, 0x86, 0x55, 0x58, 0xe1, 0x61, 0x18, 0xbe, 0x6a, 0xe0, 0x6a, 0xa8,
  0x21, 0x61, 0x18, 0x7e, 0x55, 0x60, 0x55, 0x58, 0xe1, 0x61, 0x78, 0xe0,
  0xff, 0xf9, 0x7f, 0xf8, 0xe1, 0x61, 0x78, 0xe0, 0xff, 0xf9, 0x7f, 0xf8,
  0xff, 0xff, 0xff, 0xff, 0xff, 0xff, 0xff, 0xff, 0xff, 0xff, 0xff, 0xff,
  0xff, 0xff, 0xff, 0xff, };
