{
  "title":{
    "default":"Traders Club Garage",
    "ptBR": "",
    "enEN": "Traders Club Garage"
  },

  "thumbnail":{
    "default": "",
    "ptBR": "",
    "enEN": ""
  },

  "desc":{
    "default": "",
    "ptBR": "Exemplo de sistema de CRUD. Nesse caso é uma loja de carros, onde pode ser feita a adição, remoção ou alteração de um veículo.",
    "enEN": "CRUD system example. In this case is a Car Shop, when the system is able to register, remove and update a car."
  },

  "link_promo": {
    "url": "#",
    "desc": {
      "ptBR": "Veja como ficou...",
      "enEN": "See the site here..."
    }
  },

  "link": "/tc_garage",

  "styleContent": {
    "color": "#313131",
    "background": "linear-gradient(to right, rgb(255, 244, 191), rgb(247, 255, 118), rgb(255, 244, 191))"
  }
}
