{
  "projects":{
    "default":"projects",
    "ptBR": "projetos",
    "enEN": "projects"
  },
  "curriculum":{
    "default":"curriculum",
    "ptBR": "currículo",
    "enEN": "curriculum"
  },
  "contact":{
    "default":"contact",
    "ptBR": "contato",
    "enEN": "contact"
  },
  "about":{
    "default":"about",
    "ptBR": "sobre",
    "enEN": "about"
  },

  "underConstruction" : {
    "default":"Under Construction...",
    "ptBR": "Em construção...",
    "enEN": "Under Construction..."
  }
}
