(footprint "Texas_SIU0008A_MicroSiP-8_2x2.6mm_P0.6mm" (version 20221018) (generator pcbnew)
  (layer "F.Cu")
  (descr "Texas SIL0008D MicroSiP, 8 Pin")
  (tags "Texas MicroSiP NoLead")
  (attr smd)
  (fp_text reference "REF**" (at 0 -2.2 unlocked) (layer "F.SilkS")
      (effects (font (size 1 1) (thickness 0.15)))
    (tstamp 67812359-e271-4027-81a6-00f698426f5e)
  )
  (fp_text value "Texas_SIU0008A_MicroSiP-8_2x2.6mm_P0.6mm" (at 0 2.4 unlocked) (layer "F.Fab")
      (effects (font (size 1 1) (thickness 0.15)))
    (tstamp 2989164f-955d-4a9a-a5ac-08100431c59f)
  )
  (fp_text user "${REFERENCE}" (at 0 0 unlocked) (layer "F.Fab")
      (effects (font (size 1 1) (thickness 0.15)))
    (tstamp 94112326-0393-46f8-85c3-90cc9fc22819)
  )
  (fp_line (start -1 1.45) (end 1 1.45)
    (stroke (width 0.12) (type solid)) (layer "F.SilkS") (tstamp df73eb45-633b-4ad7-b3c9-dac4fe046b32))
  (fp_line (start -0.4 -1.45) (end 1 -1.45)
    (stroke (width 0.12) (type solid)) (layer "F.SilkS") (tstamp 695e72a7-6d95-4ebc-b1eb-6e67dfd87d49))
  (fp_line (start -1.2 -1.6) (end -1.2 1.6)
    (stroke (width 0.05) (type solid)) (layer "F.CrtYd") (tstamp 1b159e86-1e6b-4d48-9886-b5ae44e9fa6b))
  (fp_line (start -1.2 1.6) (end 1.3 1.6)
    (stroke (width 0.05) (type solid)) (layer "F.CrtYd") (tstamp ec1ce1ea-3162-4169-a596-2cee7d945ff5))
  (fp_line (start 1.3 -1.6) (end -1.2 -1.6)
    (stroke (width 0.05) (type solid)) (layer "F.CrtYd") (tstamp cee4408d-8226-48f3-a233-1a05cbc25329))
  (fp_line (start 1.3 1.6) (end 1.3 -1.6)
    (stroke (width 0.05) (type solid)) (layer "F.CrtYd") (tstamp 0a0bd3eb-3570-4ac9-bc44-4d6221f1b32b))
  (fp_line (start -1 -1) (end -0.7 -1.3)
    (stroke (width 0.1) (type solid)) (layer "F.Fab") (tstamp 83d6f02f-19a5-4181-af4a-367daf5ec49c))
  (fp_line (start -1 1.3) (end -1 -1)
    (stroke (width 0.1) (type solid)) (layer "F.Fab") (tstamp efed90ca-12bb-4f87-af58-663541230f85))
  (fp_line (start -0.7 -1.3) (end 1 -1.3)
    (stroke (width 0.1) (type solid)) (layer "F.Fab") (tstamp 50e728fe-d2cc-4a3d-a2ca-d3de5c349f3e))
  (fp_line (start 1 -1.3) (end 1 1.3)
    (stroke (width 0.1) (type solid)) (layer "F.Fab") (tstamp 3b3a0c1e-6b05-4df5-b2fa-5450e21ec831))
  (fp_line (start 1 1.3) (end -1 1.3)
    (stroke (width 0.1) (type solid)) (layer "F.Fab") (tstamp d19f8dc0-cf90-4c9b-bf4a-1151b3ac245c))
  (pad "1" smd roundrect (at -0.6 -0.9) (size 0.53 0.26) (layers "F.Cu" "F.Paste" "F.Mask") (roundrect_rratio 0.25) (tstamp 65609fd2-a7cc-4658-a729-754070d80b87))
  (pad "2" smd roundrect (at -0.6 -0.3) (size 0.53 0.26) (layers "F.Cu" "F.Paste" "F.Mask") (roundrect_rratio 0.25) (tstamp c92fd687-5cf2-4ef6-95d2-a9ea21772d5d))
  (pad "3" smd roundrect (at -0.6 0.3) (size 0.53 0.26) (layers "F.Cu" "F.Paste" "F.Mask") (roundrect_rratio 0.25) (tstamp be10f78a-d32d-4a54-907a-e2618359678a))
  (pad "4" smd roundrect (at -0.6 0.9) (size 0.53 0.26) (layers "F.Cu" "F.Paste" "F.Mask") (roundrect_rratio 0.25) (tstamp e8c53717-de3f-4bf2-91c0-2cc7d0262463))
  (pad "5" smd roundrect (at 0.6 0.9) (size 0.53 0.26) (layers "F.Cu" "F.Paste" "F.Mask") (roundrect_rratio 0.25) (tstamp ae47044a-bb51-46ad-bf37-813c2ac07e80))
  (pad "6" smd roundrect (at 0.6 0.3) (size 0.53 0.26) (layers "F.Cu" "F.Paste" "F.Mask") (roundrect_rratio 0.25) (tstamp 04236655-41c3-4753-b1e1-7883f975cdf4))
  (pad "7" smd roundrect (at 0.6 -0.3) (size 0.53 0.26) (layers "F.Cu" "F.Paste" "F.Mask") (roundrect_rratio 0.25) (tstamp d5f023f6-a0f9-4554-a912-c19aa0a50da2))
  (pad "8" smd roundrect (at 0.6 -0.9) (size 0.53 0.26) (layers "F.Cu" "F.Paste" "F.Mask") (roundrect_rratio 0.25) (tstamp b683c239-fe3d-49c7-8e33-0e14fb769e6b))
  (model "${KIPRJMOD}/Texas_uSIP.pretty/Texas_SIU0008A_MicroSiP-8_2x2.6mm_P0.6mm.step"
    (offset (xyz 0 0 0))
    (scale (xyz 1 1 1))
    (rotate (xyz 0 0 0))
  )
)
