ISO-10303-21;
HEADER;
/* Generated by software containing ST-Developer
 * from STEP Tools, Inc. (www.steptools.com) 
 */

FILE_DESCRIPTION(
/* description */ (''),
/* implementation_level */ '2;1');

FILE_NAME(
/* name */ 'asdfsad.step',
/* time_stamp */ '2024-01-28T21:03:01+01:00',
/* author */ (''),
/* organization */ (''),
/* preprocessor_version */ 'ST-DEVELOPER v20',
/* originating_system */ 'Autodesk Translation Framework v12.14.0.127',

/* authorisation */ '');

FILE_SCHEMA (('AUTOMOTIVE_DESIGN { 1 0 10303 214 3 1 1 }'));
ENDSEC;

DATA;
#10=MECHANICAL_DESIGN_GEOMETRIC_PRESENTATION_REPRESENTATION('',(#18,#19,
#20,#21,#22,#23,#24,#25,#26,#27,#28,#29,#30,#31,#32,#33,#34,#35),#2070);
#11=SHAPE_REPRESENTATION_RELATIONSHIP('SRR','None',#2077,#12);
#12=ADVANCED_BREP_SHAPE_REPRESENTATION('',(#36,#37,#38,#39,#40,#41,#42,
#43,#44,#45,#46,#47),#2069);
#13=FACE_BOUND('',#203,.T.);
#14=FACE_BOUND('',#204,.T.);
#15=CIRCLE('',#1376,0.0750000000000001);
#16=CIRCLE('',#1377,0.0750000000000001);
#17=CYLINDRICAL_SURFACE('',#1375,0.0750000000000001);
#18=STYLED_ITEM('',(#2087),#36);
#19=STYLED_ITEM('',(#2087),#37);
#20=STYLED_ITEM('',(#2087),#38);
#21=STYLED_ITEM('',(#2087),#39);
#22=STYLED_ITEM('',(#2087),#40);
#23=STYLED_ITEM('',(#2087),#41);
#24=STYLED_ITEM('',(#2087),#42);
#25=STYLED_ITEM('',(#2088),#43);
#26=STYLED_ITEM('',(#2088),#44);
#27=STYLED_ITEM('',(#2087),#45);
#28=STYLED_ITEM('',(#2087),#46);
#29=STYLED_ITEM('',(#2088),#1271);
#30=STYLED_ITEM('',(#2090),#1278);
#31=STYLED_ITEM('',(#2090),#1279);
#32=STYLED_ITEM('',(#2090),#1280);
#33=STYLED_ITEM('',(#2090),#1281);
#34=STYLED_ITEM('',(#2090),#1282);
#35=STYLED_ITEM('',(#2089),#47);
#36=MANIFOLD_SOLID_BREP('Body1',#1283);
#37=MANIFOLD_SOLID_BREP('Body2',#1284);
#38=MANIFOLD_SOLID_BREP('Body3',#1285);
#39=MANIFOLD_SOLID_BREP('Body4',#1286);
#40=MANIFOLD_SOLID_BREP('Body5',#1287);
#41=MANIFOLD_SOLID_BREP('Body6',#1288);
#42=MANIFOLD_SOLID_BREP('Body7',#1289);
#43=MANIFOLD_SOLID_BREP('Body8',#1290);
#44=MANIFOLD_SOLID_BREP('Body9',#1291);
#45=MANIFOLD_SOLID_BREP('Body10',#1292);
#46=MANIFOLD_SOLID_BREP('Body11',#1293);
#47=MANIFOLD_SOLID_BREP('Body12',#1294);
#48=FACE_OUTER_BOUND('',#128,.T.);
#49=FACE_OUTER_BOUND('',#129,.T.);
#50=FACE_OUTER_BOUND('',#130,.T.);
#51=FACE_OUTER_BOUND('',#131,.T.);
#52=FACE_OUTER_BOUND('',#132,.T.);
#53=FACE_OUTER_BOUND('',#133,.T.);
#54=FACE_OUTER_BOUND('',#134,.T.);
#55=FACE_OUTER_BOUND('',#135,.T.);
#56=FACE_OUTER_BOUND('',#136,.T.);
#57=FACE_OUTER_BOUND('',#137,.T.);
#58=FACE_OUTER_BOUND('',#138,.T.);
#59=FACE_OUTER_BOUND('',#139,.T.);
#60=FACE_OUTER_BOUND('',#140,.T.);
#61=FACE_OUTER_BOUND('',#141,.T.);
#62=FACE_OUTER_BOUND('',#142,.T.);
#63=FACE_OUTER_BOUND('',#143,.T.);
#64=FACE_OUTER_BOUND('',#144,.T.);
#65=FACE_OUTER_BOUND('',#145,.T.);
#66=FACE_OUTER_BOUND('',#146,.T.);
#67=FACE_OUTER_BOUND('',#147,.T.);
#68=FACE_OUTER_BOUND('',#148,.T.);
#69=FACE_OUTER_BOUND('',#149,.T.);
#70=FACE_OUTER_BOUND('',#150,.T.);
#71=FACE_OUTER_BOUND('',#151,.T.);
#72=FACE_OUTER_BOUND('',#152,.T.);
#73=FACE_OUTER_BOUND('',#153,.T.);
#74=FACE_OUTER_BOUND('',#154,.T.);
#75=FACE_OUTER_BOUND('',#155,.T.);
#76=FACE_OUTER_BOUND('',#156,.T.);
#77=FACE_OUTER_BOUND('',#157,.T.);
#78=FACE_OUTER_BOUND('',#158,.T.);
#79=FACE_OUTER_BOUND('',#159,.T.);
#80=FACE_OUTER_BOUND('',#160,.T.);
#81=FACE_OUTER_BOUND('',#161,.T.);
#82=FACE_OUTER_BOUND('',#162,.T.);
#83=FACE_OUTER_BOUND('',#163,.T.);
#84=FACE_OUTER_BOUND('',#164,.T.);
#85=FACE_OUTER_BOUND('',#165,.T.);
#86=FACE_OUTER_BOUND('',#166,.T.);
#87=FACE_OUTER_BOUND('',#167,.T.);
#88=FACE_OUTER_BOUND('',#168,.T.);
#89=FACE_OUTER_BOUND('',#169,.T.);
#90=FACE_OUTER_BOUND('',#170,.T.);
#91=FACE_OUTER_BOUND('',#171,.T.);
#92=FACE_OUTER_BOUND('',#172,.T.);
#93=FACE_OUTER_BOUND('',#173,.T.);
#94=FACE_OUTER_BOUND('',#174,.T.);
#95=FACE_OUTER_BOUND('',#175,.T.);
#96=FACE_OUTER_BOUND('',#176,.T.);
#97=FACE_OUTER_BOUND('',#177,.T.);
#98=FACE_OUTER_BOUND('',#178,.T.);
#99=FACE_OUTER_BOUND('',#179,.T.);
#100=FACE_OUTER_BOUND('',#180,.T.);
#101=FACE_OUTER_BOUND('',#181,.T.);
#102=FACE_OUTER_BOUND('',#182,.T.);
#103=FACE_OUTER_BOUND('',#183,.T.);
#104=FACE_OUTER_BOUND('',#184,.T.);
#105=FACE_OUTER_BOUND('',#185,.T.);
#106=FACE_OUTER_BOUND('',#186,.T.);
#107=FACE_OUTER_BOUND('',#187,.T.);
#108=FACE_OUTER_BOUND('',#188,.T.);
#109=FACE_OUTER_BOUND('',#189,.T.);
#110=FACE_OUTER_BOUND('',#190,.T.);
#111=FACE_OUTER_BOUND('',#191,.T.);
#112=FACE_OUTER_BOUND('',#192,.T.);
#113=FACE_OUTER_BOUND('',#193,.T.);
#114=FACE_OUTER_BOUND('',#194,.T.);
#115=FACE_OUTER_BOUND('',#195,.T.);
#116=FACE_OUTER_BOUND('',#196,.T.);
#117=FACE_OUTER_BOUND('',#197,.T.);
#118=FACE_OUTER_BOUND('',#198,.T.);
#119=FACE_OUTER_BOUND('',#199,.T.);
#120=FACE_OUTER_BOUND('',#200,.T.);
#121=FACE_OUTER_BOUND('',#201,.T.);
#122=FACE_OUTER_BOUND('',#202,.T.);
#123=FACE_OUTER_BOUND('',#205,.T.);
#124=FACE_OUTER_BOUND('',#206,.T.);
#125=FACE_OUTER_BOUND('',#207,.T.);
#126=FACE_OUTER_BOUND('',#208,.T.);
#127=FACE_OUTER_BOUND('',#209,.T.);
#128=EDGE_LOOP('',(#800,#801,#802,#803,#804));
#129=EDGE_LOOP('',(#805,#806,#807,#808));
#130=EDGE_LOOP('',(#809,#810,#811,#812));
#131=EDGE_LOOP('',(#813,#814,#815,#816));
#132=EDGE_LOOP('',(#817,#818,#819,#820));
#133=EDGE_LOOP('',(#821,#822,#823,#824));
#134=EDGE_LOOP('',(#825,#826,#827,#828,#829));
#135=EDGE_LOOP('',(#830,#831,#832,#833));
#136=EDGE_LOOP('',(#834,#835,#836,#837));
#137=EDGE_LOOP('',(#838,#839,#840,#841));
#138=EDGE_LOOP('',(#842,#843,#844,#845));
#139=EDGE_LOOP('',(#846,#847,#848,#849));
#140=EDGE_LOOP('',(#850,#851,#852,#853));
#141=EDGE_LOOP('',(#854,#855,#856,#857));
#142=EDGE_LOOP('',(#858,#859,#860,#861));
#143=EDGE_LOOP('',(#862,#863,#864,#865));
#144=EDGE_LOOP('',(#866,#867,#868,#869));
#145=EDGE_LOOP('',(#870,#871,#872,#873));
#146=EDGE_LOOP('',(#874,#875,#876,#877));
#147=EDGE_LOOP('',(#878,#879,#880,#881));
#148=EDGE_LOOP('',(#882,#883,#884,#885));
#149=EDGE_LOOP('',(#886,#887,#888,#889));
#150=EDGE_LOOP('',(#890,#891,#892,#893));
#151=EDGE_LOOP('',(#894,#895,#896,#897));
#152=EDGE_LOOP('',(#898,#899,#900,#901));
#153=EDGE_LOOP('',(#902,#903,#904,#905));
#154=EDGE_LOOP('',(#906,#907,#908,#909));
#155=EDGE_LOOP('',(#910,#911,#912,#913));
#156=EDGE_LOOP('',(#914,#915,#916,#917));
#157=EDGE_LOOP('',(#918,#919,#920,#921));
#158=EDGE_LOOP('',(#922,#923,#924,#925));
#159=EDGE_LOOP('',(#926,#927,#928,#929));
#160=EDGE_LOOP('',(#930,#931,#932,#933));
#161=EDGE_LOOP('',(#934,#935,#936,#937));
#162=EDGE_LOOP('',(#938,#939,#940,#941));
#163=EDGE_LOOP('',(#942,#943,#944,#945));
#164=EDGE_LOOP('',(#946,#947,#948,#949));
#165=EDGE_LOOP('',(#950,#951,#952,#953));
#166=EDGE_LOOP('',(#954,#955,#956,#957));
#167=EDGE_LOOP('',(#958,#959,#960,#961));
#168=EDGE_LOOP('',(#962,#963,#964,#965));
#169=EDGE_LOOP('',(#966,#967,#968,#969));
#170=EDGE_LOOP('',(#970,#971,#972,#973));
#171=EDGE_LOOP('',(#974,#975,#976,#977));
#172=EDGE_LOOP('',(#978,#979,#980,#981));
#173=EDGE_LOOP('',(#982,#983,#984,#985));
#174=EDGE_LOOP('',(#986,#987,#988,#989));
#175=EDGE_LOOP('',(#990,#991,#992,#993));
#176=EDGE_LOOP('',(#994,#995,#996,#997));
#177=EDGE_LOOP('',(#998,#999,#1000,#1001));
#178=EDGE_LOOP('',(#1002,#1003,#1004,#1005));
#179=EDGE_LOOP('',(#1006,#1007,#1008,#1009));
#180=EDGE_LOOP('',(#1010,#1011,#1012,#1013));
#181=EDGE_LOOP('',(#1014,#1015,#1016,#1017));
#182=EDGE_LOOP('',(#1018,#1019,#1020,#1021));
#183=EDGE_LOOP('',(#1022,#1023,#1024,#1025));
#184=EDGE_LOOP('',(#1026,#1027,#1028,#1029));
#185=EDGE_LOOP('',(#1030,#1031,#1032,#1033));
#186=EDGE_LOOP('',(#1034,#1035,#1036,#1037));
#187=EDGE_LOOP('',(#1038,#1039,#1040,#1041));
#188=EDGE_LOOP('',(#1042,#1043,#1044,#1045));
#189=EDGE_LOOP('',(#1046,#1047,#1048,#1049));
#190=EDGE_LOOP('',(#1050,#1051,#1052,#1053));
#191=EDGE_LOOP('',(#1054,#1055,#1056,#1057));
#192=EDGE_LOOP('',(#1058,#1059,#1060,#1061));
#193=EDGE_LOOP('',(#1062,#1063,#1064,#1065));
#194=EDGE_LOOP('',(#1066,#1067,#1068,#1069));
#195=EDGE_LOOP('',(#1070,#1071,#1072,#1073));
#196=EDGE_LOOP('',(#1074));
#197=EDGE_LOOP('',(#1075,#1076,#1077,#1078));
#198=EDGE_LOOP('',(#1079,#1080,#1081,#1082));
#199=EDGE_LOOP('',(#1083,#1084,#1085,#1086));
#200=EDGE_LOOP('',(#1087,#1088,#1089,#1090));
#201=EDGE_LOOP('',(#1091,#1092,#1093,#1094));
#202=EDGE_LOOP('',(#1095,#1096,#1097,#1098));
#203=EDGE_LOOP('',(#1099));
#204=EDGE_LOOP('',(#1100,#1101,#1102,#1103));
#205=EDGE_LOOP('',(#1104,#1105,#1106,#1107));
#206=EDGE_LOOP('',(#1108,#1109,#1110,#1111));
#207=EDGE_LOOP('',(#1112,#1113,#1114,#1115));
#208=EDGE_LOOP('',(#1116,#1117,#1118,#1119));
#209=EDGE_LOOP('',(#1120,#1121,#1122,#1123));
#210=LINE('',#1720,#370);
#211=LINE('',#1722,#371);
#212=LINE('',#1724,#372);
#213=LINE('',#1726,#373);
#214=LINE('',#1727,#374);
#215=LINE('',#1730,#375);
#216=LINE('',#1732,#376);
#217=LINE('',#1733,#377);
#218=LINE('',#1736,#378);
#219=LINE('',#1737,#379);
#220=LINE('',#1740,#380);
#221=LINE('',#1741,#381);
#222=LINE('',#1744,#382);
#223=LINE('',#1745,#383);
#224=LINE('',#1747,#384);
#225=LINE('',#1752,#385);
#226=LINE('',#1754,#386);
#227=LINE('',#1756,#387);
#228=LINE('',#1757,#388);
#229=LINE('',#1761,#389);
#230=LINE('',#1762,#390);
#231=LINE('',#1763,#391);
#232=LINE('',#1766,#392);
#233=LINE('',#1767,#393);
#234=LINE('',#1770,#394);
#235=LINE('',#1771,#395);
#236=LINE('',#1773,#396);
#237=LINE('',#1778,#397);
#238=LINE('',#1780,#398);
#239=LINE('',#1782,#399);
#240=LINE('',#1783,#400);
#241=LINE('',#1787,#401);
#242=LINE('',#1788,#402);
#243=LINE('',#1789,#403);
#244=LINE('',#1792,#404);
#245=LINE('',#1793,#405);
#246=LINE('',#1796,#406);
#247=LINE('',#1797,#407);
#248=LINE('',#1799,#408);
#249=LINE('',#1804,#409);
#250=LINE('',#1806,#410);
#251=LINE('',#1808,#411);
#252=LINE('',#1809,#412);
#253=LINE('',#1813,#413);
#254=LINE('',#1814,#414);
#255=LINE('',#1815,#415);
#256=LINE('',#1818,#416);
#257=LINE('',#1819,#417);
#258=LINE('',#1822,#418);
#259=LINE('',#1823,#419);
#260=LINE('',#1825,#420);
#261=LINE('',#1830,#421);
#262=LINE('',#1832,#422);
#263=LINE('',#1834,#423);
#264=LINE('',#1835,#424);
#265=LINE('',#1839,#425);
#266=LINE('',#1840,#426);
#267=LINE('',#1841,#427);
#268=LINE('',#1844,#428);
#269=LINE('',#1845,#429);
#270=LINE('',#1848,#430);
#271=LINE('',#1849,#431);
#272=LINE('',#1851,#432);
#273=LINE('',#1856,#433);
#274=LINE('',#1858,#434);
#275=LINE('',#1860,#435);
#276=LINE('',#1861,#436);
#277=LINE('',#1865,#437);
#278=LINE('',#1866,#438);
#279=LINE('',#1867,#439);
#280=LINE('',#1870,#440);
#281=LINE('',#1871,#441);
#282=LINE('',#1874,#442);
#283=LINE('',#1875,#443);
#284=LINE('',#1877,#444);
#285=LINE('',#1882,#445);
#286=LINE('',#1884,#446);
#287=LINE('',#1886,#447);
#288=LINE('',#1887,#448);
#289=LINE('',#1891,#449);
#290=LINE('',#1892,#450);
#291=LINE('',#1893,#451);
#292=LINE('',#1896,#452);
#293=LINE('',#1897,#453);
#294=LINE('',#1900,#454);
#295=LINE('',#1901,#455);
#296=LINE('',#1903,#456);
#297=LINE('',#1908,#457);
#298=LINE('',#1910,#458);
#299=LINE('',#1912,#459);
#300=LINE('',#1913,#460);
#301=LINE('',#1916,#461);
#302=LINE('',#1918,#462);
#303=LINE('',#1919,#463);
#304=LINE('',#1922,#464);
#305=LINE('',#1923,#465);
#306=LINE('',#1926,#466);
#307=LINE('',#1927,#467);
#308=LINE('',#1929,#468);
#309=LINE('',#1934,#469);
#310=LINE('',#1936,#470);
#311=LINE('',#1938,#471);
#312=LINE('',#1939,#472);
#313=LINE('',#1942,#473);
#314=LINE('',#1944,#474);
#315=LINE('',#1945,#475);
#316=LINE('',#1948,#476);
#317=LINE('',#1949,#477);
#318=LINE('',#1952,#478);
#319=LINE('',#1953,#479);
#320=LINE('',#1955,#480);
#321=LINE('',#1960,#481);
#322=LINE('',#1962,#482);
#323=LINE('',#1964,#483);
#324=LINE('',#1965,#484);
#325=LINE('',#1969,#485);
#326=LINE('',#1970,#486);
#327=LINE('',#1971,#487);
#328=LINE('',#1974,#488);
#329=LINE('',#1975,#489);
#330=LINE('',#1978,#490);
#331=LINE('',#1979,#491);
#332=LINE('',#1981,#492);
#333=LINE('',#1986,#493);
#334=LINE('',#1988,#494);
#335=LINE('',#1990,#495);
#336=LINE('',#1991,#496);
#337=LINE('',#1995,#497);
#338=LINE('',#1996,#498);
#339=LINE('',#1997,#499);
#340=LINE('',#2000,#500);
#341=LINE('',#2001,#501);
#342=LINE('',#2004,#502);
#343=LINE('',#2005,#503);
#344=LINE('',#2007,#504);
#345=LINE('',#2013,#505);
#346=LINE('',#2019,#506);
#347=LINE('',#2021,#507);
#348=LINE('',#2023,#508);
#349=LINE('',#2024,#509);
#350=LINE('',#2028,#510);
#351=LINE('',#2029,#511);
#352=LINE('',#2030,#512);
#353=LINE('',#2033,#513);
#354=LINE('',#2034,#514);
#355=LINE('',#2037,#515);
#356=LINE('',#2038,#516);
#357=LINE('',#2040,#517);
#358=LINE('',#2044,#518);
#359=LINE('',#2046,#519);
#360=LINE('',#2048,#520);
#361=LINE('',#2049,#521);
#362=LINE('',#2053,#522);
#363=LINE('',#2054,#523);
#364=LINE('',#2055,#524);
#365=LINE('',#2058,#525);
#366=LINE('',#2059,#526);
#367=LINE('',#2062,#527);
#368=LINE('',#2063,#528);
#369=LINE('',#2065,#529);
#370=VECTOR('',#1394,1000.);
#371=VECTOR('',#1395,1000.);
#372=VECTOR('',#1396,1000.);
#373=VECTOR('',#1397,1000.);
#374=VECTOR('',#1398,1000.);
#375=VECTOR('',#1401,1000.);
#376=VECTOR('',#1402,1000.);
#377=VECTOR('',#1403,1000.);
#378=VECTOR('',#1406,1000.);
#379=VECTOR('',#1407,1000.);
#380=VECTOR('',#1410,1000.);
#381=VECTOR('',#1411,1000.);
#382=VECTOR('',#1414,1000.);
#383=VECTOR('',#1415,1000.);
#384=VECTOR('',#1418,1000.);
#385=VECTOR('',#1423,1000.);
#386=VECTOR('',#1424,1000.);
#387=VECTOR('',#1425,1000.);
#388=VECTOR('',#1426,1000.);
#389=VECTOR('',#1429,1000.);
#390=VECTOR('',#1430,1000.);
#391=VECTOR('',#1431,1000.);
#392=VECTOR('',#1434,1000.);
#393=VECTOR('',#1435,1000.);
#394=VECTOR('',#1438,1000.);
#395=VECTOR('',#1439,1000.);
#396=VECTOR('',#1442,1000.);
#397=VECTOR('',#1447,1000.);
#398=VECTOR('',#1448,1000.);
#399=VECTOR('',#1449,1000.);
#400=VECTOR('',#1450,1000.);
#401=VECTOR('',#1453,1000.);
#402=VECTOR('',#1454,1000.);
#403=VECTOR('',#1455,1000.);
#404=VECTOR('',#1458,1000.);
#405=VECTOR('',#1459,1000.);
#406=VECTOR('',#1462,1000.);
#407=VECTOR('',#1463,1000.);
#408=VECTOR('',#1466,1000.);
#409=VECTOR('',#1471,1000.);
#410=VECTOR('',#1472,1000.);
#411=VECTOR('',#1473,1000.);
#412=VECTOR('',#1474,1000.);
#413=VECTOR('',#1477,1000.);
#414=VECTOR('',#1478,1000.);
#415=VECTOR('',#1479,1000.);
#416=VECTOR('',#1482,1000.);
#417=VECTOR('',#1483,1000.);
#418=VECTOR('',#1486,1000.);
#419=VECTOR('',#1487,1000.);
#420=VECTOR('',#1490,1000.);
#421=VECTOR('',#1495,1000.);
#422=VECTOR('',#1496,1000.);
#423=VECTOR('',#1497,1000.);
#424=VECTOR('',#1498,1000.);
#425=VECTOR('',#1501,1000.);
#426=VECTOR('',#1502,1000.);
#427=VECTOR('',#1503,1000.);
#428=VECTOR('',#1506,1000.);
#429=VECTOR('',#1507,1000.);
#430=VECTOR('',#1510,1000.);
#431=VECTOR('',#1511,1000.);
#432=VECTOR('',#1514,1000.);
#433=VECTOR('',#1519,1000.);
#434=VECTOR('',#1520,1000.);
#435=VECTOR('',#1521,1000.);
#436=VECTOR('',#1522,1000.);
#437=VECTOR('',#1525,1000.);
#438=VECTOR('',#1526,1000.);
#439=VECTOR('',#1527,1000.);
#440=VECTOR('',#1530,1000.);
#441=VECTOR('',#1531,1000.);
#442=VECTOR('',#1534,1000.);
#443=VECTOR('',#1535,1000.);
#444=VECTOR('',#1538,1000.);
#445=VECTOR('',#1543,1000.);
#446=VECTOR('',#1544,1000.);
#447=VECTOR('',#1545,1000.);
#448=VECTOR('',#1546,1000.);
#449=VECTOR('',#1549,1000.);
#450=VECTOR('',#1550,1000.);
#451=VECTOR('',#1551,1000.);
#452=VECTOR('',#1554,1000.);
#453=VECTOR('',#1555,1000.);
#454=VECTOR('',#1558,1000.);
#455=VECTOR('',#1559,1000.);
#456=VECTOR('',#1562,1000.);
#457=VECTOR('',#1567,1000.);
#458=VECTOR('',#1568,1000.);
#459=VECTOR('',#1569,1000.);
#460=VECTOR('',#1570,1000.);
#461=VECTOR('',#1573,1000.);
#462=VECTOR('',#1574,1000.);
#463=VECTOR('',#1575,1000.);
#464=VECTOR('',#1578,1000.);
#465=VECTOR('',#1579,1000.);
#466=VECTOR('',#1582,1000.);
#467=VECTOR('',#1583,1000.);
#468=VECTOR('',#1586,1000.);
#469=VECTOR('',#1591,1000.);
#470=VECTOR('',#1592,1000.);
#471=VECTOR('',#1593,1000.);
#472=VECTOR('',#1594,1000.);
#473=VECTOR('',#1597,1000.);
#474=VECTOR('',#1598,1000.);
#475=VECTOR('',#1599,1000.);
#476=VECTOR('',#1602,1000.);
#477=VECTOR('',#1603,1000.);
#478=VECTOR('',#1606,1000.);
#479=VECTOR('',#1607,1000.);
#480=VECTOR('',#1610,1000.);
#481=VECTOR('',#1615,1000.);
#482=VECTOR('',#1616,1000.);
#483=VECTOR('',#1617,1000.);
#484=VECTOR('',#1618,1000.);
#485=VECTOR('',#1621,1000.);
#486=VECTOR('',#1622,1000.);
#487=VECTOR('',#1623,1000.);
#488=VECTOR('',#1626,1000.);
#489=VECTOR('',#1627,1000.);
#490=VECTOR('',#1630,1000.);
#491=VECTOR('',#1631,1000.);
#492=VECTOR('',#1634,1000.);
#493=VECTOR('',#1639,1000.);
#494=VECTOR('',#1640,1000.);
#495=VECTOR('',#1641,1000.);
#496=VECTOR('',#1642,1000.);
#497=VECTOR('',#1645,1000.);
#498=VECTOR('',#1646,1000.);
#499=VECTOR('',#1647,1000.);
#500=VECTOR('',#1650,1000.);
#501=VECTOR('',#1651,1000.);
#502=VECTOR('',#1654,1000.);
#503=VECTOR('',#1655,1000.);
#504=VECTOR('',#1658,1000.);
#505=VECTOR('',#1665,0.0750000000000001);
#506=VECTOR('',#1672,1000.);
#507=VECTOR('',#1673,1000.);
#508=VECTOR('',#1674,1000.);
#509=VECTOR('',#1675,1000.);
#510=VECTOR('',#1678,1000.);
#511=VECTOR('',#1679,1000.);
#512=VECTOR('',#1680,1000.);
#513=VECTOR('',#1683,1000.);
#514=VECTOR('',#1684,1000.);
#515=VECTOR('',#1687,1000.);
#516=VECTOR('',#1688,1000.);
#517=VECTOR('',#1691,1000.);
#518=VECTOR('',#1694,1000.);
#519=VECTOR('',#1695,1000.);
#520=VECTOR('',#1696,1000.);
#521=VECTOR('',#1697,1000.);
#522=VECTOR('',#1700,1000.);
#523=VECTOR('',#1701,1000.);
#524=VECTOR('',#1702,1000.);
#525=VECTOR('',#1705,1000.);
#526=VECTOR('',#1706,1000.);
#527=VECTOR('',#1709,1000.);
#528=VECTOR('',#1710,1000.);
#529=VECTOR('',#1713,1000.);
#530=VERTEX_POINT('',#1718);
#531=VERTEX_POINT('',#1719);
#532=VERTEX_POINT('',#1721);
#533=VERTEX_POINT('',#1723);
#534=VERTEX_POINT('',#1725);
#535=VERTEX_POINT('',#1729);
#536=VERTEX_POINT('',#1731);
#537=VERTEX_POINT('',#1735);
#538=VERTEX_POINT('',#1739);
#539=VERTEX_POINT('',#1743);
#540=VERTEX_POINT('',#1750);
#541=VERTEX_POINT('',#1751);
#542=VERTEX_POINT('',#1753);
#543=VERTEX_POINT('',#1755);
#544=VERTEX_POINT('',#1759);
#545=VERTEX_POINT('',#1760);
#546=VERTEX_POINT('',#1765);
#547=VERTEX_POINT('',#1769);
#548=VERTEX_POINT('',#1776);
#549=VERTEX_POINT('',#1777);
#550=VERTEX_POINT('',#1779);
#551=VERTEX_POINT('',#1781);
#552=VERTEX_POINT('',#1785);
#553=VERTEX_POINT('',#1786);
#554=VERTEX_POINT('',#1791);
#555=VERTEX_POINT('',#1795);
#556=VERTEX_POINT('',#1802);
#557=VERTEX_POINT('',#1803);
#558=VERTEX_POINT('',#1805);
#559=VERTEX_POINT('',#1807);
#560=VERTEX_POINT('',#1811);
#561=VERTEX_POINT('',#1812);
#562=VERTEX_POINT('',#1817);
#563=VERTEX_POINT('',#1821);
#564=VERTEX_POINT('',#1828);
#565=VERTEX_POINT('',#1829);
#566=VERTEX_POINT('',#1831);
#567=VERTEX_POINT('',#1833);
#568=VERTEX_POINT('',#1837);
#569=VERTEX_POINT('',#1838);
#570=VERTEX_POINT('',#1843);
#571=VERTEX_POINT('',#1847);
#572=VERTEX_POINT('',#1854);
#573=VERTEX_POINT('',#1855);
#574=VERTEX_POINT('',#1857);
#575=VERTEX_POINT('',#1859);
#576=VERTEX_POINT('',#1863);
#577=VERTEX_POINT('',#1864);
#578=VERTEX_POINT('',#1869);
#579=VERTEX_POINT('',#1873);
#580=VERTEX_POINT('',#1880);
#581=VERTEX_POINT('',#1881);
#582=VERTEX_POINT('',#1883);
#583=VERTEX_POINT('',#1885);
#584=VERTEX_POINT('',#1889);
#585=VERTEX_POINT('',#1890);
#586=VERTEX_POINT('',#1895);
#587=VERTEX_POINT('',#1899);
#588=VERTEX_POINT('',#1906);
#589=VERTEX_POINT('',#1907);
#590=VERTEX_POINT('',#1909);
#591=VERTEX_POINT('',#1911);
#592=VERTEX_POINT('',#1915);
#593=VERTEX_POINT('',#1917);
#594=VERTEX_POINT('',#1921);
#595=VERTEX_POINT('',#1925);
#596=VERTEX_POINT('',#1932);
#597=VERTEX_POINT('',#1933);
#598=VERTEX_POINT('',#1935);
#599=VERTEX_POINT('',#1937);
#600=VERTEX_POINT('',#1941);
#601=VERTEX_POINT('',#1943);
#602=VERTEX_POINT('',#1947);
#603=VERTEX_POINT('',#1951);
#604=VERTEX_POINT('',#1958);
#605=VERTEX_POINT('',#1959);
#606=VERTEX_POINT('',#1961);
#607=VERTEX_POINT('',#1963);
#608=VERTEX_POINT('',#1967);
#609=VERTEX_POINT('',#1968);
#610=VERTEX_POINT('',#1973);
#611=VERTEX_POINT('',#1977);
#612=VERTEX_POINT('',#1984);
#613=VERTEX_POINT('',#1985);
#614=VERTEX_POINT('',#1987);
#615=VERTEX_POINT('',#1989);
#616=VERTEX_POINT('',#1993);
#617=VERTEX_POINT('',#1994);
#618=VERTEX_POINT('',#1999);
#619=VERTEX_POINT('',#2003);
#620=VERTEX_POINT('',#2010);
#621=VERTEX_POINT('',#2012);
#622=VERTEX_POINT('',#2017);
#623=VERTEX_POINT('',#2018);
#624=VERTEX_POINT('',#2020);
#625=VERTEX_POINT('',#2022);
#626=VERTEX_POINT('',#2026);
#627=VERTEX_POINT('',#2027);
#628=VERTEX_POINT('',#2032);
#629=VERTEX_POINT('',#2036);
#630=VERTEX_POINT('',#2042);
#631=VERTEX_POINT('',#2043);
#632=VERTEX_POINT('',#2045);
#633=VERTEX_POINT('',#2047);
#634=VERTEX_POINT('',#2051);
#635=VERTEX_POINT('',#2052);
#636=VERTEX_POINT('',#2057);
#637=VERTEX_POINT('',#2061);
#638=EDGE_CURVE('',#530,#531,#210,.T.);
#639=EDGE_CURVE('',#531,#532,#211,.T.);
#640=EDGE_CURVE('',#532,#533,#212,.T.);
#641=EDGE_CURVE('',#533,#534,#213,.T.);
#642=EDGE_CURVE('',#534,#530,#214,.T.);
#643=EDGE_CURVE('',#531,#535,#215,.T.);
#644=EDGE_CURVE('',#535,#536,#216,.T.);
#645=EDGE_CURVE('',#536,#532,#217,.T.);
#646=EDGE_CURVE('',#530,#537,#218,.T.);
#647=EDGE_CURVE('',#537,#535,#219,.T.);
#648=EDGE_CURVE('',#534,#538,#220,.T.);
#649=EDGE_CURVE('',#538,#537,#221,.T.);
#650=EDGE_CURVE('',#533,#539,#222,.T.);
#651=EDGE_CURVE('',#539,#538,#223,.T.);
#652=EDGE_CURVE('',#536,#539,#224,.T.);
#653=EDGE_CURVE('',#540,#541,#225,.T.);
#654=EDGE_CURVE('',#542,#540,#226,.T.);
#655=EDGE_CURVE('',#543,#542,#227,.T.);
#656=EDGE_CURVE('',#541,#543,#228,.T.);
#657=EDGE_CURVE('',#544,#545,#229,.T.);
#658=EDGE_CURVE('',#545,#541,#230,.T.);
#659=EDGE_CURVE('',#543,#544,#231,.T.);
#660=EDGE_CURVE('',#545,#546,#232,.T.);
#661=EDGE_CURVE('',#546,#540,#233,.T.);
#662=EDGE_CURVE('',#546,#547,#234,.T.);
#663=EDGE_CURVE('',#547,#542,#235,.T.);
#664=EDGE_CURVE('',#547,#544,#236,.T.);
#665=EDGE_CURVE('',#548,#549,#237,.T.);
#666=EDGE_CURVE('',#550,#548,#238,.T.);
#667=EDGE_CURVE('',#551,#550,#239,.T.);
#668=EDGE_CURVE('',#549,#551,#240,.T.);
#669=EDGE_CURVE('',#552,#553,#241,.T.);
#670=EDGE_CURVE('',#553,#549,#242,.T.);
#671=EDGE_CURVE('',#551,#552,#243,.T.);
#672=EDGE_CURVE('',#553,#554,#244,.T.);
#673=EDGE_CURVE('',#554,#548,#245,.T.);
#674=EDGE_CURVE('',#554,#555,#246,.T.);
#675=EDGE_CURVE('',#555,#550,#247,.T.);
#676=EDGE_CURVE('',#555,#552,#248,.T.);
#677=EDGE_CURVE('',#556,#557,#249,.T.);
#678=EDGE_CURVE('',#558,#556,#250,.T.);
#679=EDGE_CURVE('',#559,#558,#251,.T.);
#680=EDGE_CURVE('',#557,#559,#252,.T.);
#681=EDGE_CURVE('',#560,#561,#253,.T.);
#682=EDGE_CURVE('',#561,#557,#254,.T.);
#683=EDGE_CURVE('',#559,#560,#255,.T.);
#684=EDGE_CURVE('',#561,#562,#256,.T.);
#685=EDGE_CURVE('',#562,#556,#257,.T.);
#686=EDGE_CURVE('',#562,#563,#258,.T.);
#687=EDGE_CURVE('',#563,#558,#259,.T.);
#688=EDGE_CURVE('',#563,#560,#260,.T.);
#689=EDGE_CURVE('',#564,#565,#261,.T.);
#690=EDGE_CURVE('',#566,#564,#262,.T.);
#691=EDGE_CURVE('',#567,#566,#263,.T.);
#692=EDGE_CURVE('',#565,#567,#264,.T.);
#693=EDGE_CURVE('',#568,#569,#265,.T.);
#694=EDGE_CURVE('',#569,#565,#266,.T.);
#695=EDGE_CURVE('',#567,#568,#267,.T.);
#696=EDGE_CURVE('',#569,#570,#268,.T.);
#697=EDGE_CURVE('',#570,#564,#269,.T.);
#698=EDGE_CURVE('',#570,#571,#270,.T.);
#699=EDGE_CURVE('',#571,#566,#271,.T.);
#700=EDGE_CURVE('',#571,#568,#272,.T.);
#701=EDGE_CURVE('',#572,#573,#273,.T.);
#702=EDGE_CURVE('',#574,#572,#274,.T.);
#703=EDGE_CURVE('',#575,#574,#275,.T.);
#704=EDGE_CURVE('',#573,#575,#276,.T.);
#705=EDGE_CURVE('',#576,#577,#277,.T.);
#706=EDGE_CURVE('',#577,#573,#278,.T.);
#707=EDGE_CURVE('',#575,#576,#279,.T.);
#708=EDGE_CURVE('',#577,#578,#280,.T.);
#709=EDGE_CURVE('',#578,#572,#281,.T.);
#710=EDGE_CURVE('',#578,#579,#282,.T.);
#711=EDGE_CURVE('',#579,#574,#283,.T.);
#712=EDGE_CURVE('',#579,#576,#284,.T.);
#713=EDGE_CURVE('',#580,#581,#285,.T.);
#714=EDGE_CURVE('',#582,#580,#286,.T.);
#715=EDGE_CURVE('',#583,#582,#287,.T.);
#716=EDGE_CURVE('',#581,#583,#288,.T.);
#717=EDGE_CURVE('',#584,#585,#289,.T.);
#718=EDGE_CURVE('',#585,#581,#290,.T.);
#719=EDGE_CURVE('',#583,#584,#291,.T.);
#720=EDGE_CURVE('',#585,#586,#292,.T.);
#721=EDGE_CURVE('',#586,#580,#293,.T.);
#722=EDGE_CURVE('',#586,#587,#294,.T.);
#723=EDGE_CURVE('',#587,#582,#295,.T.);
#724=EDGE_CURVE('',#587,#584,#296,.T.);
#725=EDGE_CURVE('',#588,#589,#297,.T.);
#726=EDGE_CURVE('',#589,#590,#298,.T.);
#727=EDGE_CURVE('',#590,#591,#299,.T.);
#728=EDGE_CURVE('',#591,#588,#300,.T.);
#729=EDGE_CURVE('',#589,#592,#301,.T.);
#730=EDGE_CURVE('',#592,#593,#302,.T.);
#731=EDGE_CURVE('',#593,#590,#303,.T.);
#732=EDGE_CURVE('',#588,#594,#304,.T.);
#733=EDGE_CURVE('',#594,#592,#305,.T.);
#734=EDGE_CURVE('',#591,#595,#306,.T.);
#735=EDGE_CURVE('',#595,#594,#307,.T.);
#736=EDGE_CURVE('',#593,#595,#308,.T.);
#737=EDGE_CURVE('',#596,#597,#309,.T.);
#738=EDGE_CURVE('',#597,#598,#310,.T.);
#739=EDGE_CURVE('',#598,#599,#311,.T.);
#740=EDGE_CURVE('',#599,#596,#312,.T.);
#741=EDGE_CURVE('',#597,#600,#313,.T.);
#742=EDGE_CURVE('',#600,#601,#314,.T.);
#743=EDGE_CURVE('',#601,#598,#315,.T.);
#744=EDGE_CURVE('',#596,#602,#316,.T.);
#745=EDGE_CURVE('',#602,#600,#317,.T.);
#746=EDGE_CURVE('',#599,#603,#318,.T.);
#747=EDGE_CURVE('',#603,#602,#319,.T.);
#748=EDGE_CURVE('',#601,#603,#320,.T.);
#749=EDGE_CURVE('',#604,#605,#321,.T.);
#750=EDGE_CURVE('',#606,#604,#322,.T.);
#751=EDGE_CURVE('',#607,#606,#323,.T.);
#752=EDGE_CURVE('',#605,#607,#324,.T.);
#753=EDGE_CURVE('',#608,#609,#325,.T.);
#754=EDGE_CURVE('',#609,#605,#326,.T.);
#755=EDGE_CURVE('',#607,#608,#327,.T.);
#756=EDGE_CURVE('',#609,#610,#328,.T.);
#757=EDGE_CURVE('',#610,#604,#329,.T.);
#758=EDGE_CURVE('',#610,#611,#330,.T.);
#759=EDGE_CURVE('',#611,#606,#331,.T.);
#760=EDGE_CURVE('',#611,#608,#332,.T.);
#761=EDGE_CURVE('',#612,#613,#333,.T.);
#762=EDGE_CURVE('',#614,#612,#334,.T.);
#763=EDGE_CURVE('',#615,#614,#335,.T.);
#764=EDGE_CURVE('',#613,#615,#336,.T.);
#765=EDGE_CURVE('',#616,#617,#337,.T.);
#766=EDGE_CURVE('',#617,#613,#338,.T.);
#767=EDGE_CURVE('',#615,#616,#339,.T.);
#768=EDGE_CURVE('',#617,#618,#340,.T.);
#769=EDGE_CURVE('',#618,#612,#341,.T.);
#770=EDGE_CURVE('',#618,#619,#342,.T.);
#771=EDGE_CURVE('',#619,#614,#343,.T.);
#772=EDGE_CURVE('',#619,#616,#344,.T.);
#773=EDGE_CURVE('',#620,#620,#15,.T.);
#774=EDGE_CURVE('',#620,#621,#345,.T.);
#775=EDGE_CURVE('',#621,#621,#16,.T.);
#776=EDGE_CURVE('',#622,#623,#346,.T.);
#777=EDGE_CURVE('',#624,#622,#347,.T.);
#778=EDGE_CURVE('',#625,#624,#348,.T.);
#779=EDGE_CURVE('',#623,#625,#349,.T.);
#780=EDGE_CURVE('',#626,#627,#350,.T.);
#781=EDGE_CURVE('',#627,#623,#351,.T.);
#782=EDGE_CURVE('',#625,#626,#352,.T.);
#783=EDGE_CURVE('',#627,#628,#353,.T.);
#784=EDGE_CURVE('',#628,#622,#354,.T.);
#785=EDGE_CURVE('',#628,#629,#355,.T.);
#786=EDGE_CURVE('',#629,#624,#356,.T.);
#787=EDGE_CURVE('',#629,#626,#357,.T.);
#788=EDGE_CURVE('',#630,#631,#358,.T.);
#789=EDGE_CURVE('',#631,#632,#359,.T.);
#790=EDGE_CURVE('',#632,#633,#360,.T.);
#791=EDGE_CURVE('',#633,#630,#361,.T.);
#792=EDGE_CURVE('',#634,#635,#362,.T.);
#793=EDGE_CURVE('',#635,#632,#363,.T.);
#794=EDGE_CURVE('',#631,#634,#364,.T.);
#795=EDGE_CURVE('',#636,#634,#365,.T.);
#796=EDGE_CURVE('',#630,#636,#366,.T.);
#797=EDGE_CURVE('',#637,#636,#367,.T.);
#798=EDGE_CURVE('',#633,#637,#368,.T.);
#799=EDGE_CURVE('',#635,#637,#369,.T.);
#800=ORIENTED_EDGE('',*,*,#638,.T.);
#801=ORIENTED_EDGE('',*,*,#639,.T.);
#802=ORIENTED_EDGE('',*,*,#640,.T.);
#803=ORIENTED_EDGE('',*,*,#641,.T.);
#804=ORIENTED_EDGE('',*,*,#642,.T.);
#805=ORIENTED_EDGE('',*,*,#639,.F.);
#806=ORIENTED_EDGE('',*,*,#643,.T.);
#807=ORIENTED_EDGE('',*,*,#644,.T.);
#808=ORIENTED_EDGE('',*,*,#645,.T.);
#809=ORIENTED_EDGE('',*,*,#638,.F.);
#810=ORIENTED_EDGE('',*,*,#646,.T.);
#811=ORIENTED_EDGE('',*,*,#647,.T.);
#812=ORIENTED_EDGE('',*,*,#643,.F.);
#813=ORIENTED_EDGE('',*,*,#642,.F.);
#814=ORIENTED_EDGE('',*,*,#648,.T.);
#815=ORIENTED_EDGE('',*,*,#649,.T.);
#816=ORIENTED_EDGE('',*,*,#646,.F.);
#817=ORIENTED_EDGE('',*,*,#641,.F.);
#818=ORIENTED_EDGE('',*,*,#650,.T.);
#819=ORIENTED_EDGE('',*,*,#651,.T.);
#820=ORIENTED_EDGE('',*,*,#648,.F.);
#821=ORIENTED_EDGE('',*,*,#640,.F.);
#822=ORIENTED_EDGE('',*,*,#645,.F.);
#823=ORIENTED_EDGE('',*,*,#652,.T.);
#824=ORIENTED_EDGE('',*,*,#650,.F.);
#825=ORIENTED_EDGE('',*,*,#647,.F.);
#826=ORIENTED_EDGE('',*,*,#649,.F.);
#827=ORIENTED_EDGE('',*,*,#651,.F.);
#828=ORIENTED_EDGE('',*,*,#652,.F.);
#829=ORIENTED_EDGE('',*,*,#644,.F.);
#830=ORIENTED_EDGE('',*,*,#653,.F.);
#831=ORIENTED_EDGE('',*,*,#654,.F.);
#832=ORIENTED_EDGE('',*,*,#655,.F.);
#833=ORIENTED_EDGE('',*,*,#656,.F.);
#834=ORIENTED_EDGE('',*,*,#657,.T.);
#835=ORIENTED_EDGE('',*,*,#658,.T.);
#836=ORIENTED_EDGE('',*,*,#656,.T.);
#837=ORIENTED_EDGE('',*,*,#659,.T.);
#838=ORIENTED_EDGE('',*,*,#660,.T.);
#839=ORIENTED_EDGE('',*,*,#661,.T.);
#840=ORIENTED_EDGE('',*,*,#653,.T.);
#841=ORIENTED_EDGE('',*,*,#658,.F.);
#842=ORIENTED_EDGE('',*,*,#662,.T.);
#843=ORIENTED_EDGE('',*,*,#663,.T.);
#844=ORIENTED_EDGE('',*,*,#654,.T.);
#845=ORIENTED_EDGE('',*,*,#661,.F.);
#846=ORIENTED_EDGE('',*,*,#664,.T.);
#847=ORIENTED_EDGE('',*,*,#659,.F.);
#848=ORIENTED_EDGE('',*,*,#655,.T.);
#849=ORIENTED_EDGE('',*,*,#663,.F.);
#850=ORIENTED_EDGE('',*,*,#660,.F.);
#851=ORIENTED_EDGE('',*,*,#657,.F.);
#852=ORIENTED_EDGE('',*,*,#664,.F.);
#853=ORIENTED_EDGE('',*,*,#662,.F.);
#854=ORIENTED_EDGE('',*,*,#665,.F.);
#855=ORIENTED_EDGE('',*,*,#666,.F.);
#856=ORIENTED_EDGE('',*,*,#667,.F.);
#857=ORIENTED_EDGE('',*,*,#668,.F.);
#858=ORIENTED_EDGE('',*,*,#669,.T.);
#859=ORIENTED_EDGE('',*,*,#670,.T.);
#860=ORIENTED_EDGE('',*,*,#668,.T.);
#861=ORIENTED_EDGE('',*,*,#671,.T.);
#862=ORIENTED_EDGE('',*,*,#672,.T.);
#863=ORIENTED_EDGE('',*,*,#673,.T.);
#864=ORIENTED_EDGE('',*,*,#665,.T.);
#865=ORIENTED_EDGE('',*,*,#670,.F.);
#866=ORIENTED_EDGE('',*,*,#674,.T.);
#867=ORIENTED_EDGE('',*,*,#675,.T.);
#868=ORIENTED_EDGE('',*,*,#666,.T.);
#869=ORIENTED_EDGE('',*,*,#673,.F.);
#870=ORIENTED_EDGE('',*,*,#676,.T.);
#871=ORIENTED_EDGE('',*,*,#671,.F.);
#872=ORIENTED_EDGE('',*,*,#667,.T.);
#873=ORIENTED_EDGE('',*,*,#675,.F.);
#874=ORIENTED_EDGE('',*,*,#672,.F.);
#875=ORIENTED_EDGE('',*,*,#669,.F.);
#876=ORIENTED_EDGE('',*,*,#676,.F.);
#877=ORIENTED_EDGE('',*,*,#674,.F.);
#878=ORIENTED_EDGE('',*,*,#677,.F.);
#879=ORIENTED_EDGE('',*,*,#678,.F.);
#880=ORIENTED_EDGE('',*,*,#679,.F.);
#881=ORIENTED_EDGE('',*,*,#680,.F.);
#882=ORIENTED_EDGE('',*,*,#681,.T.);
#883=ORIENTED_EDGE('',*,*,#682,.T.);
#884=ORIENTED_EDGE('',*,*,#680,.T.);
#885=ORIENTED_EDGE('',*,*,#683,.T.);
#886=ORIENTED_EDGE('',*,*,#684,.T.);
#887=ORIENTED_EDGE('',*,*,#685,.T.);
#888=ORIENTED_EDGE('',*,*,#677,.T.);
#889=ORIENTED_EDGE('',*,*,#682,.F.);
#890=ORIENTED_EDGE('',*,*,#686,.T.);
#891=ORIENTED_EDGE('',*,*,#687,.T.);
#892=ORIENTED_EDGE('',*,*,#678,.T.);
#893=ORIENTED_EDGE('',*,*,#685,.F.);
#894=ORIENTED_EDGE('',*,*,#688,.T.);
#895=ORIENTED_EDGE('',*,*,#683,.F.);
#896=ORIENTED_EDGE('',*,*,#679,.T.);
#897=ORIENTED_EDGE('',*,*,#687,.F.);
#898=ORIENTED_EDGE('',*,*,#684,.F.);
#899=ORIENTED_EDGE('',*,*,#681,.F.);
#900=ORIENTED_EDGE('',*,*,#688,.F.);
#901=ORIENTED_EDGE('',*,*,#686,.F.);
#902=ORIENTED_EDGE('',*,*,#689,.F.);
#903=ORIENTED_EDGE('',*,*,#690,.F.);
#904=ORIENTED_EDGE('',*,*,#691,.F.);
#905=ORIENTED_EDGE('',*,*,#692,.F.);
#906=ORIENTED_EDGE('',*,*,#693,.T.);
#907=ORIENTED_EDGE('',*,*,#694,.T.);
#908=ORIENTED_EDGE('',*,*,#692,.T.);
#909=ORIENTED_EDGE('',*,*,#695,.T.);
#910=ORIENTED_EDGE('',*,*,#696,.T.);
#911=ORIENTED_EDGE('',*,*,#697,.T.);
#912=ORIENTED_EDGE('',*,*,#689,.T.);
#913=ORIENTED_EDGE('',*,*,#694,.F.);
#914=ORIENTED_EDGE('',*,*,#698,.T.);
#915=ORIENTED_EDGE('',*,*,#699,.T.);
#916=ORIENTED_EDGE('',*,*,#690,.T.);
#917=ORIENTED_EDGE('',*,*,#697,.F.);
#918=ORIENTED_EDGE('',*,*,#700,.T.);
#919=ORIENTED_EDGE('',*,*,#695,.F.);
#920=ORIENTED_EDGE('',*,*,#691,.T.);
#921=ORIENTED_EDGE('',*,*,#699,.F.);
#922=ORIENTED_EDGE('',*,*,#696,.F.);
#923=ORIENTED_EDGE('',*,*,#693,.F.);
#924=ORIENTED_EDGE('',*,*,#700,.F.);
#925=ORIENTED_EDGE('',*,*,#698,.F.);
#926=ORIENTED_EDGE('',*,*,#701,.F.);
#927=ORIENTED_EDGE('',*,*,#702,.F.);
#928=ORIENTED_EDGE('',*,*,#703,.F.);
#929=ORIENTED_EDGE('',*,*,#704,.F.);
#930=ORIENTED_EDGE('',*,*,#705,.T.);
#931=ORIENTED_EDGE('',*,*,#706,.T.);
#932=ORIENTED_EDGE('',*,*,#704,.T.);
#933=ORIENTED_EDGE('',*,*,#707,.T.);
#934=ORIENTED_EDGE('',*,*,#708,.T.);
#935=ORIENTED_EDGE('',*,*,#709,.T.);
#936=ORIENTED_EDGE('',*,*,#701,.T.);
#937=ORIENTED_EDGE('',*,*,#706,.F.);
#938=ORIENTED_EDGE('',*,*,#710,.T.);
#939=ORIENTED_EDGE('',*,*,#711,.T.);
#940=ORIENTED_EDGE('',*,*,#702,.T.);
#941=ORIENTED_EDGE('',*,*,#709,.F.);
#942=ORIENTED_EDGE('',*,*,#712,.T.);
#943=ORIENTED_EDGE('',*,*,#707,.F.);
#944=ORIENTED_EDGE('',*,*,#703,.T.);
#945=ORIENTED_EDGE('',*,*,#711,.F.);
#946=ORIENTED_EDGE('',*,*,#708,.F.);
#947=ORIENTED_EDGE('',*,*,#705,.F.);
#948=ORIENTED_EDGE('',*,*,#712,.F.);
#949=ORIENTED_EDGE('',*,*,#710,.F.);
#950=ORIENTED_EDGE('',*,*,#713,.F.);
#951=ORIENTED_EDGE('',*,*,#714,.F.);
#952=ORIENTED_EDGE('',*,*,#715,.F.);
#953=ORIENTED_EDGE('',*,*,#716,.F.);
#954=ORIENTED_EDGE('',*,*,#717,.T.);
#955=ORIENTED_EDGE('',*,*,#718,.T.);
#956=ORIENTED_EDGE('',*,*,#716,.T.);
#957=ORIENTED_EDGE('',*,*,#719,.T.);
#958=ORIENTED_EDGE('',*,*,#720,.T.);
#959=ORIENTED_EDGE('',*,*,#721,.T.);
#960=ORIENTED_EDGE('',*,*,#713,.T.);
#961=ORIENTED_EDGE('',*,*,#718,.F.);
#962=ORIENTED_EDGE('',*,*,#722,.T.);
#963=ORIENTED_EDGE('',*,*,#723,.T.);
#964=ORIENTED_EDGE('',*,*,#714,.T.);
#965=ORIENTED_EDGE('',*,*,#721,.F.);
#966=ORIENTED_EDGE('',*,*,#724,.T.);
#967=ORIENTED_EDGE('',*,*,#719,.F.);
#968=ORIENTED_EDGE('',*,*,#715,.T.);
#969=ORIENTED_EDGE('',*,*,#723,.F.);
#970=ORIENTED_EDGE('',*,*,#720,.F.);
#971=ORIENTED_EDGE('',*,*,#717,.F.);
#972=ORIENTED_EDGE('',*,*,#724,.F.);
#973=ORIENTED_EDGE('',*,*,#722,.F.);
#974=ORIENTED_EDGE('',*,*,#725,.T.);
#975=ORIENTED_EDGE('',*,*,#726,.T.);
#976=ORIENTED_EDGE('',*,*,#727,.T.);
#977=ORIENTED_EDGE('',*,*,#728,.T.);
#978=ORIENTED_EDGE('',*,*,#726,.F.);
#979=ORIENTED_EDGE('',*,*,#729,.T.);
#980=ORIENTED_EDGE('',*,*,#730,.T.);
#981=ORIENTED_EDGE('',*,*,#731,.T.);
#982=ORIENTED_EDGE('',*,*,#725,.F.);
#983=ORIENTED_EDGE('',*,*,#732,.T.);
#984=ORIENTED_EDGE('',*,*,#733,.T.);
#985=ORIENTED_EDGE('',*,*,#729,.F.);
#986=ORIENTED_EDGE('',*,*,#728,.F.);
#987=ORIENTED_EDGE('',*,*,#734,.T.);
#988=ORIENTED_EDGE('',*,*,#735,.T.);
#989=ORIENTED_EDGE('',*,*,#732,.F.);
#990=ORIENTED_EDGE('',*,*,#727,.F.);
#991=ORIENTED_EDGE('',*,*,#731,.F.);
#992=ORIENTED_EDGE('',*,*,#736,.T.);
#993=ORIENTED_EDGE('',*,*,#734,.F.);
#994=ORIENTED_EDGE('',*,*,#733,.F.);
#995=ORIENTED_EDGE('',*,*,#735,.F.);
#996=ORIENTED_EDGE('',*,*,#736,.F.);
#997=ORIENTED_EDGE('',*,*,#730,.F.);
#998=ORIENTED_EDGE('',*,*,#737,.T.);
#999=ORIENTED_EDGE('',*,*,#738,.T.);
#1000=ORIENTED_EDGE('',*,*,#739,.T.);
#1001=ORIENTED_EDGE('',*,*,#740,.T.);
#1002=ORIENTED_EDGE('',*,*,#738,.F.);
#1003=ORIENTED_EDGE('',*,*,#741,.T.);
#1004=ORIENTED_EDGE('',*,*,#742,.T.);
#1005=ORIENTED_EDGE('',*,*,#743,.T.);
#1006=ORIENTED_EDGE('',*,*,#737,.F.);
#1007=ORIENTED_EDGE('',*,*,#744,.T.);
#1008=ORIENTED_EDGE('',*,*,#745,.T.);
#1009=ORIENTED_EDGE('',*,*,#741,.F.);
#1010=ORIENTED_EDGE('',*,*,#740,.F.);
#1011=ORIENTED_EDGE('',*,*,#746,.T.);
#1012=ORIENTED_EDGE('',*,*,#747,.T.);
#1013=ORIENTED_EDGE('',*,*,#744,.F.);
#1014=ORIENTED_EDGE('',*,*,#739,.F.);
#1015=ORIENTED_EDGE('',*,*,#743,.F.);
#1016=ORIENTED_EDGE('',*,*,#748,.T.);
#1017=ORIENTED_EDGE('',*,*,#746,.F.);
#1018=ORIENTED_EDGE('',*,*,#745,.F.);
#1019=ORIENTED_EDGE('',*,*,#747,.F.);
#1020=ORIENTED_EDGE('',*,*,#748,.F.);
#1021=ORIENTED_EDGE('',*,*,#742,.F.);
#1022=ORIENTED_EDGE('',*,*,#749,.F.);
#1023=ORIENTED_EDGE('',*,*,#750,.F.);
#1024=ORIENTED_EDGE('',*,*,#751,.F.);
#1025=ORIENTED_EDGE('',*,*,#752,.F.);
#1026=ORIENTED_EDGE('',*,*,#753,.T.);
#1027=ORIENTED_EDGE('',*,*,#754,.T.);
#1028=ORIENTED_EDGE('',*,*,#752,.T.);
#1029=ORIENTED_EDGE('',*,*,#755,.T.);
#1030=ORIENTED_EDGE('',*,*,#756,.T.);
#1031=ORIENTED_EDGE('',*,*,#757,.T.);
#1032=ORIENTED_EDGE('',*,*,#749,.T.);
#1033=ORIENTED_EDGE('',*,*,#754,.F.);
#1034=ORIENTED_EDGE('',*,*,#758,.T.);
#1035=ORIENTED_EDGE('',*,*,#759,.T.);
#1036=ORIENTED_EDGE('',*,*,#750,.T.);
#1037=ORIENTED_EDGE('',*,*,#757,.F.);
#1038=ORIENTED_EDGE('',*,*,#760,.T.);
#1039=ORIENTED_EDGE('',*,*,#755,.F.);
#1040=ORIENTED_EDGE('',*,*,#751,.T.);
#1041=ORIENTED_EDGE('',*,*,#759,.F.);
#1042=ORIENTED_EDGE('',*,*,#756,.F.);
#1043=ORIENTED_EDGE('',*,*,#753,.F.);
#1044=ORIENTED_EDGE('',*,*,#760,.F.);
#1045=ORIENTED_EDGE('',*,*,#758,.F.);
#1046=ORIENTED_EDGE('',*,*,#761,.F.);
#1047=ORIENTED_EDGE('',*,*,#762,.F.);
#1048=ORIENTED_EDGE('',*,*,#763,.F.);
#1049=ORIENTED_EDGE('',*,*,#764,.F.);
#1050=ORIENTED_EDGE('',*,*,#765,.T.);
#1051=ORIENTED_EDGE('',*,*,#766,.T.);
#1052=ORIENTED_EDGE('',*,*,#764,.T.);
#1053=ORIENTED_EDGE('',*,*,#767,.T.);
#1054=ORIENTED_EDGE('',*,*,#768,.T.);
#1055=ORIENTED_EDGE('',*,*,#769,.T.);
#1056=ORIENTED_EDGE('',*,*,#761,.T.);
#1057=ORIENTED_EDGE('',*,*,#766,.F.);
#1058=ORIENTED_EDGE('',*,*,#770,.T.);
#1059=ORIENTED_EDGE('',*,*,#771,.T.);
#1060=ORIENTED_EDGE('',*,*,#762,.T.);
#1061=ORIENTED_EDGE('',*,*,#769,.F.);
#1062=ORIENTED_EDGE('',*,*,#772,.T.);
#1063=ORIENTED_EDGE('',*,*,#767,.F.);
#1064=ORIENTED_EDGE('',*,*,#763,.T.);
#1065=ORIENTED_EDGE('',*,*,#771,.F.);
#1066=ORIENTED_EDGE('',*,*,#768,.F.);
#1067=ORIENTED_EDGE('',*,*,#765,.F.);
#1068=ORIENTED_EDGE('',*,*,#772,.F.);
#1069=ORIENTED_EDGE('',*,*,#770,.F.);
#1070=ORIENTED_EDGE('',*,*,#773,.F.);
#1071=ORIENTED_EDGE('',*,*,#774,.T.);
#1072=ORIENTED_EDGE('',*,*,#775,.T.);
#1073=ORIENTED_EDGE('',*,*,#774,.F.);
#1074=ORIENTED_EDGE('',*,*,#775,.F.);
#1075=ORIENTED_EDGE('',*,*,#776,.F.);
#1076=ORIENTED_EDGE('',*,*,#777,.F.);
#1077=ORIENTED_EDGE('',*,*,#778,.F.);
#1078=ORIENTED_EDGE('',*,*,#779,.F.);
#1079=ORIENTED_EDGE('',*,*,#780,.T.);
#1080=ORIENTED_EDGE('',*,*,#781,.T.);
#1081=ORIENTED_EDGE('',*,*,#779,.T.);
#1082=ORIENTED_EDGE('',*,*,#782,.T.);
#1083=ORIENTED_EDGE('',*,*,#783,.T.);
#1084=ORIENTED_EDGE('',*,*,#784,.T.);
#1085=ORIENTED_EDGE('',*,*,#776,.T.);
#1086=ORIENTED_EDGE('',*,*,#781,.F.);
#1087=ORIENTED_EDGE('',*,*,#785,.T.);
#1088=ORIENTED_EDGE('',*,*,#786,.T.);
#1089=ORIENTED_EDGE('',*,*,#777,.T.);
#1090=ORIENTED_EDGE('',*,*,#784,.F.);
#1091=ORIENTED_EDGE('',*,*,#787,.T.);
#1092=ORIENTED_EDGE('',*,*,#782,.F.);
#1093=ORIENTED_EDGE('',*,*,#778,.T.);
#1094=ORIENTED_EDGE('',*,*,#786,.F.);
#1095=ORIENTED_EDGE('',*,*,#783,.F.);
#1096=ORIENTED_EDGE('',*,*,#780,.F.);
#1097=ORIENTED_EDGE('',*,*,#787,.F.);
#1098=ORIENTED_EDGE('',*,*,#785,.F.);
#1099=ORIENTED_EDGE('',*,*,#773,.T.);
#1100=ORIENTED_EDGE('',*,*,#788,.T.);
#1101=ORIENTED_EDGE('',*,*,#789,.T.);
#1102=ORIENTED_EDGE('',*,*,#790,.T.);
#1103=ORIENTED_EDGE('',*,*,#791,.T.);
#1104=ORIENTED_EDGE('',*,*,#792,.T.);
#1105=ORIENTED_EDGE('',*,*,#793,.T.);
#1106=ORIENTED_EDGE('',*,*,#789,.F.);
#1107=ORIENTED_EDGE('',*,*,#794,.T.);
#1108=ORIENTED_EDGE('',*,*,#795,.T.);
#1109=ORIENTED_EDGE('',*,*,#794,.F.);
#1110=ORIENTED_EDGE('',*,*,#788,.F.);
#1111=ORIENTED_EDGE('',*,*,#796,.T.);
#1112=ORIENTED_EDGE('',*,*,#797,.T.);
#1113=ORIENTED_EDGE('',*,*,#796,.F.);
#1114=ORIENTED_EDGE('',*,*,#791,.F.);
#1115=ORIENTED_EDGE('',*,*,#798,.T.);
#1116=ORIENTED_EDGE('',*,*,#799,.T.);
#1117=ORIENTED_EDGE('',*,*,#798,.F.);
#1118=ORIENTED_EDGE('',*,*,#790,.F.);
#1119=ORIENTED_EDGE('',*,*,#793,.F.);
#1120=ORIENTED_EDGE('',*,*,#795,.F.);
#1121=ORIENTED_EDGE('',*,*,#797,.F.);
#1122=ORIENTED_EDGE('',*,*,#799,.F.);
#1123=ORIENTED_EDGE('',*,*,#792,.F.);
#1124=PLANE('',#1308);
#1125=PLANE('',#1309);
#1126=PLANE('',#1310);
#1127=PLANE('',#1311);
#1128=PLANE('',#1312);
#1129=PLANE('',#1313);
#1130=PLANE('',#1314);
#1131=PLANE('',#1315);
#1132=PLANE('',#1316);
#1133=PLANE('',#1317);
#1134=PLANE('',#1318);
#1135=PLANE('',#1319);
#1136=PLANE('',#1320);
#1137=PLANE('',#1321);
#1138=PLANE('',#1322);
#1139=PLANE('',#1323);
#1140=PLANE('',#1324);
#1141=PLANE('',#1325);
#1142=PLANE('',#1326);
#1143=PLANE('',#1327);
#1144=PLANE('',#1328);
#1145=PLANE('',#1329);
#1146=PLANE('',#1330);
#1147=PLANE('',#1331);
#1148=PLANE('',#1332);
#1149=PLANE('',#1333);
#1150=PLANE('',#1334);
#1151=PLANE('',#1335);
#1152=PLANE('',#1336);
#1153=PLANE('',#1337);
#1154=PLANE('',#1338);
#1155=PLANE('',#1339);
#1156=PLANE('',#1340);
#1157=PLANE('',#1341);
#1158=PLANE('',#1342);
#1159=PLANE('',#1343);
#1160=PLANE('',#1344);
#1161=PLANE('',#1345);
#1162=PLANE('',#1346);
#1163=PLANE('',#1347);
#1164=PLANE('',#1348);
#1165=PLANE('',#1349);
#1166=PLANE('',#1350);
#1167=PLANE('',#1351);
#1168=PLANE('',#1352);
#1169=PLANE('',#1353);
#1170=PLANE('',#1354);
#1171=PLANE('',#1355);
#1172=PLANE('',#1356);
#1173=PLANE('',#1357);
#1174=PLANE('',#1358);
#1175=PLANE('',#1359);
#1176=PLANE('',#1360);
#1177=PLANE('',#1361);
#1178=PLANE('',#1362);
#1179=PLANE('',#1363);
#1180=PLANE('',#1364);
#1181=PLANE('',#1365);
#1182=PLANE('',#1366);
#1183=PLANE('',#1367);
#1184=PLANE('',#1368);
#1185=PLANE('',#1369);
#1186=PLANE('',#1370);
#1187=PLANE('',#1371);
#1188=PLANE('',#1372);
#1189=PLANE('',#1373);
#1190=PLANE('',#1374);
#1191=PLANE('',#1378);
#1192=PLANE('',#1379);
#1193=PLANE('',#1380);
#1194=PLANE('',#1381);
#1195=PLANE('',#1382);
#1196=PLANE('',#1383);
#1197=PLANE('',#1384);
#1198=PLANE('',#1385);
#1199=PLANE('',#1386);
#1200=PLANE('',#1387);
#1201=PLANE('',#1388);
#1202=PLANE('',#1389);
#1203=ADVANCED_FACE('',(#48),#1124,.T.);
#1204=ADVANCED_FACE('',(#49),#1125,.T.);
#1205=ADVANCED_FACE('',(#50),#1126,.T.);
#1206=ADVANCED_FACE('',(#51),#1127,.T.);
#1207=ADVANCED_FACE('',(#52),#1128,.T.);
#1208=ADVANCED_FACE('',(#53),#1129,.T.);
#1209=ADVANCED_FACE('',(#54),#1130,.F.);
#1210=ADVANCED_FACE('',(#55),#1131,.F.);
#1211=ADVANCED_FACE('',(#56),#1132,.T.);
#1212=ADVANCED_FACE('',(#57),#1133,.T.);
#1213=ADVANCED_FACE('',(#58),#1134,.T.);
#1214=ADVANCED_FACE('',(#59),#1135,.T.);
#1215=ADVANCED_FACE('',(#60),#1136,.T.);
#1216=ADVANCED_FACE('',(#61),#1137,.F.);
#1217=ADVANCED_FACE('',(#62),#1138,.T.);
#1218=ADVANCED_FACE('',(#63),#1139,.T.);
#1219=ADVANCED_FACE('',(#64),#1140,.T.);
#1220=ADVANCED_FACE('',(#65),#1141,.T.);
#1221=ADVANCED_FACE('',(#66),#1142,.T.);
#1222=ADVANCED_FACE('',(#67),#1143,.F.);
#1223=ADVANCED_FACE('',(#68),#1144,.T.);
#1224=ADVANCED_FACE('',(#69),#1145,.T.);
#1225=ADVANCED_FACE('',(#70),#1146,.T.);
#1226=ADVANCED_FACE('',(#71),#1147,.T.);
#1227=ADVANCED_FACE('',(#72),#1148,.T.);
#1228=ADVANCED_FACE('',(#73),#1149,.F.);
#1229=ADVANCED_FACE('',(#74),#1150,.T.);
#1230=ADVANCED_FACE('',(#75),#1151,.T.);
#1231=ADVANCED_FACE('',(#76),#1152,.T.);
#1232=ADVANCED_FACE('',(#77),#1153,.T.);
#1233=ADVANCED_FACE('',(#78),#1154,.T.);
#1234=ADVANCED_FACE('',(#79),#1155,.F.);
#1235=ADVANCED_FACE('',(#80),#1156,.T.);
#1236=ADVANCED_FACE('',(#81),#1157,.T.);
#1237=ADVANCED_FACE('',(#82),#1158,.T.);
#1238=ADVANCED_FACE('',(#83),#1159,.T.);
#1239=ADVANCED_FACE('',(#84),#1160,.T.);
#1240=ADVANCED_FACE('',(#85),#1161,.F.);
#1241=ADVANCED_FACE('',(#86),#1162,.T.);
#1242=ADVANCED_FACE('',(#87),#1163,.T.);
#1243=ADVANCED_FACE('',(#88),#1164,.T.);
#1244=ADVANCED_FACE('',(#89),#1165,.T.);
#1245=ADVANCED_FACE('',(#90),#1166,.T.);
#1246=ADVANCED_FACE('',(#91),#1167,.T.);
#1247=ADVANCED_FACE('',(#92),#1168,.T.);
#1248=ADVANCED_FACE('',(#93),#1169,.T.);
#1249=ADVANCED_FACE('',(#94),#1170,.T.);
#1250=ADVANCED_FACE('',(#95),#1171,.T.);
#1251=ADVANCED_FACE('',(#96),#1172,.F.);
#1252=ADVANCED_FACE('',(#97),#1173,.T.);
#1253=ADVANCED_FACE('',(#98),#1174,.T.);
#1254=ADVANCED_FACE('',(#99),#1175,.T.);
#1255=ADVANCED_FACE('',(#100),#1176,.T.);
#1256=ADVANCED_FACE('',(#101),#1177,.T.);
#1257=ADVANCED_FACE('',(#102),#1178,.F.);
#1258=ADVANCED_FACE('',(#103),#1179,.F.);
#1259=ADVANCED_FACE('',(#104),#1180,.T.);
#1260=ADVANCED_FACE('',(#105),#1181,.T.);
#1261=ADVANCED_FACE('',(#106),#1182,.T.);
#1262=ADVANCED_FACE('',(#107),#1183,.T.);
#1263=ADVANCED_FACE('',(#108),#1184,.T.);
#1264=ADVANCED_FACE('',(#109),#1185,.F.);
#1265=ADVANCED_FACE('',(#110),#1186,.T.);
#1266=ADVANCED_FACE('',(#111),#1187,.T.);
#1267=ADVANCED_FACE('',(#112),#1188,.T.);
#1268=ADVANCED_FACE('',(#113),#1189,.T.);
#1269=ADVANCED_FACE('',(#114),#1190,.T.);
#1270=ADVANCED_FACE('',(#115),#17,.F.);
#1271=ADVANCED_FACE('',(#116),#1191,.T.);
#1272=ADVANCED_FACE('',(#117),#1192,.F.);
#1273=ADVANCED_FACE('',(#118),#1193,.T.);
#1274=ADVANCED_FACE('',(#119),#1194,.T.);
#1275=ADVANCED_FACE('',(#120),#1195,.T.);
#1276=ADVANCED_FACE('',(#121),#1196,.T.);
#1277=ADVANCED_FACE('',(#122,#13,#14),#1197,.T.);
#1278=ADVANCED_FACE('',(#123),#1198,.T.);
#1279=ADVANCED_FACE('',(#124),#1199,.T.);
#1280=ADVANCED_FACE('',(#125),#1200,.T.);
#1281=ADVANCED_FACE('',(#126),#1201,.T.);
#1282=ADVANCED_FACE('',(#127),#1202,.T.);
#1283=CLOSED_SHELL('',(#1203,#1204,#1205,#1206,#1207,#1208,#1209));
#1284=CLOSED_SHELL('',(#1210,#1211,#1212,#1213,#1214,#1215));
#1285=CLOSED_SHELL('',(#1216,#1217,#1218,#1219,#1220,#1221));
#1286=CLOSED_SHELL('',(#1222,#1223,#1224,#1225,#1226,#1227));
#1287=CLOSED_SHELL('',(#1228,#1229,#1230,#1231,#1232,#1233));
#1288=CLOSED_SHELL('',(#1234,#1235,#1236,#1237,#1238,#1239));
#1289=CLOSED_SHELL('',(#1240,#1241,#1242,#1243,#1244,#1245));
#1290=CLOSED_SHELL('',(#1246,#1247,#1248,#1249,#1250,#1251));
#1291=CLOSED_SHELL('',(#1252,#1253,#1254,#1255,#1256,#1257));
#1292=CLOSED_SHELL('',(#1258,#1259,#1260,#1261,#1262,#1263));
#1293=CLOSED_SHELL('',(#1264,#1265,#1266,#1267,#1268,#1269));
#1294=CLOSED_SHELL('',(#1270,#1271,#1272,#1273,#1274,#1275,#1276,#1277,
#1278,#1279,#1280,#1281,#1282));
#1295=DERIVED_UNIT_ELEMENT(#1297,1.);
#1296=DERIVED_UNIT_ELEMENT(#2072,-3.);
#1297=(
MASS_UNIT()
NAMED_UNIT(*)
SI_UNIT(.KILO.,.GRAM.)
);
#1298=DERIVED_UNIT((#1295,#1296));
#1299=MEASURE_REPRESENTATION_ITEM('density measure',
POSITIVE_RATIO_MEASURE(7850.),#1298);
#1300=PROPERTY_DEFINITION_REPRESENTATION(#1305,#1302);
#1301=PROPERTY_DEFINITION_REPRESENTATION(#1306,#1303);
#1302=REPRESENTATION('material name',(#1304),#2069);
#1303=REPRESENTATION('density',(#1299),#2069);
#1304=DESCRIPTIVE_REPRESENTATION_ITEM('Steel','Steel');
#1305=PROPERTY_DEFINITION('material property','material name',#2079);
#1306=PROPERTY_DEFINITION('material property','density of part',#2079);
#1307=AXIS2_PLACEMENT_3D('',#1716,#1390,#1391);
#1308=AXIS2_PLACEMENT_3D('',#1717,#1392,#1393);
#1309=AXIS2_PLACEMENT_3D('',#1728,#1399,#1400);
#1310=AXIS2_PLACEMENT_3D('',#1734,#1404,#1405);
#1311=AXIS2_PLACEMENT_3D('',#1738,#1408,#1409);
#1312=AXIS2_PLACEMENT_3D('',#1742,#1412,#1413);
#1313=AXIS2_PLACEMENT_3D('',#1746,#1416,#1417);
#1314=AXIS2_PLACEMENT_3D('',#1748,#1419,#1420);
#1315=AXIS2_PLACEMENT_3D('',#1749,#1421,#1422);
#1316=AXIS2_PLACEMENT_3D('',#1758,#1427,#1428);
#1317=AXIS2_PLACEMENT_3D('',#1764,#1432,#1433);
#1318=AXIS2_PLACEMENT_3D('',#1768,#1436,#1437);
#1319=AXIS2_PLACEMENT_3D('',#1772,#1440,#1441);
#1320=AXIS2_PLACEMENT_3D('',#1774,#1443,#1444);
#1321=AXIS2_PLACEMENT_3D('',#1775,#1445,#1446);
#1322=AXIS2_PLACEMENT_3D('',#1784,#1451,#1452);
#1323=AXIS2_PLACEMENT_3D('',#1790,#1456,#1457);
#1324=AXIS2_PLACEMENT_3D('',#1794,#1460,#1461);
#1325=AXIS2_PLACEMENT_3D('',#1798,#1464,#1465);
#1326=AXIS2_PLACEMENT_3D('',#1800,#1467,#1468);
#1327=AXIS2_PLACEMENT_3D('',#1801,#1469,#1470);
#1328=AXIS2_PLACEMENT_3D('',#1810,#1475,#1476);
#1329=AXIS2_PLACEMENT_3D('',#1816,#1480,#1481);
#1330=AXIS2_PLACEMENT_3D('',#1820,#1484,#1485);
#1331=AXIS2_PLACEMENT_3D('',#1824,#1488,#1489);
#1332=AXIS2_PLACEMENT_3D('',#1826,#1491,#1492);
#1333=AXIS2_PLACEMENT_3D('',#1827,#1493,#1494);
#1334=AXIS2_PLACEMENT_3D('',#1836,#1499,#1500);
#1335=AXIS2_PLACEMENT_3D('',#1842,#1504,#1505);
#1336=AXIS2_PLACEMENT_3D('',#1846,#1508,#1509);
#1337=AXIS2_PLACEMENT_3D('',#1850,#1512,#1513);
#1338=AXIS2_PLACEMENT_3D('',#1852,#1515,#1516);
#1339=AXIS2_PLACEMENT_3D('',#1853,#1517,#1518);
#1340=AXIS2_PLACEMENT_3D('',#1862,#1523,#1524);
#1341=AXIS2_PLACEMENT_3D('',#1868,#1528,#1529);
#1342=AXIS2_PLACEMENT_3D('',#1872,#1532,#1533);
#1343=AXIS2_PLACEMENT_3D('',#1876,#1536,#1537);
#1344=AXIS2_PLACEMENT_3D('',#1878,#1539,#1540);
#1345=AXIS2_PLACEMENT_3D('',#1879,#1541,#1542);
#1346=AXIS2_PLACEMENT_3D('',#1888,#1547,#1548);
#1347=AXIS2_PLACEMENT_3D('',#1894,#1552,#1553);
#1348=AXIS2_PLACEMENT_3D('',#1898,#1556,#1557);
#1349=AXIS2_PLACEMENT_3D('',#1902,#1560,#1561);
#1350=AXIS2_PLACEMENT_3D('',#1904,#1563,#1564);
#1351=AXIS2_PLACEMENT_3D('',#1905,#1565,#1566);
#1352=AXIS2_PLACEMENT_3D('',#1914,#1571,#1572);
#1353=AXIS2_PLACEMENT_3D('',#1920,#1576,#1577);
#1354=AXIS2_PLACEMENT_3D('',#1924,#1580,#1581);
#1355=AXIS2_PLACEMENT_3D('',#1928,#1584,#1585);
#1356=AXIS2_PLACEMENT_3D('',#1930,#1587,#1588);
#1357=AXIS2_PLACEMENT_3D('',#1931,#1589,#1590);
#1358=AXIS2_PLACEMENT_3D('',#1940,#1595,#1596);
#1359=AXIS2_PLACEMENT_3D('',#1946,#1600,#1601);
#1360=AXIS2_PLACEMENT_3D('',#1950,#1604,#1605);
#1361=AXIS2_PLACEMENT_3D('',#1954,#1608,#1609);
#1362=AXIS2_PLACEMENT_3D('',#1956,#1611,#1612);
#1363=AXIS2_PLACEMENT_3D('',#1957,#1613,#1614);
#1364=AXIS2_PLACEMENT_3D('',#1966,#1619,#1620);
#1365=AXIS2_PLACEMENT_3D('',#1972,#1624,#1625);
#1366=AXIS2_PLACEMENT_3D('',#1976,#1628,#1629);
#1367=AXIS2_PLACEMENT_3D('',#1980,#1632,#1633);
#1368=AXIS2_PLACEMENT_3D('',#1982,#1635,#1636);
#1369=AXIS2_PLACEMENT_3D('',#1983,#1637,#1638);
#1370=AXIS2_PLACEMENT_3D('',#1992,#1643,#1644);
#1371=AXIS2_PLACEMENT_3D('',#1998,#1648,#1649);
#1372=AXIS2_PLACEMENT_3D('',#2002,#1652,#1653);
#1373=AXIS2_PLACEMENT_3D('',#2006,#1656,#1657);
#1374=AXIS2_PLACEMENT_3D('',#2008,#1659,#1660);
#1375=AXIS2_PLACEMENT_3D('',#2009,#1661,#1662);
#1376=AXIS2_PLACEMENT_3D('',#2011,#1663,#1664);
#1377=AXIS2_PLACEMENT_3D('',#2014,#1666,#1667);
#1378=AXIS2_PLACEMENT_3D('',#2015,#1668,#1669);
#1379=AXIS2_PLACEMENT_3D('',#2016,#1670,#1671);
#1380=AXIS2_PLACEMENT_3D('',#2025,#1676,#1677);
#1381=AXIS2_PLACEMENT_3D('',#2031,#1681,#1682);
#1382=AXIS2_PLACEMENT_3D('',#2035,#1685,#1686);
#1383=AXIS2_PLACEMENT_3D('',#2039,#1689,#1690);
#1384=AXIS2_PLACEMENT_3D('',#2041,#1692,#1693);
#1385=AXIS2_PLACEMENT_3D('',#2050,#1698,#1699);
#1386=AXIS2_PLACEMENT_3D('',#2056,#1703,#1704);
#1387=AXIS2_PLACEMENT_3D('',#2060,#1707,#1708);
#1388=AXIS2_PLACEMENT_3D('',#2064,#1711,#1712);
#1389=AXIS2_PLACEMENT_3D('',#2066,#1714,#1715);
#1390=DIRECTION('axis',(0.,0.,1.));
#1391=DIRECTION('refdir',(1.,0.,0.));
#1392=DIRECTION('center_axis',(0.,0.,-1.));
#1393=DIRECTION('ref_axis',(1.,1.22464679914735E-16,0.));
#1394=DIRECTION('',(0.707106781186548,0.707106781186548,0.));
#1395=DIRECTION('',(1.,1.22464679914735E-16,0.));
#1396=DIRECTION('',(1.22464679914735E-16,-1.,0.));
#1397=DIRECTION('',(-1.,-1.22464679914735E-16,0.));
#1398=DIRECTION('',(-1.22464679914735E-16,1.,0.));
#1399=DIRECTION('center_axis',(-1.22464679914735E-16,1.,0.));
#1400=DIRECTION('ref_axis',(0.,0.,-1.));
#1401=DIRECTION('',(0.,0.,1.));
#1402=DIRECTION('',(1.,1.22464679914735E-16,0.));
#1403=DIRECTION('',(0.,0.,-1.));
#1404=DIRECTION('center_axis',(-0.707106781186548,0.707106781186547,0.));
#1405=DIRECTION('ref_axis',(-0.707106781186547,-0.707106781186548,0.));
#1406=DIRECTION('',(0.,0.,1.));
#1407=DIRECTION('',(0.707106781186548,0.707106781186548,0.));
#1408=DIRECTION('center_axis',(-1.,-1.22464679914735E-16,0.));
#1409=DIRECTION('ref_axis',(0.,0.,-1.));
#1410=DIRECTION('',(0.,0.,1.));
#1411=DIRECTION('',(-1.22464679914735E-16,1.,0.));
#1412=DIRECTION('center_axis',(1.22464679914735E-16,-1.,0.));
#1413=DIRECTION('ref_axis',(0.,0.,1.));
#1414=DIRECTION('',(0.,0.,1.));
#1415=DIRECTION('',(-1.,-1.22464679914735E-16,0.));
#1416=DIRECTION('center_axis',(1.,1.22464679914735E-16,0.));
#1417=DIRECTION('ref_axis',(0.,0.,1.));
#1418=DIRECTION('',(1.22464679914735E-16,-1.,0.));
#1419=DIRECTION('center_axis',(0.,0.,-1.));
#1420=DIRECTION('ref_axis',(1.,1.22464679914735E-16,0.));
#1421=DIRECTION('center_axis',(0.,0.,-1.));
#1422=DIRECTION('ref_axis',(1.,1.22464679914735E-16,0.));
#1423=DIRECTION('',(-1.22464679914735E-16,1.,0.));
#1424=DIRECTION('',(-1.,-1.22464679914735E-16,0.));
#1425=DIRECTION('',(1.22464679914735E-16,-1.,0.));
#1426=DIRECTION('',(1.,1.22464679914735E-16,0.));
#1427=DIRECTION('center_axis',(-1.22464679914735E-16,1.,0.));
#1428=DIRECTION('ref_axis',(0.,0.,-1.));
#1429=DIRECTION('',(-1.,-1.22464679914735E-16,0.));
#1430=DIRECTION('',(0.,0.,1.));
#1431=DIRECTION('',(0.,0.,-1.));
#1432=DIRECTION('center_axis',(-1.,-1.22464679914735E-16,0.));
#1433=DIRECTION('ref_axis',(0.,0.,-1.));
#1434=DIRECTION('',(1.22464679914735E-16,-1.,0.));
#1435=DIRECTION('',(0.,0.,1.));
#1436=DIRECTION('center_axis',(1.22464679914735E-16,-1.,0.));
#1437=DIRECTION('ref_axis',(0.,0.,1.));
#1438=DIRECTION('',(1.,1.22464679914735E-16,0.));
#1439=DIRECTION('',(0.,0.,1.));
#1440=DIRECTION('center_axis',(1.,1.22464679914735E-16,0.));
#1441=DIRECTION('ref_axis',(0.,0.,1.));
#1442=DIRECTION('',(-1.22464679914735E-16,1.,0.));
#1443=DIRECTION('center_axis',(0.,0.,-1.));
#1444=DIRECTION('ref_axis',(1.,1.22464679914735E-16,0.));
#1445=DIRECTION('center_axis',(0.,0.,-1.));
#1446=DIRECTION('ref_axis',(1.,1.22464679914735E-16,0.));
#1447=DIRECTION('',(-1.22464679914735E-16,1.,0.));
#1448=DIRECTION('',(-1.,-1.22464679914735E-16,0.));
#1449=DIRECTION('',(1.22464679914735E-16,-1.,0.));
#1450=DIRECTION('',(1.,1.22464679914735E-16,0.));
#1451=DIRECTION('center_axis',(-1.22464679914735E-16,1.,0.));
#1452=DIRECTION('ref_axis',(0.,0.,-1.));
#1453=DIRECTION('',(-1.,-1.22464679914735E-16,0.));
#1454=DIRECTION('',(0.,0.,1.));
#1455=DIRECTION('',(0.,0.,-1.));
#1456=DIRECTION('center_axis',(-1.,-1.22464679914735E-16,0.));
#1457=DIRECTION('ref_axis',(0.,0.,-1.));
#1458=DIRECTION('',(1.22464679914735E-16,-1.,0.));
#1459=DIRECTION('',(0.,0.,1.));
#1460=DIRECTION('center_axis',(1.22464679914735E-16,-1.,0.));
#1461=DIRECTION('ref_axis',(0.,0.,1.));
#1462=DIRECTION('',(1.,1.22464679914735E-16,0.));
#1463=DIRECTION('',(0.,0.,1.));
#1464=DIRECTION('center_axis',(1.,1.22464679914735E-16,0.));
#1465=DIRECTION('ref_axis',(0.,0.,1.));
#1466=DIRECTION('',(-1.22464679914735E-16,1.,0.));
#1467=DIRECTION('center_axis',(0.,0.,-1.));
#1468=DIRECTION('ref_axis',(1.,1.22464679914735E-16,0.));
#1469=DIRECTION('center_axis',(0.,0.,-1.));
#1470=DIRECTION('ref_axis',(1.,1.22464679914735E-16,0.));
#1471=DIRECTION('',(-1.22464679914735E-16,1.,0.));
#1472=DIRECTION('',(-1.,-1.22464679914735E-16,0.));
#1473=DIRECTION('',(1.22464679914735E-16,-1.,0.));
#1474=DIRECTION('',(1.,1.22464679914735E-16,0.));
#1475=DIRECTION('center_axis',(-1.22464679914735E-16,1.,0.));
#1476=DIRECTION('ref_axis',(0.,0.,-1.));
#1477=DIRECTION('',(-1.,-1.22464679914735E-16,0.));
#1478=DIRECTION('',(0.,0.,1.));
#1479=DIRECTION('',(0.,0.,-1.));
#1480=DIRECTION('center_axis',(-1.,-1.22464679914735E-16,0.));
#1481=DIRECTION('ref_axis',(0.,0.,-1.));
#1482=DIRECTION('',(1.22464679914735E-16,-1.,0.));
#1483=DIRECTION('',(0.,0.,1.));
#1484=DIRECTION('center_axis',(1.22464679914735E-16,-1.,0.));
#1485=DIRECTION('ref_axis',(0.,0.,1.));
#1486=DIRECTION('',(1.,1.22464679914735E-16,0.));
#1487=DIRECTION('',(0.,0.,1.));
#1488=DIRECTION('center_axis',(1.,1.22464679914735E-16,0.));
#1489=DIRECTION('ref_axis',(0.,0.,1.));
#1490=DIRECTION('',(-1.22464679914735E-16,1.,0.));
#1491=DIRECTION('center_axis',(0.,0.,-1.));
#1492=DIRECTION('ref_axis',(1.,1.22464679914735E-16,0.));
#1493=DIRECTION('center_axis',(0.,0.,-1.));
#1494=DIRECTION('ref_axis',(1.,1.22464679914735E-16,0.));
#1495=DIRECTION('',(-1.22464679914735E-16,1.,0.));
#1496=DIRECTION('',(-1.,-1.22464679914735E-16,0.));
#1497=DIRECTION('',(1.22464679914735E-16,-1.,0.));
#1498=DIRECTION('',(1.,1.22464679914735E-16,0.));
#1499=DIRECTION('center_axis',(-1.22464679914735E-16,1.,0.));
#1500=DIRECTION('ref_axis',(0.,0.,-1.));
#1501=DIRECTION('',(-1.,-1.22464679914735E-16,0.));
#1502=DIRECTION('',(0.,0.,1.));
#1503=DIRECTION('',(0.,0.,-1.));
#1504=DIRECTION('center_axis',(-1.,-1.22464679914735E-16,0.));
#1505=DIRECTION('ref_axis',(0.,0.,-1.));
#1506=DIRECTION('',(1.22464679914735E-16,-1.,0.));
#1507=DIRECTION('',(0.,0.,1.));
#1508=DIRECTION('center_axis',(1.22464679914735E-16,-1.,0.));
#1509=DIRECTION('ref_axis',(0.,0.,1.));
#1510=DIRECTION('',(1.,1.22464679914735E-16,0.));
#1511=DIRECTION('',(0.,0.,1.));
#1512=DIRECTION('center_axis',(1.,1.22464679914735E-16,0.));
#1513=DIRECTION('ref_axis',(0.,0.,1.));
#1514=DIRECTION('',(-1.22464679914735E-16,1.,0.));
#1515=DIRECTION('center_axis',(0.,0.,-1.));
#1516=DIRECTION('ref_axis',(1.,1.22464679914735E-16,0.));
#1517=DIRECTION('center_axis',(0.,0.,-1.));
#1518=DIRECTION('ref_axis',(1.,1.22464679914735E-16,0.));
#1519=DIRECTION('',(-1.22464679914735E-16,1.,0.));
#1520=DIRECTION('',(-1.,-1.22464679914735E-16,0.));
#1521=DIRECTION('',(1.22464679914735E-16,-1.,0.));
#1522=DIRECTION('',(1.,1.22464679914735E-16,0.));
#1523=DIRECTION('center_axis',(-1.22464679914735E-16,1.,0.));
#1524=DIRECTION('ref_axis',(0.,0.,-1.));
#1525=DIRECTION('',(-1.,-1.22464679914735E-16,0.));
#1526=DIRECTION('',(0.,0.,1.));
#1527=DIRECTION('',(0.,0.,-1.));
#1528=DIRECTION('center_axis',(-1.,-1.22464679914735E-16,0.));
#1529=DIRECTION('ref_axis',(0.,0.,-1.));
#1530=DIRECTION('',(1.22464679914735E-16,-1.,0.));
#1531=DIRECTION('',(0.,0.,1.));
#1532=DIRECTION('center_axis',(1.22464679914735E-16,-1.,0.));
#1533=DIRECTION('ref_axis',(0.,0.,1.));
#1534=DIRECTION('',(1.,1.22464679914735E-16,0.));
#1535=DIRECTION('',(0.,0.,1.));
#1536=DIRECTION('center_axis',(1.,1.22464679914735E-16,0.));
#1537=DIRECTION('ref_axis',(0.,0.,1.));
#1538=DIRECTION('',(-1.22464679914735E-16,1.,0.));
#1539=DIRECTION('center_axis',(0.,0.,-1.));
#1540=DIRECTION('ref_axis',(1.,1.22464679914735E-16,0.));
#1541=DIRECTION('center_axis',(0.,0.,-1.));
#1542=DIRECTION('ref_axis',(1.,1.22464679914735E-16,0.));
#1543=DIRECTION('',(-1.22464679914735E-16,1.,0.));
#1544=DIRECTION('',(-1.,-1.22464679914735E-16,0.));
#1545=DIRECTION('',(1.22464679914735E-16,-1.,0.));
#1546=DIRECTION('',(1.,1.22464679914735E-16,0.));
#1547=DIRECTION('center_axis',(-1.22464679914735E-16,1.,0.));
#1548=DIRECTION('ref_axis',(0.,0.,-1.));
#1549=DIRECTION('',(-1.,-1.22464679914735E-16,0.));
#1550=DIRECTION('',(0.,0.,1.));
#1551=DIRECTION('',(0.,0.,-1.));
#1552=DIRECTION('center_axis',(-1.,-1.22464679914735E-16,0.));
#1553=DIRECTION('ref_axis',(0.,0.,-1.));
#1554=DIRECTION('',(1.22464679914735E-16,-1.,0.));
#1555=DIRECTION('',(0.,0.,1.));
#1556=DIRECTION('center_axis',(1.22464679914735E-16,-1.,0.));
#1557=DIRECTION('ref_axis',(0.,0.,1.));
#1558=DIRECTION('',(1.,1.22464679914735E-16,0.));
#1559=DIRECTION('',(0.,0.,1.));
#1560=DIRECTION('center_axis',(1.,1.22464679914735E-16,0.));
#1561=DIRECTION('ref_axis',(0.,0.,1.));
#1562=DIRECTION('',(-1.22464679914735E-16,1.,0.));
#1563=DIRECTION('center_axis',(0.,0.,-1.));
#1564=DIRECTION('ref_axis',(1.,1.22464679914735E-16,0.));
#1565=DIRECTION('center_axis',(1.22464679914735E-16,-1.,0.));
#1566=DIRECTION('ref_axis',(0.,0.,1.));
#1567=DIRECTION('',(-1.,-1.22464679914735E-16,0.));
#1568=DIRECTION('',(0.,0.,-1.));
#1569=DIRECTION('',(1.,1.22464679914735E-16,0.));
#1570=DIRECTION('',(0.,0.,1.));
#1571=DIRECTION('center_axis',(-1.,-1.22464679914735E-16,0.));
#1572=DIRECTION('ref_axis',(0.,0.,-1.));
#1573=DIRECTION('',(-1.22464679914735E-16,1.,0.));
#1574=DIRECTION('',(0.,0.,-1.));
#1575=DIRECTION('',(1.22464679914735E-16,-1.,0.));
#1576=DIRECTION('center_axis',(0.,0.,1.));
#1577=DIRECTION('ref_axis',(-1.,-1.22464679914735E-16,0.));
#1578=DIRECTION('',(-1.22464679914735E-16,1.,0.));
#1579=DIRECTION('',(-1.,-1.22464679914735E-16,0.));
#1580=DIRECTION('center_axis',(1.,1.22464679914735E-16,0.));
#1581=DIRECTION('ref_axis',(0.,0.,1.));
#1582=DIRECTION('',(-1.22464679914735E-16,1.,0.));
#1583=DIRECTION('',(0.,0.,1.));
#1584=DIRECTION('center_axis',(0.,0.,-1.));
#1585=DIRECTION('ref_axis',(1.,1.22464679914735E-16,0.));
#1586=DIRECTION('',(1.,1.22464679914735E-16,0.));
#1587=DIRECTION('center_axis',(1.22464679914735E-16,-1.,0.));
#1588=DIRECTION('ref_axis',(0.,0.,1.));
#1589=DIRECTION('center_axis',(-1.22464679914735E-16,1.,0.));
#1590=DIRECTION('ref_axis',(0.,0.,-1.));
#1591=DIRECTION('',(1.,1.22464679914735E-16,0.));
#1592=DIRECTION('',(0.,0.,-1.));
#1593=DIRECTION('',(-1.,-1.22464679914735E-16,0.));
#1594=DIRECTION('',(0.,0.,1.));
#1595=DIRECTION('center_axis',(1.,1.22464679914735E-16,0.));
#1596=DIRECTION('ref_axis',(0.,0.,1.));
#1597=DIRECTION('',(1.22464679914735E-16,-1.,0.));
#1598=DIRECTION('',(0.,0.,-1.));
#1599=DIRECTION('',(-1.22464679914735E-16,1.,0.));
#1600=DIRECTION('center_axis',(0.,0.,1.));
#1601=DIRECTION('ref_axis',(-1.,-1.22464679914735E-16,0.));
#1602=DIRECTION('',(1.22464679914735E-16,-1.,0.));
#1603=DIRECTION('',(1.,1.22464679914735E-16,0.));
#1604=DIRECTION('center_axis',(-1.,-1.22464679914735E-16,0.));
#1605=DIRECTION('ref_axis',(0.,0.,-1.));
#1606=DIRECTION('',(1.22464679914735E-16,-1.,0.));
#1607=DIRECTION('',(0.,0.,1.));
#1608=DIRECTION('center_axis',(0.,0.,-1.));
#1609=DIRECTION('ref_axis',(1.,1.22464679914735E-16,0.));
#1610=DIRECTION('',(-1.,-1.22464679914735E-16,0.));
#1611=DIRECTION('center_axis',(-1.22464679914735E-16,1.,0.));
#1612=DIRECTION('ref_axis',(0.,0.,-1.));
#1613=DIRECTION('center_axis',(0.,0.,-1.));
#1614=DIRECTION('ref_axis',(1.,1.22464679914735E-16,0.));
#1615=DIRECTION('',(-1.22464679914735E-16,1.,0.));
#1616=DIRECTION('',(-1.,-1.22464679914735E-16,0.));
#1617=DIRECTION('',(1.22464679914735E-16,-1.,0.));
#1618=DIRECTION('',(1.,1.22464679914735E-16,0.));
#1619=DIRECTION('center_axis',(-1.22464679914735E-16,1.,0.));
#1620=DIRECTION('ref_axis',(0.,0.,-1.));
#1621=DIRECTION('',(-1.,-1.22464679914735E-16,0.));
#1622=DIRECTION('',(0.,0.,1.));
#1623=DIRECTION('',(0.,0.,-1.));
#1624=DIRECTION('center_axis',(-1.,-1.22464679914735E-16,0.));
#1625=DIRECTION('ref_axis',(0.,0.,-1.));
#1626=DIRECTION('',(1.22464679914735E-16,-1.,0.));
#1627=DIRECTION('',(0.,0.,1.));
#1628=DIRECTION('center_axis',(1.22464679914735E-16,-1.,0.));
#1629=DIRECTION('ref_axis',(0.,0.,1.));
#1630=DIRECTION('',(1.,1.22464679914735E-16,0.));
#1631=DIRECTION('',(0.,0.,1.));
#1632=DIRECTION('center_axis',(1.,1.22464679914735E-16,0.));
#1633=DIRECTION('ref_axis',(0.,0.,1.));
#1634=DIRECTION('',(-1.22464679914735E-16,1.,0.));
#1635=DIRECTION('center_axis',(0.,0.,-1.));
#1636=DIRECTION('ref_axis',(1.,1.22464679914735E-16,0.));
#1637=DIRECTION('center_axis',(0.,0.,-1.));
#1638=DIRECTION('ref_axis',(1.,1.22464679914735E-16,0.));
#1639=DIRECTION('',(-1.22464679914735E-16,1.,0.));
#1640=DIRECTION('',(-1.,-1.22464679914735E-16,0.));
#1641=DIRECTION('',(1.22464679914735E-16,-1.,0.));
#1642=DIRECTION('',(1.,1.22464679914735E-16,0.));
#1643=DIRECTION('center_axis',(-1.22464679914735E-16,1.,0.));
#1644=DIRECTION('ref_axis',(0.,0.,-1.));
#1645=DIRECTION('',(-1.,-1.22464679914735E-16,0.));
#1646=DIRECTION('',(0.,0.,1.));
#1647=DIRECTION('',(0.,0.,-1.));
#1648=DIRECTION('center_axis',(-1.,-1.22464679914735E-16,0.));
#1649=DIRECTION('ref_axis',(0.,0.,-1.));
#1650=DIRECTION('',(1.22464679914735E-16,-1.,0.));
#1651=DIRECTION('',(0.,0.,1.));
#1652=DIRECTION('center_axis',(1.22464679914735E-16,-1.,0.));
#1653=DIRECTION('ref_axis',(0.,0.,1.));
#1654=DIRECTION('',(1.,1.22464679914735E-16,0.));
#1655=DIRECTION('',(0.,0.,1.));
#1656=DIRECTION('center_axis',(1.,1.22464679914735E-16,0.));
#1657=DIRECTION('ref_axis',(0.,0.,1.));
#1658=DIRECTION('',(-1.22464679914735E-16,1.,0.));
#1659=DIRECTION('center_axis',(0.,0.,-1.));
#1660=DIRECTION('ref_axis',(1.,1.22464679914735E-16,0.));
#1661=DIRECTION('center_axis',(0.,0.,-1.));
#1662=DIRECTION('ref_axis',(-1.,0.,0.));
#1663=DIRECTION('center_axis',(0.,0.,-1.));
#1664=DIRECTION('ref_axis',(-1.,0.,0.));
#1665=DIRECTION('',(0.,0.,-1.));
#1666=DIRECTION('center_axis',(0.,0.,-1.));
#1667=DIRECTION('ref_axis',(-1.,0.,0.));
#1668=DIRECTION('center_axis',(0.,0.,1.));
#1669=DIRECTION('ref_axis',(-1.,0.,0.));
#1670=DIRECTION('center_axis',(0.,0.,1.));
#1671=DIRECTION('ref_axis',(-1.,-1.22464679914735E-16,0.));
#1672=DIRECTION('',(-1.22464679914735E-16,1.,0.));
#1673=DIRECTION('',(1.,1.22464679914735E-16,0.));
#1674=DIRECTION('',(1.22464679914735E-16,-1.,0.));
#1675=DIRECTION('',(-1.,-1.22464679914735E-16,0.));
#1676=DIRECTION('center_axis',(-1.22464679914735E-16,1.,0.));
#1677=DIRECTION('ref_axis',(0.,0.,-1.));
#1678=DIRECTION('',(1.,1.22464679914735E-16,0.));
#1679=DIRECTION('',(0.,0.,-1.));
#1680=DIRECTION('',(0.,0.,1.));
#1681=DIRECTION('center_axis',(1.,1.22464679914735E-16,0.));
#1682=DIRECTION('ref_axis',(0.,0.,1.));
#1683=DIRECTION('',(1.22464679914735E-16,-1.,0.));
#1684=DIRECTION('',(0.,0.,-1.));
#1685=DIRECTION('center_axis',(1.22464679914735E-16,-1.,0.));
#1686=DIRECTION('ref_axis',(0.,0.,1.));
#1687=DIRECTION('',(-1.,-1.22464679914735E-16,0.));
#1688=DIRECTION('',(0.,0.,-1.));
#1689=DIRECTION('center_axis',(-1.,-1.22464679914735E-16,0.));
#1690=DIRECTION('ref_axis',(0.,0.,-1.));
#1691=DIRECTION('',(-1.22464679914735E-16,1.,0.));
#1692=DIRECTION('center_axis',(0.,0.,1.));
#1693=DIRECTION('ref_axis',(-1.,-1.22464679914735E-16,0.));
#1694=DIRECTION('',(1.22464679914735E-16,-1.,0.));
#1695=DIRECTION('',(-1.,-1.22464679914735E-16,0.));
#1696=DIRECTION('',(-1.22464679914735E-16,1.,0.));
#1697=DIRECTION('',(1.,1.22464679914735E-16,0.));
#1698=DIRECTION('center_axis',(1.22464679914735E-16,-1.,0.));
#1699=DIRECTION('ref_axis',(0.,0.,1.));
#1700=DIRECTION('',(-1.,-1.22464679914735E-16,0.));
#1701=DIRECTION('',(0.,0.,-1.));
#1702=DIRECTION('',(0.,0.,1.));
#1703=DIRECTION('center_axis',(1.,1.22464679914735E-16,0.));
#1704=DIRECTION('ref_axis',(0.,0.,1.));
#1705=DIRECTION('',(1.22464679914735E-16,-1.,0.));
#1706=DIRECTION('',(0.,0.,1.));
#1707=DIRECTION('center_axis',(-1.22464679914735E-16,1.,0.));
#1708=DIRECTION('ref_axis',(0.,0.,-1.));
#1709=DIRECTION('',(1.,1.22464679914735E-16,0.));
#1710=DIRECTION('',(0.,0.,1.));
#1711=DIRECTION('center_axis',(-1.,-1.22464679914735E-16,0.));
#1712=DIRECTION('ref_axis',(0.,0.,-1.));
#1713=DIRECTION('',(-1.22464679914735E-16,1.,0.));
#1714=DIRECTION('center_axis',(0.,0.,1.));
#1715=DIRECTION('ref_axis',(-1.,-1.22464679914735E-16,0.));
#1716=CARTESIAN_POINT('',(0.,0.,0.));
#1717=CARTESIAN_POINT('Origin',(0.,0.,-6.93889390390723E-17));
#1718=CARTESIAN_POINT('',(-0.55,0.725,-6.93889390390723E-17));
#1719=CARTESIAN_POINT('',(-0.3,0.975,-6.93889390390723E-17));
#1720=CARTESIAN_POINT('',(-0.55,0.725,-6.93889390390723E-17));
#1721=CARTESIAN_POINT('',(0.55,0.975,-6.93889390390723E-17));
#1722=CARTESIAN_POINT('',(-1.19403062916867E-16,0.975,-6.93889390390723E-17));
#1723=CARTESIAN_POINT('',(0.55,-0.975,-6.93889390390723E-17));
#1724=CARTESIAN_POINT('',(0.55,6.73555739531044E-17,-6.93889390390723E-17));
#1725=CARTESIAN_POINT('',(-0.55,-0.975,-6.93889390390723E-17));
#1726=CARTESIAN_POINT('',(1.19403062916867E-16,-0.975,-6.93889390390723E-17));
#1727=CARTESIAN_POINT('',(-0.55,-6.73555739531044E-17,-6.93889390390723E-17));
#1728=CARTESIAN_POINT('Origin',(-0.3,0.975,0.0799999999999999));
#1729=CARTESIAN_POINT('',(-0.3,0.975,0.0799999999999999));
#1730=CARTESIAN_POINT('',(-0.3,0.975,0.0799999999999999));
#1731=CARTESIAN_POINT('',(0.55,0.975,0.0799999999999999));
#1732=CARTESIAN_POINT('',(-1.19403062916867E-16,0.975,0.0799999999999999));
#1733=CARTESIAN_POINT('',(0.55,0.975,0.0799999999999999));
#1734=CARTESIAN_POINT('Origin',(-0.55,0.725,0.0799999999999999));
#1735=CARTESIAN_POINT('',(-0.55,0.725,0.0799999999999999));
#1736=CARTESIAN_POINT('',(-0.55,0.725,0.0799999999999999));
#1737=CARTESIAN_POINT('',(-0.55,0.725,0.0799999999999999));
#1738=CARTESIAN_POINT('Origin',(-0.55,-0.975,0.0799999999999999));
#1739=CARTESIAN_POINT('',(-0.55,-0.975,0.0799999999999999));
#1740=CARTESIAN_POINT('',(-0.55,-0.975,0.0799999999999999));
#1741=CARTESIAN_POINT('',(-0.55,-6.73555739531044E-17,0.0799999999999999));
#1742=CARTESIAN_POINT('Origin',(0.55,-0.975,0.0799999999999999));
#1743=CARTESIAN_POINT('',(0.55,-0.975,0.0799999999999999));
#1744=CARTESIAN_POINT('',(0.55,-0.975,0.0799999999999999));
#1745=CARTESIAN_POINT('',(1.19403062916867E-16,-0.975,0.0799999999999999));
#1746=CARTESIAN_POINT('Origin',(0.55,0.975,0.0799999999999999));
#1747=CARTESIAN_POINT('',(0.55,0.975,0.0799999999999999));
#1748=CARTESIAN_POINT('Origin',(0.,0.,0.0799999999999999));
#1749=CARTESIAN_POINT('Origin',(0.,0.,0.0799999999999999));
#1750=CARTESIAN_POINT('',(-1.3,0.775,0.0799999999999999));
#1751=CARTESIAN_POINT('',(-1.3,1.175,0.0799999999999999));
#1752=CARTESIAN_POINT('',(-1.3,-1.59204083889156E-16,0.0799999999999999));
#1753=CARTESIAN_POINT('',(-0.8,0.775,0.0799999999999999));
#1754=CARTESIAN_POINT('',(-9.49101269339199E-17,0.775,0.0799999999999999));
#1755=CARTESIAN_POINT('',(-0.8,1.175,0.0799999999999999));
#1756=CARTESIAN_POINT('',(-0.8,-9.79717439317883E-17,0.0799999999999999));
#1757=CARTESIAN_POINT('',(-1.43895998899814E-16,1.175,0.0799999999999999));
#1758=CARTESIAN_POINT('Origin',(-1.3,1.175,0.0799999999999999));
#1759=CARTESIAN_POINT('',(-0.8,1.175,-6.93889390390723E-17));
#1760=CARTESIAN_POINT('',(-1.3,1.175,-6.93889390390723E-17));
#1761=CARTESIAN_POINT('',(-1.3,1.175,-6.93889390390723E-17));
#1762=CARTESIAN_POINT('',(-1.3,1.175,0.0799999999999999));
#1763=CARTESIAN_POINT('',(-0.8,1.175,0.0799999999999999));
#1764=CARTESIAN_POINT('Origin',(-1.3,0.775,0.0799999999999999));
#1765=CARTESIAN_POINT('',(-1.3,0.775,-6.93889390390723E-17));
#1766=CARTESIAN_POINT('',(-1.3,0.775,-6.93889390390723E-17));
#1767=CARTESIAN_POINT('',(-1.3,0.775,0.0799999999999999));
#1768=CARTESIAN_POINT('Origin',(-0.8,0.775,0.0799999999999999));
#1769=CARTESIAN_POINT('',(-0.8,0.775,-6.93889390390723E-17));
#1770=CARTESIAN_POINT('',(-0.8,0.775,-6.93889390390723E-17));
#1771=CARTESIAN_POINT('',(-0.8,0.775,0.0799999999999999));
#1772=CARTESIAN_POINT('Origin',(-0.8,1.175,0.0799999999999999));
#1773=CARTESIAN_POINT('',(-0.8,1.175,-6.93889390390723E-17));
#1774=CARTESIAN_POINT('Origin',(0.,0.,-6.93889390390723E-17));
#1775=CARTESIAN_POINT('Origin',(0.,0.,0.0799999999999999));
#1776=CARTESIAN_POINT('',(0.800000000000001,-1.175,0.0799999999999999));
#1777=CARTESIAN_POINT('',(0.800000000000001,-0.775,0.0799999999999999));
#1778=CARTESIAN_POINT('',(0.800000000000001,9.79717439317884E-17,0.0799999999999999));
#1779=CARTESIAN_POINT('',(1.3,-1.175,0.0799999999999999));
#1780=CARTESIAN_POINT('',(1.43895998899814E-16,-1.175,0.0799999999999999));
#1781=CARTESIAN_POINT('',(1.3,-0.775,0.0799999999999999));
#1782=CARTESIAN_POINT('',(1.3,1.59204083889156E-16,0.0799999999999999));
#1783=CARTESIAN_POINT('',(9.49101269339199E-17,-0.775,0.0799999999999999));
#1784=CARTESIAN_POINT('Origin',(0.800000000000001,-0.775,0.0799999999999999));
#1785=CARTESIAN_POINT('',(1.3,-0.775,-6.93889390390723E-17));
#1786=CARTESIAN_POINT('',(0.800000000000001,-0.775,-6.93889390390723E-17));
#1787=CARTESIAN_POINT('',(0.800000000000001,-0.775,-6.93889390390723E-17));
#1788=CARTESIAN_POINT('',(0.800000000000001,-0.775,0.0799999999999999));
#1789=CARTESIAN_POINT('',(1.3,-0.775,0.0799999999999999));
#1790=CARTESIAN_POINT('Origin',(0.800000000000001,-1.175,0.0799999999999999));
#1791=CARTESIAN_POINT('',(0.800000000000001,-1.175,-6.93889390390723E-17));
#1792=CARTESIAN_POINT('',(0.800000000000001,-1.175,-6.93889390390723E-17));
#1793=CARTESIAN_POINT('',(0.800000000000001,-1.175,0.0799999999999999));
#1794=CARTESIAN_POINT('Origin',(1.3,-1.175,0.0799999999999999));
#1795=CARTESIAN_POINT('',(1.3,-1.175,-6.93889390390723E-17));
#1796=CARTESIAN_POINT('',(1.3,-1.175,-6.93889390390723E-17));
#1797=CARTESIAN_POINT('',(1.3,-1.175,0.0799999999999999));
#1798=CARTESIAN_POINT('Origin',(1.3,-0.775,0.0799999999999999));
#1799=CARTESIAN_POINT('',(1.3,-0.775,-6.93889390390723E-17));
#1800=CARTESIAN_POINT('Origin',(0.,0.,-6.93889390390723E-17));
#1801=CARTESIAN_POINT('Origin',(0.,0.,0.0799999999999999));
#1802=CARTESIAN_POINT('',(0.8,0.775,0.0799999999999999));
#1803=CARTESIAN_POINT('',(0.8,1.175,0.0799999999999999));
#1804=CARTESIAN_POINT('',(0.8,9.79717439317883E-17,0.0799999999999999));
#1805=CARTESIAN_POINT('',(1.3,0.775,0.0799999999999999));
#1806=CARTESIAN_POINT('',(-9.49101269339199E-17,0.775,0.0799999999999999));
#1807=CARTESIAN_POINT('',(1.3,1.175,0.0799999999999999));
#1808=CARTESIAN_POINT('',(1.3,1.59204083889156E-16,0.0799999999999999));
#1809=CARTESIAN_POINT('',(-1.43895998899814E-16,1.175,0.0799999999999999));
#1810=CARTESIAN_POINT('Origin',(0.8,1.175,0.0799999999999999));
#1811=CARTESIAN_POINT('',(1.3,1.175,-6.93889390390723E-17));
#1812=CARTESIAN_POINT('',(0.8,1.175,-6.93889390390723E-17));
#1813=CARTESIAN_POINT('',(0.8,1.175,-6.93889390390723E-17));
#1814=CARTESIAN_POINT('',(0.8,1.175,0.0799999999999999));
#1815=CARTESIAN_POINT('',(1.3,1.175,0.0799999999999999));
#1816=CARTESIAN_POINT('Origin',(0.8,0.775,0.0799999999999999));
#1817=CARTESIAN_POINT('',(0.8,0.775,-6.93889390390723E-17));
#1818=CARTESIAN_POINT('',(0.8,0.775,-6.93889390390723E-17));
#1819=CARTESIAN_POINT('',(0.8,0.775,0.0799999999999999));
#1820=CARTESIAN_POINT('Origin',(1.3,0.775,0.0799999999999999));
#1821=CARTESIAN_POINT('',(1.3,0.775,-6.93889390390723E-17));
#1822=CARTESIAN_POINT('',(1.3,0.775,-6.93889390390723E-17));
#1823=CARTESIAN_POINT('',(1.3,0.775,0.0799999999999999));
#1824=CARTESIAN_POINT('Origin',(1.3,1.175,0.0799999999999999));
#1825=CARTESIAN_POINT('',(1.3,1.175,-6.93889390390723E-17));
#1826=CARTESIAN_POINT('Origin',(0.,0.,-6.93889390390723E-17));
#1827=CARTESIAN_POINT('Origin',(0.,0.,0.0799999999999999));
#1828=CARTESIAN_POINT('',(-1.3,0.125,0.0799999999999999));
#1829=CARTESIAN_POINT('',(-1.3,0.524999999999999,0.0799999999999999));
#1830=CARTESIAN_POINT('',(-1.3,-1.59204083889156E-16,0.0799999999999999));
#1831=CARTESIAN_POINT('',(-0.8,0.125,0.0799999999999999));
#1832=CARTESIAN_POINT('',(-1.53080849893419E-17,0.125,0.0799999999999999));
#1833=CARTESIAN_POINT('',(-0.8,0.524999999999999,0.0799999999999999));
#1834=CARTESIAN_POINT('',(-0.8,-9.79717439317883E-17,0.0799999999999999));
#1835=CARTESIAN_POINT('',(-6.42939569552359E-17,0.524999999999999,0.0799999999999999));
#1836=CARTESIAN_POINT('Origin',(-1.3,0.524999999999999,0.0799999999999999));
#1837=CARTESIAN_POINT('',(-0.8,0.524999999999999,-6.93889390390723E-17));
#1838=CARTESIAN_POINT('',(-1.3,0.524999999999999,-6.93889390390723E-17));
#1839=CARTESIAN_POINT('',(-1.3,0.524999999999999,-6.93889390390723E-17));
#1840=CARTESIAN_POINT('',(-1.3,0.524999999999999,0.0799999999999999));
#1841=CARTESIAN_POINT('',(-0.8,0.524999999999999,0.0799999999999999));
#1842=CARTESIAN_POINT('Origin',(-1.3,0.125,0.0799999999999999));
#1843=CARTESIAN_POINT('',(-1.3,0.125,-6.93889390390723E-17));
#1844=CARTESIAN_POINT('',(-1.3,0.125,-6.93889390390723E-17));
#1845=CARTESIAN_POINT('',(-1.3,0.125,0.0799999999999999));
#1846=CARTESIAN_POINT('Origin',(-0.8,0.125,0.0799999999999999));
#1847=CARTESIAN_POINT('',(-0.8,0.125,-6.93889390390723E-17));
#1848=CARTESIAN_POINT('',(-0.8,0.125,-6.93889390390723E-17));
#1849=CARTESIAN_POINT('',(-0.8,0.125,0.0799999999999999));
#1850=CARTESIAN_POINT('Origin',(-0.8,0.524999999999999,0.0799999999999999));
#1851=CARTESIAN_POINT('',(-0.8,0.524999999999999,-6.93889390390723E-17));
#1852=CARTESIAN_POINT('Origin',(0.,0.,-6.93889390390723E-17));
#1853=CARTESIAN_POINT('Origin',(0.,0.,0.0799999999999999));
#1854=CARTESIAN_POINT('',(-1.3,-1.175,0.0799999999999999));
#1855=CARTESIAN_POINT('',(-1.3,-0.775,0.0799999999999999));
#1856=CARTESIAN_POINT('',(-1.3,-1.59204083889156E-16,0.0799999999999999));
#1857=CARTESIAN_POINT('',(-0.799999999999999,-1.175,0.0799999999999999));
#1858=CARTESIAN_POINT('',(1.43895998899814E-16,-1.175,0.0799999999999999));
#1859=CARTESIAN_POINT('',(-0.799999999999999,-0.775,0.0799999999999999));
#1860=CARTESIAN_POINT('',(-0.799999999999999,-9.79717439317881E-17,0.0799999999999999));
#1861=CARTESIAN_POINT('',(9.49101269339199E-17,-0.775,0.0799999999999999));
#1862=CARTESIAN_POINT('Origin',(-1.3,-0.775,0.0799999999999999));
#1863=CARTESIAN_POINT('',(-0.799999999999999,-0.775,-6.93889390390723E-17));
#1864=CARTESIAN_POINT('',(-1.3,-0.775,-6.93889390390723E-17));
#1865=CARTESIAN_POINT('',(-1.3,-0.775,-6.93889390390723E-17));
#1866=CARTESIAN_POINT('',(-1.3,-0.775,0.0799999999999999));
#1867=CARTESIAN_POINT('',(-0.799999999999999,-0.775,0.0799999999999999));
#1868=CARTESIAN_POINT('Origin',(-1.3,-1.175,0.0799999999999999));
#1869=CARTESIAN_POINT('',(-1.3,-1.175,-6.93889390390723E-17));
#1870=CARTESIAN_POINT('',(-1.3,-1.175,-6.93889390390723E-17));
#1871=CARTESIAN_POINT('',(-1.3,-1.175,0.0799999999999999));
#1872=CARTESIAN_POINT('Origin',(-0.799999999999999,-1.175,0.0799999999999999));
#1873=CARTESIAN_POINT('',(-0.799999999999999,-1.175,-6.93889390390723E-17));
#1874=CARTESIAN_POINT('',(-0.799999999999999,-1.175,-6.93889390390723E-17));
#1875=CARTESIAN_POINT('',(-0.799999999999999,-1.175,0.0799999999999999));
#1876=CARTESIAN_POINT('Origin',(-0.799999999999999,-0.775,0.0799999999999999));
#1877=CARTESIAN_POINT('',(-0.799999999999999,-0.775,-6.93889390390723E-17));
#1878=CARTESIAN_POINT('Origin',(0.,0.,-6.93889390390723E-17));
#1879=CARTESIAN_POINT('Origin',(0.,0.,0.0799999999999999));
#1880=CARTESIAN_POINT('',(0.8,-0.525,0.0799999999999999));
#1881=CARTESIAN_POINT('',(0.8,-0.125,0.0799999999999999));
#1882=CARTESIAN_POINT('',(0.8,9.79717439317883E-17,0.0799999999999999));
#1883=CARTESIAN_POINT('',(1.3,-0.525,0.0799999999999999));
#1884=CARTESIAN_POINT('',(6.4293956955236E-17,-0.525,0.0799999999999999));
#1885=CARTESIAN_POINT('',(1.3,-0.125,0.0799999999999999));
#1886=CARTESIAN_POINT('',(1.3,1.59204083889156E-16,0.0799999999999999));
#1887=CARTESIAN_POINT('',(1.53080849893419E-17,-0.125,0.0799999999999999));
#1888=CARTESIAN_POINT('Origin',(0.8,-0.125,0.0799999999999999));
#1889=CARTESIAN_POINT('',(1.3,-0.125,-6.93889390390723E-17));
#1890=CARTESIAN_POINT('',(0.8,-0.125,-6.93889390390723E-17));
#1891=CARTESIAN_POINT('',(0.8,-0.125,-6.93889390390723E-17));
#1892=CARTESIAN_POINT('',(0.8,-0.125,0.0799999999999999));
#1893=CARTESIAN_POINT('',(1.3,-0.125,0.0799999999999999));
#1894=CARTESIAN_POINT('Origin',(0.8,-0.525,0.0799999999999999));
#1895=CARTESIAN_POINT('',(0.8,-0.525,-6.93889390390723E-17));
#1896=CARTESIAN_POINT('',(0.8,-0.525,-6.93889390390723E-17));
#1897=CARTESIAN_POINT('',(0.8,-0.525,0.0799999999999999));
#1898=CARTESIAN_POINT('Origin',(1.3,-0.525,0.0799999999999999));
#1899=CARTESIAN_POINT('',(1.3,-0.525,-6.93889390390723E-17));
#1900=CARTESIAN_POINT('',(1.3,-0.525,-6.93889390390723E-17));
#1901=CARTESIAN_POINT('',(1.3,-0.525,0.0799999999999999));
#1902=CARTESIAN_POINT('Origin',(1.3,-0.125,0.0799999999999999));
#1903=CARTESIAN_POINT('',(1.3,-0.125,-6.93889390390723E-17));
#1904=CARTESIAN_POINT('Origin',(0.,0.,-6.93889390390723E-17));
#1905=CARTESIAN_POINT('Origin',(-0.968374954116102,-1.25,0.38));
#1906=CARTESIAN_POINT('',(0.968374954116102,-1.25,1.6));
#1907=CARTESIAN_POINT('',(-0.968374954116102,-1.25,1.6));
#1908=CARTESIAN_POINT('',(-0.968374954116102,-1.25,1.6));
#1909=CARTESIAN_POINT('',(-0.968374954116102,-1.25,0.38));
#1910=CARTESIAN_POINT('',(-0.968374954116102,-1.25,0.38));
#1911=CARTESIAN_POINT('',(0.968374954116102,-1.25,0.38));
#1912=CARTESIAN_POINT('',(-0.968374954116102,-1.25,0.38));
#1913=CARTESIAN_POINT('',(0.968374954116102,-1.25,0.38));
#1914=CARTESIAN_POINT('Origin',(-0.968374954116102,-1.,1.6));
#1915=CARTESIAN_POINT('',(-0.968374954116102,-1.,1.6));
#1916=CARTESIAN_POINT('',(-0.968374954116102,-1.,1.6));
#1917=CARTESIAN_POINT('',(-0.968374954116102,-1.,0.38));
#1918=CARTESIAN_POINT('',(-0.968374954116102,-1.,0.38));
#1919=CARTESIAN_POINT('',(-0.968374954116102,-1.,0.38));
#1920=CARTESIAN_POINT('Origin',(0.968374954116102,-1.,1.6));
#1921=CARTESIAN_POINT('',(0.968374954116102,-1.,1.6));
#1922=CARTESIAN_POINT('',(0.968374954116102,-1.,1.6));
#1923=CARTESIAN_POINT('',(0.968374954116102,-1.,1.6));
#1924=CARTESIAN_POINT('Origin',(0.968374954116102,-1.,0.38));
#1925=CARTESIAN_POINT('',(0.968374954116102,-1.,0.38));
#1926=CARTESIAN_POINT('',(0.968374954116102,-1.,0.38));
#1927=CARTESIAN_POINT('',(0.968374954116102,-1.,0.38));
#1928=CARTESIAN_POINT('Origin',(-0.968374954116102,-1.,0.38));
#1929=CARTESIAN_POINT('',(-0.968374954116102,-1.,0.38));
#1930=CARTESIAN_POINT('Origin',(-0.968374954116102,-1.,0.38));
#1931=CARTESIAN_POINT('Origin',(0.968374954116102,1.25,0.38));
#1932=CARTESIAN_POINT('',(-0.968374954116102,1.25,1.6));
#1933=CARTESIAN_POINT('',(0.968374954116102,1.25,1.6));
#1934=CARTESIAN_POINT('',(0.968374954116102,1.25,1.6));
#1935=CARTESIAN_POINT('',(0.968374954116102,1.25,0.38));
#1936=CARTESIAN_POINT('',(0.968374954116102,1.25,0.38));
#1937=CARTESIAN_POINT('',(-0.968374954116102,1.25,0.38));
#1938=CARTESIAN_POINT('',(0.968374954116102,1.25,0.38));
#1939=CARTESIAN_POINT('',(-0.968374954116102,1.25,0.38));
#1940=CARTESIAN_POINT('Origin',(0.968374954116102,1.,1.6));
#1941=CARTESIAN_POINT('',(0.968374954116102,1.,1.6));
#1942=CARTESIAN_POINT('',(0.968374954116102,1.,1.6));
#1943=CARTESIAN_POINT('',(0.968374954116102,1.,0.38));
#1944=CARTESIAN_POINT('',(0.968374954116102,1.,0.38));
#1945=CARTESIAN_POINT('',(0.968374954116102,1.,0.38));
#1946=CARTESIAN_POINT('Origin',(-0.968374954116102,1.,1.6));
#1947=CARTESIAN_POINT('',(-0.968374954116102,1.,1.6));
#1948=CARTESIAN_POINT('',(-0.968374954116102,1.,1.6));
#1949=CARTESIAN_POINT('',(-0.968374954116102,1.,1.6));
#1950=CARTESIAN_POINT('Origin',(-0.968374954116102,1.,0.38));
#1951=CARTESIAN_POINT('',(-0.968374954116102,1.,0.38));
#1952=CARTESIAN_POINT('',(-0.968374954116102,1.,0.38));
#1953=CARTESIAN_POINT('',(-0.968374954116102,1.,0.38));
#1954=CARTESIAN_POINT('Origin',(0.968374954116102,1.,0.38));
#1955=CARTESIAN_POINT('',(0.968374954116102,1.,0.38));
#1956=CARTESIAN_POINT('Origin',(0.968374954116102,1.,0.38));
#1957=CARTESIAN_POINT('Origin',(0.,0.,0.0799999999999999));
#1958=CARTESIAN_POINT('',(0.8,0.125,0.0799999999999999));
#1959=CARTESIAN_POINT('',(0.8,0.524999999999999,0.0799999999999999));
#1960=CARTESIAN_POINT('',(0.8,9.79717439317883E-17,0.0799999999999999));
#1961=CARTESIAN_POINT('',(1.3,0.125,0.0799999999999999));
#1962=CARTESIAN_POINT('',(-1.53080849893419E-17,0.125,0.0799999999999999));
#1963=CARTESIAN_POINT('',(1.3,0.524999999999999,0.0799999999999999));
#1964=CARTESIAN_POINT('',(1.3,1.59204083889156E-16,0.0799999999999999));
#1965=CARTESIAN_POINT('',(-6.42939569552359E-17,0.524999999999999,0.0799999999999999));
#1966=CARTESIAN_POINT('Origin',(0.8,0.524999999999999,0.0799999999999999));
#1967=CARTESIAN_POINT('',(1.3,0.524999999999999,-6.93889390390723E-17));
#1968=CARTESIAN_POINT('',(0.8,0.524999999999999,-6.93889390390723E-17));
#1969=CARTESIAN_POINT('',(0.8,0.524999999999999,-6.93889390390723E-17));
#1970=CARTESIAN_POINT('',(0.8,0.524999999999999,0.0799999999999999));
#1971=CARTESIAN_POINT('',(1.3,0.524999999999999,0.0799999999999999));
#1972=CARTESIAN_POINT('Origin',(0.8,0.125,0.0799999999999999));
#1973=CARTESIAN_POINT('',(0.8,0.125,-6.93889390390723E-17));
#1974=CARTESIAN_POINT('',(0.8,0.125,-6.93889390390723E-17));
#1975=CARTESIAN_POINT('',(0.8,0.125,0.0799999999999999));
#1976=CARTESIAN_POINT('Origin',(1.3,0.125,0.0799999999999999));
#1977=CARTESIAN_POINT('',(1.3,0.125,-6.93889390390723E-17));
#1978=CARTESIAN_POINT('',(1.3,0.125,-6.93889390390723E-17));
#1979=CARTESIAN_POINT('',(1.3,0.125,0.0799999999999999));
#1980=CARTESIAN_POINT('Origin',(1.3,0.524999999999999,0.0799999999999999));
#1981=CARTESIAN_POINT('',(1.3,0.524999999999999,-6.93889390390723E-17));
#1982=CARTESIAN_POINT('Origin',(0.,0.,-6.93889390390723E-17));
#1983=CARTESIAN_POINT('Origin',(0.,0.,0.0799999999999999));
#1984=CARTESIAN_POINT('',(-1.3,-0.525,0.0799999999999999));
#1985=CARTESIAN_POINT('',(-1.3,-0.125,0.0799999999999999));
#1986=CARTESIAN_POINT('',(-1.3,-1.59204083889156E-16,0.0799999999999999));
#1987=CARTESIAN_POINT('',(-0.8,-0.525,0.0799999999999999));
#1988=CARTESIAN_POINT('',(6.4293956955236E-17,-0.525,0.0799999999999999));
#1989=CARTESIAN_POINT('',(-0.8,-0.125,0.0799999999999999));
#1990=CARTESIAN_POINT('',(-0.8,-9.79717439317883E-17,0.0799999999999999));
#1991=CARTESIAN_POINT('',(1.53080849893419E-17,-0.125,0.0799999999999999));
#1992=CARTESIAN_POINT('Origin',(-1.3,-0.125,0.0799999999999999));
#1993=CARTESIAN_POINT('',(-0.8,-0.125,-6.93889390390723E-17));
#1994=CARTESIAN_POINT('',(-1.3,-0.125,-6.93889390390723E-17));
#1995=CARTESIAN_POINT('',(-1.3,-0.125,-6.93889390390723E-17));
#1996=CARTESIAN_POINT('',(-1.3,-0.125,0.0799999999999999));
#1997=CARTESIAN_POINT('',(-0.8,-0.125,0.0799999999999999));
#1998=CARTESIAN_POINT('Origin',(-1.3,-0.525,0.0799999999999999));
#1999=CARTESIAN_POINT('',(-1.3,-0.525,-6.93889390390723E-17));
#2000=CARTESIAN_POINT('',(-1.3,-0.525,-6.93889390390723E-17));
#2001=CARTESIAN_POINT('',(-1.3,-0.525,0.0799999999999999));
#2002=CARTESIAN_POINT('Origin',(-0.8,-0.525,0.0799999999999999));
#2003=CARTESIAN_POINT('',(-0.8,-0.525,-6.93889390390723E-17));
#2004=CARTESIAN_POINT('',(-0.8,-0.525,-6.93889390390723E-17));
#2005=CARTESIAN_POINT('',(-0.8,-0.525,0.0799999999999999));
#2006=CARTESIAN_POINT('Origin',(-0.8,-0.125,0.0799999999999999));
#2007=CARTESIAN_POINT('',(-0.8,-0.125,-6.93889390390723E-17));
#2008=CARTESIAN_POINT('Origin',(0.,0.,-6.93889390390723E-17));
#2009=CARTESIAN_POINT('Origin',(-1.25,1.35,0.38));
#2010=CARTESIAN_POINT('',(-1.175,1.35,0.38));
#2011=CARTESIAN_POINT('Origin',(-1.25,1.35,0.38));
#2012=CARTESIAN_POINT('',(-1.175,1.35,0.355));
#2013=CARTESIAN_POINT('',(-1.175,1.35,0.38));
#2014=CARTESIAN_POINT('Origin',(-1.25,1.35,0.355));
#2015=CARTESIAN_POINT('Origin',(0.,0.,0.355));
#2016=CARTESIAN_POINT('Origin',(0.,0.,0.0799999999999999));
#2017=CARTESIAN_POINT('',(1.45,-1.55,0.0799999999999999));
#2018=CARTESIAN_POINT('',(1.45,1.55,0.0799999999999999));
#2019=CARTESIAN_POINT('',(1.45,1.77573785876366E-16,0.0799999999999999));
#2020=CARTESIAN_POINT('',(-1.45,-1.55,0.0799999999999999));
#2021=CARTESIAN_POINT('',(1.8982025386784E-16,-1.55,0.0799999999999999));
#2022=CARTESIAN_POINT('',(-1.45,1.55,0.0799999999999999));
#2023=CARTESIAN_POINT('',(-1.45,-1.77573785876366E-16,0.0799999999999999));
#2024=CARTESIAN_POINT('',(-1.8982025386784E-16,1.55,0.0799999999999999));
#2025=CARTESIAN_POINT('Origin',(1.45,1.55,0.0799999999999999));
#2026=CARTESIAN_POINT('',(-1.45,1.55,0.38));
#2027=CARTESIAN_POINT('',(1.45,1.55,0.38));
#2028=CARTESIAN_POINT('',(1.45,1.55,0.38));
#2029=CARTESIAN_POINT('',(1.45,1.55,0.0799999999999999));
#2030=CARTESIAN_POINT('',(-1.45,1.55,0.0799999999999999));
#2031=CARTESIAN_POINT('Origin',(1.45,-1.55,0.0799999999999999));
#2032=CARTESIAN_POINT('',(1.45,-1.55,0.38));
#2033=CARTESIAN_POINT('',(1.45,-1.55,0.38));
#2034=CARTESIAN_POINT('',(1.45,-1.55,0.0799999999999999));
#2035=CARTESIAN_POINT('Origin',(-1.45,-1.55,0.0799999999999999));
#2036=CARTESIAN_POINT('',(-1.45,-1.55,0.38));
#2037=CARTESIAN_POINT('',(-1.45,-1.55,0.38));
#2038=CARTESIAN_POINT('',(-1.45,-1.55,0.0799999999999999));
#2039=CARTESIAN_POINT('Origin',(-1.45,1.55,0.0799999999999999));
#2040=CARTESIAN_POINT('',(-1.45,1.55,0.38));
#2041=CARTESIAN_POINT('Origin',(0.,0.,0.38));
#2042=CARTESIAN_POINT('',(0.968374954116102,1.,0.38));
#2043=CARTESIAN_POINT('',(0.968374954116102,-1.,0.38));
#2044=CARTESIAN_POINT('',(0.968374954116102,1.18591728793275E-16,0.38));
#2045=CARTESIAN_POINT('',(-0.968374954116102,-1.,0.38));
#2046=CARTESIAN_POINT('',(1.22464679914735E-16,-1.,0.38));
#2047=CARTESIAN_POINT('',(-0.968374954116102,1.,0.38));
#2048=CARTESIAN_POINT('',(-0.968374954116102,-1.18591728793275E-16,0.38));
#2049=CARTESIAN_POINT('',(-1.22464679914735E-16,1.,0.38));
#2050=CARTESIAN_POINT('Origin',(-0.968374954116102,-1.,0.38));
#2051=CARTESIAN_POINT('',(0.968374954116102,-1.,1.6));
#2052=CARTESIAN_POINT('',(-0.968374954116102,-1.,1.6));
#2053=CARTESIAN_POINT('',(-0.968374954116102,-1.,1.6));
#2054=CARTESIAN_POINT('',(-0.968374954116102,-1.,0.38));
#2055=CARTESIAN_POINT('',(0.968374954116102,-1.,0.38));
#2056=CARTESIAN_POINT('Origin',(0.968374954116102,-1.,0.38));
#2057=CARTESIAN_POINT('',(0.968374954116102,1.,1.6));
#2058=CARTESIAN_POINT('',(0.968374954116102,-1.,1.6));
#2059=CARTESIAN_POINT('',(0.968374954116102,1.,0.38));
#2060=CARTESIAN_POINT('Origin',(0.968374954116102,1.,0.38));
#2061=CARTESIAN_POINT('',(-0.968374954116102,1.,1.6));
#2062=CARTESIAN_POINT('',(0.968374954116102,1.,1.6));
#2063=CARTESIAN_POINT('',(-0.968374954116102,1.,0.38));
#2064=CARTESIAN_POINT('Origin',(-0.968374954116102,1.,0.38));
#2065=CARTESIAN_POINT('',(-0.968374954116102,1.,1.6));
#2066=CARTESIAN_POINT('Origin',(0.,0.,1.6));
#2067=UNCERTAINTY_MEASURE_WITH_UNIT(LENGTH_MEASURE(0.01),#2071,
'DISTANCE_ACCURACY_VALUE',
'Maximum model space distance between geometric entities at asserted c
onnectivities');
#2068=UNCERTAINTY_MEASURE_WITH_UNIT(LENGTH_MEASURE(0.01),#2071,
'DISTANCE_ACCURACY_VALUE',
'Maximum model space distance between geometric entities at asserted c
onnectivities');
#2069=(
GEOMETRIC_REPRESENTATION_CONTEXT(3)
GLOBAL_UNCERTAINTY_ASSIGNED_CONTEXT((#2067))
GLOBAL_UNIT_ASSIGNED_CONTEXT((#2071,#2073,#2074))
REPRESENTATION_CONTEXT('','3D')
);
#2070=(
GEOMETRIC_REPRESENTATION_CONTEXT(3)
GLOBAL_UNCERTAINTY_ASSIGNED_CONTEXT((#2068))
GLOBAL_UNIT_ASSIGNED_CONTEXT((#2071,#2073,#2074))
REPRESENTATION_CONTEXT('','3D')
);
#2071=(
LENGTH_UNIT()
NAMED_UNIT(*)
SI_UNIT(.MILLI.,.METRE.)
);
#2072=(
LENGTH_UNIT()
NAMED_UNIT(*)
SI_UNIT($,.METRE.)
);
#2073=(
NAMED_UNIT(*)
PLANE_ANGLE_UNIT()
SI_UNIT($,.RADIAN.)
);
#2074=(
NAMED_UNIT(*)
SI_UNIT($,.STERADIAN.)
SOLID_ANGLE_UNIT()
);
#2075=SHAPE_DEFINITION_REPRESENTATION(#2076,#2077);
#2076=PRODUCT_DEFINITION_SHAPE('',$,#2079);
#2077=SHAPE_REPRESENTATION('',(#1307),#2069);
#2078=PRODUCT_DEFINITION_CONTEXT('part definition',#2083,'design');
#2079=PRODUCT_DEFINITION('(Unsaved)','(Unsaved)',#2080,#2078);
#2080=PRODUCT_DEFINITION_FORMATION('',$,#2085);
#2081=PRODUCT_RELATED_PRODUCT_CATEGORY('(Unsaved)','(Unsaved)',(#2085));
#2082=APPLICATION_PROTOCOL_DEFINITION('international standard',
'automotive_design',2009,#2083);
#2083=APPLICATION_CONTEXT(
'Core Data for Automotive Mechanical Design Process');
#2084=PRODUCT_CONTEXT('part definition',#2083,'mechanical');
#2085=PRODUCT('(Unsaved)','(Unsaved)',$,(#2084));
#2086=PRESENTATION_STYLE_ASSIGNMENT((#2091));
#2087=PRESENTATION_STYLE_ASSIGNMENT((#2092));
#2088=PRESENTATION_STYLE_ASSIGNMENT((#2093));
#2089=PRESENTATION_STYLE_ASSIGNMENT((#2094));
#2090=PRESENTATION_STYLE_ASSIGNMENT((#2095));
#2091=SURFACE_STYLE_USAGE(.BOTH.,#2096);
#2092=SURFACE_STYLE_USAGE(.BOTH.,#2097);
#2093=SURFACE_STYLE_USAGE(.BOTH.,#2098);
#2094=SURFACE_STYLE_USAGE(.BOTH.,#2099);
#2095=SURFACE_STYLE_USAGE(.BOTH.,#2100);
#2096=SURFACE_SIDE_STYLE('',(#2101));
#2097=SURFACE_SIDE_STYLE('',(#2102));
#2098=SURFACE_SIDE_STYLE('',(#2103));
#2099=SURFACE_SIDE_STYLE('',(#2104));
#2100=SURFACE_SIDE_STYLE('',(#2105));
#2101=SURFACE_STYLE_FILL_AREA(#2106);
#2102=SURFACE_STYLE_FILL_AREA(#2107);
#2103=SURFACE_STYLE_FILL_AREA(#2108);
#2104=SURFACE_STYLE_FILL_AREA(#2109);
#2105=SURFACE_STYLE_FILL_AREA(#2110);
#2106=FILL_AREA_STYLE('Steel - Satin',(#2111));
#2107=FILL_AREA_STYLE('Opaque(255,215,0)',(#2112));
#2108=FILL_AREA_STYLE('Opaque(191,191,191)',(#2113));
#2109=FILL_AREA_STYLE('Opaque(0,84,0)',(#2114));
#2110=FILL_AREA_STYLE('Opaque(102,102,102)',(#2115));
#2111=FILL_AREA_STYLE_COLOUR('Steel - Satin',#2116);
#2112=FILL_AREA_STYLE_COLOUR('Opaque(255,215,0)',#2117);
#2113=FILL_AREA_STYLE_COLOUR('Opaque(191,191,191)',#2118);
#2114=FILL_AREA_STYLE_COLOUR('Opaque(0,84,0)',#2119);
#2115=FILL_AREA_STYLE_COLOUR('Opaque(102,102,102)',#2120);
#2116=COLOUR_RGB('Steel - Satin',0.627450980392157,0.627450980392157,0.627450980392157);
#2117=COLOUR_RGB('Opaque(255,215,0)',1.,0.843137254901961,0.);
#2118=COLOUR_RGB('Opaque(191,191,191)',0.749019607843137,0.749019607843137,
0.749019607843137);
#2119=COLOUR_RGB('Opaque(0,84,0)',0.,0.329411764705882,0.);
#2120=COLOUR_RGB('Opaque(102,102,102)',0.4,0.4,0.4);
ENDSEC;
END-ISO-10303-21;
