<?xml version="1.0" encoding="UTF-8" standalone="no"?>
<svg
   xmlns:dc="http://purl.org/dc/elements/1.1/"
   xmlns:cc="http://creativecommons.org/ns#"
   xmlns:rdf="http://www.w3.org/1999/02/22-rdf-syntax-ns#"
   xmlns:svg="http://www.w3.org/2000/svg"
   xmlns="http://www.w3.org/2000/svg"
   xmlns:sodipodi="http://sodipodi.sourceforge.net/DTD/sodipodi-0.dtd"
   xmlns:inkscape="http://www.inkscape.org/namespaces/inkscape"
   viewBox="0 0 480.00063 800.00018"
   version="1.1"
   id="svg4"
   sodipodi:docname="review_wave_1.svg"
   width="480"
   height="800"
   inkscape:version="1.0.2-2 (e86c870879, 2021-01-15)">
  <metadata
     id="metadata10">
    <rdf:RDF>
      <cc:Work
         rdf:about="">
        <dc:format>image/svg+xml</dc:format>
        <dc:type
           rdf:resource="http://purl.org/dc/dcmitype/StillImage" />
        <dc:title></dc:title>
      </cc:Work>
    </rdf:RDF>
  </metadata>
  <defs
     id="defs8" />
  <sodipodi:namedview
     pagecolor="#ffffff"
     bordercolor="#666666"
     borderopacity="1"
     objecttolerance="10"
     gridtolerance="10"
     guidetolerance="10"
     inkscape:pageopacity="0"
     inkscape:pageshadow="2"
     inkscape:window-width="1920"
     inkscape:window-height="1017"
     id="namedview6"
     showgrid="false"
     inkscape:snap-global="true"
     inkscape:snap-bbox="true"
     inkscape:zoom="0.87013889"
     inkscape:cx="640.90668"
     inkscape:cy="652.86065"
     inkscape:window-x="-8"
     inkscape:window-y="-8"
     inkscape:window-maximized="1"
     inkscape:current-layer="svg4"
     units="px"
     width="296mm"
     fit-margin-top="3.6"
     lock-margins="false"
     height="209mm"
     inkscape:bbox-paths="false"
     inkscape:snap-bbox-midpoints="false"
     inkscape:snap-bbox-edge-midpoints="false"
     inkscape:bbox-nodes="false"
     inkscape:snap-page="true" />
  <path
     id="path2"
     d="m 960,142.00862 v 106.69922 h 160.0001 160 133.3008 26.6992 v -64 l -27,-26.69922 c -26,-26.3 -79.7001,-80.3 -133,-95.999999 -53,-16.3 -106.7001,5.7 -160,32 C 1067.0001,120.70862 1013.3,152.70862 960,142.00862 Z"
     style="fill:#0041d2;fill-opacity:1" />
  <path
     id="path902"
     d="m 480,158.00862 v 90.69922 H 640 800 960 V 142.00862 c -53,-10.3 -106.7,-64.30156 -160,-58.60156 -53,5.3 -106.7,69.3 -160,96 -53,26.3 -106.7,16.30156 -160,-21.39844 z"
     style="fill:#0041d2;fill-opacity:1" />
  <path
     id="path900"
     d="m 6.395e-4,704.00062 v 96 h 26.9999965 132.999994 160 160 V 709.3014 c -53,-37.3 -106.7,-101.30078 -160,-133.30078 -53,-32 -106.7,-32.00078 -160,-5.30078 -53,26.3 -106.700774,80.30156 -133.300774,106.60156 z"
     style="fill:#0041d2;fill-opacity:1" />
</svg>
