// Jest Snapshot v1, https://goo.gl/fbAQLP

exports[`when rendering an App returns a proper html structure 1`] = `
<body>
  <div>
    <div
      class="makeStyles-root-1"
    >
      <div
        class="makeStyles-root-2"
      >
        <header
          class="MuiPaper-root MuiAppBar-root MuiAppBar-positionRelative MuiAppBar-colorPrimary makeStyles-header-3 MuiPaper-elevation4"
        >
          <h1
            class="MuiTypography-root MuiTypography-h1"
          >
            Contacts
          </h1>
        </header>
        <div
          class="MuiBox-root MuiBox-root-5"
        >
          <div
            class="MuiFormControl-root MuiTextField-root makeStyles-textField-6"
          >
            <div
              class="MuiInputBase-root MuiOutlinedInput-root MuiInputBase-formControl MuiInputBase-adornedStart MuiOutlinedInput-adornedStart"
            >
              <div
                class="MuiInputAdornment-root MuiInputAdornment-positionStart"
              >
                <svg
                  aria-hidden="true"
                  class="MuiSvgIcon-root makeStyles-icon-7"
                  focusable="false"
                  viewBox="0 0 24 24"
                >
                  <path
                    d="M15.5 14h-.79l-.28-.27C15.41 12.59 16 11.11 16 9.5 16 5.91 13.09 3 9.5 3S3 5.91 3 9.5 5.91 16 9.5 16c1.61 0 3.09-.59 4.23-1.57l.27.28v.79l5 4.99L20.49 19l-4.99-5zm-6 0C7.01 14 5 11.99 5 9.5S7.01 5 9.5 5 14 7.01 14 9.5 11.99 14 9.5 14z"
                  />
                </svg>
              </div>
              <input
                aria-invalid="false"
                class="MuiInputBase-input MuiOutlinedInput-input MuiInputBase-inputAdornedStart MuiOutlinedInput-inputAdornedStart"
                type="text"
                value=""
              />
              <fieldset
                aria-hidden="true"
                class="PrivateNotchedOutline-root-8 MuiOutlinedInput-notchedOutline"
                style="padding-left: 8px;"
              >
                <legend
                  class="PrivateNotchedOutline-legend-9"
                  style="width: 0.01px;"
                >
                  <span>
                    ​
                  </span>
                </legend>
              </fieldset>
            </div>
          </div>
        </div>
        <div
          class="makeStyles-users-4"
        >
          <div
            class="MuiBox-root MuiBox-root-14 makeStyles-root-12"
          >
            <ul
              class="MuiList-root MuiList-padding"
            >
              <li
                class="MuiListItem-container"
              >
                <div
                  class="MuiListItem-root MuiListItem-gutters MuiListItem-secondaryAction"
                >
                  <div
                    class="MuiListItemAvatar-root"
                  >
                    <div
                      class="MuiAvatar-root MuiAvatar-circle"
                    >
                      <img
                        class="MuiAvatar-img"
                        src="https://robohash.org/magninemoet.png?size=50x50&set=set1"
                      />
                    </div>
                  </div>
                  <div
                    class="MuiListItemText-root MuiListItemText-multiline"
                  >
                    <span
                      class="MuiTypography-root MuiListItemText-primary MuiTypography-body1 MuiTypography-displayBlock"
                    >
                      Amabel Aarons
                    </span>
                    <p
                      class="MuiTypography-root MuiListItemText-secondary MuiTypography-body2 MuiTypography-colorTextSecondary MuiTypography-displayBlock"
                    >
                      aaaronsiw@imageshack.us
                    </p>
                  </div>
                </div>
                <div
                  class="MuiListItemSecondaryAction-root"
                >
                  <span
                    aria-disabled="false"
                    class="MuiButtonBase-root MuiIconButton-root PrivateSwitchBase-root-15 MuiCheckbox-root MuiCheckbox-colorSecondary MuiIconButton-colorSecondary"
                  >
                    <span
                      class="MuiIconButton-label"
                    >
                      <input
                        class="PrivateSwitchBase-input-18"
                        data-indeterminate="false"
                        type="checkbox"
                        value=""
                      />
                      <svg
                        aria-hidden="true"
                        class="MuiSvgIcon-root"
                        focusable="false"
                        viewBox="0 0 24 24"
                      >
                        <path
                          d="M19 5v14H5V5h14m0-2H5c-1.1 0-2 .9-2 2v14c0 1.1.9 2 2 2h14c1.1 0 2-.9 2-2V5c0-1.1-.9-2-2-2z"
                        />
                      </svg>
                    </span>
                    <span
                      class="MuiTouchRipple-root"
                    />
                  </span>
                </div>
              </li>
              <li
                class="MuiListItem-container"
              >
                <div
                  class="MuiListItem-root MuiListItem-gutters MuiListItem-secondaryAction"
                >
                  <div
                    class="MuiListItemAvatar-root"
                  >
                    <div
                      class="MuiAvatar-root MuiAvatar-circle"
                    >
                      <img
                        class="MuiAvatar-img"
                        src="https://robohash.org/placeatmodioptio.png?size=50x50&set=set1"
                      />
                    </div>
                  </div>
                  <div
                    class="MuiListItemText-root MuiListItemText-multiline"
                  >
                    <span
                      class="MuiTypography-root MuiListItemText-primary MuiTypography-body1 MuiTypography-displayBlock"
                    >
                      Mikol Abbs
                    </span>
                    <p
                      class="MuiTypography-root MuiListItemText-secondary MuiTypography-body2 MuiTypography-colorTextSecondary MuiTypography-displayBlock"
                    >
                      mabbsm8@skyrock.com
                    </p>
                  </div>
                </div>
                <div
                  class="MuiListItemSecondaryAction-root"
                >
                  <span
                    aria-disabled="false"
                    class="MuiButtonBase-root MuiIconButton-root PrivateSwitchBase-root-15 MuiCheckbox-root MuiCheckbox-colorSecondary MuiIconButton-colorSecondary"
                  >
                    <span
                      class="MuiIconButton-label"
                    >
                      <input
                        class="PrivateSwitchBase-input-18"
                        data-indeterminate="false"
                        type="checkbox"
                        value=""
                      />
                      <svg
                        aria-hidden="true"
                        class="MuiSvgIcon-root"
                        focusable="false"
                        viewBox="0 0 24 24"
                      >
                        <path
                          d="M19 5v14H5V5h14m0-2H5c-1.1 0-2 .9-2 2v14c0 1.1.9 2 2 2h14c1.1 0 2-.9 2-2V5c0-1.1-.9-2-2-2z"
                        />
                      </svg>
                    </span>
                    <span
                      class="MuiTouchRipple-root"
                    />
                  </span>
                </div>
              </li>
              <li
                class="MuiListItem-container"
              >
                <div
                  class="MuiListItem-root MuiListItem-gutters MuiListItem-secondaryAction"
                >
                  <div
                    class="MuiListItemAvatar-root"
                  >
                    <div
                      class="MuiAvatar-root MuiAvatar-circle"
                    >
                      <img
                        class="MuiAvatar-img"
                        src="https://robohash.org/perspiciatisipsaqui.png?size=50x50&set=set1"
                      />
                    </div>
                  </div>
                  <div
                    class="MuiListItemText-root MuiListItemText-multiline"
                  >
                    <span
                      class="MuiTypography-root MuiListItemText-primary MuiTypography-body1 MuiTypography-displayBlock"
                    >
                      Alisander Aberchirder
                    </span>
                    <p
                      class="MuiTypography-root MuiListItemText-secondary MuiTypography-body2 MuiTypography-colorTextSecondary MuiTypography-displayBlock"
                    >
                      aaberchirder66@theguardian.com
                    </p>
                  </div>
                </div>
                <div
                  class="MuiListItemSecondaryAction-root"
                >
                  <span
                    aria-disabled="false"
                    class="MuiButtonBase-root MuiIconButton-root PrivateSwitchBase-root-15 MuiCheckbox-root MuiCheckbox-colorSecondary MuiIconButton-colorSecondary"
                  >
                    <span
                      class="MuiIconButton-label"
                    >
                      <input
                        class="PrivateSwitchBase-input-18"
                        data-indeterminate="false"
                        type="checkbox"
                        value=""
                      />
                      <svg
                        aria-hidden="true"
                        class="MuiSvgIcon-root"
                        focusable="false"
                        viewBox="0 0 24 24"
                      >
                        <path
                          d="M19 5v14H5V5h14m0-2H5c-1.1 0-2 .9-2 2v14c0 1.1.9 2 2 2h14c1.1 0 2-.9 2-2V5c0-1.1-.9-2-2-2z"
                        />
                      </svg>
                    </span>
                    <span
                      class="MuiTouchRipple-root"
                    />
                  </span>
                </div>
              </li>
              <li
                class="MuiListItem-container"
              >
                <div
                  class="MuiListItem-root MuiListItem-gutters MuiListItem-secondaryAction"
                >
                  <div
                    class="MuiListItemAvatar-root"
                  >
                    <div
                      class="MuiAvatar-root MuiAvatar-circle"
                    >
                      <img
                        class="MuiAvatar-img"
                        src="https://robohash.org/sequiteneturqui.png?size=50x50&set=set1"
                      />
                    </div>
                  </div>
                  <div
                    class="MuiListItemText-root MuiListItemText-multiline"
                  >
                    <span
                      class="MuiTypography-root MuiListItemText-primary MuiTypography-body1 MuiTypography-displayBlock"
                    >
                      Ambros Abraham
                    </span>
                    <p
                      class="MuiTypography-root MuiListItemText-secondary MuiTypography-body2 MuiTypography-colorTextSecondary MuiTypography-displayBlock"
                    >
                      aabraham44@geocities.com
                    </p>
                  </div>
                </div>
                <div
                  class="MuiListItemSecondaryAction-root"
                >
                  <span
                    aria-disabled="false"
                    class="MuiButtonBase-root MuiIconButton-root PrivateSwitchBase-root-15 MuiCheckbox-root MuiCheckbox-colorSecondary MuiIconButton-colorSecondary"
                  >
                    <span
                      class="MuiIconButton-label"
                    >
                      <input
                        class="PrivateSwitchBase-input-18"
                        data-indeterminate="false"
                        type="checkbox"
                        value=""
                      />
                      <svg
                        aria-hidden="true"
                        class="MuiSvgIcon-root"
                        focusable="false"
                        viewBox="0 0 24 24"
                      >
                        <path
                          d="M19 5v14H5V5h14m0-2H5c-1.1 0-2 .9-2 2v14c0 1.1.9 2 2 2h14c1.1 0 2-.9 2-2V5c0-1.1-.9-2-2-2z"
                        />
                      </svg>
                    </span>
                    <span
                      class="MuiTouchRipple-root"
                    />
                  </span>
                </div>
              </li>
              <li
                class="MuiListItem-container"
              >
                <div
                  class="MuiListItem-root MuiListItem-gutters MuiListItem-secondaryAction"
                >
                  <div
                    class="MuiListItemAvatar-root"
                  >
                    <div
                      class="MuiAvatar-root MuiAvatar-circle"
                    >
                      <img
                        class="MuiAvatar-img"
                        src="https://robohash.org/corporisvoluptatemaut.png?size=50x50&set=set1"
                      />
                    </div>
                  </div>
                  <div
                    class="MuiListItemText-root MuiListItemText-multiline"
                  >
                    <span
                      class="MuiTypography-root MuiListItemText-primary MuiTypography-body1 MuiTypography-displayBlock"
                    >
                      Regen Abreheart
                    </span>
                    <p
                      class="MuiTypography-root MuiListItemText-secondary MuiTypography-body2 MuiTypography-colorTextSecondary MuiTypography-displayBlock"
                    >
                      rabreheart4c@dailymail.co.uk
                    </p>
                  </div>
                </div>
                <div
                  class="MuiListItemSecondaryAction-root"
                >
                  <span
                    aria-disabled="false"
                    class="MuiButtonBase-root MuiIconButton-root PrivateSwitchBase-root-15 MuiCheckbox-root MuiCheckbox-colorSecondary MuiIconButton-colorSecondary"
                  >
                    <span
                      class="MuiIconButton-label"
                    >
                      <input
                        class="PrivateSwitchBase-input-18"
                        data-indeterminate="false"
                        type="checkbox"
                        value=""
                      />
                      <svg
                        aria-hidden="true"
                        class="MuiSvgIcon-root"
                        focusable="false"
                        viewBox="0 0 24 24"
                      >
                        <path
                          d="M19 5v14H5V5h14m0-2H5c-1.1 0-2 .9-2 2v14c0 1.1.9 2 2 2h14c1.1 0 2-.9 2-2V5c0-1.1-.9-2-2-2z"
                        />
                      </svg>
                    </span>
                    <span
                      class="MuiTouchRipple-root"
                    />
                  </span>
                </div>
              </li>
              <li
                class="MuiListItem-container"
              >
                <div
                  class="MuiListItem-root MuiListItem-gutters MuiListItem-secondaryAction"
                >
                  <div
                    class="MuiListItemAvatar-root"
                  >
                    <div
                      class="MuiAvatar-root MuiAvatar-circle"
                    >
                      <img
                        class="MuiAvatar-img"
                        src="https://robohash.org/veritatisdictaautem.png?size=50x50&set=set1"
                      />
                    </div>
                  </div>
                  <div
                    class="MuiListItemText-root MuiListItemText-multiline"
                  >
                    <span
                      class="MuiTypography-root MuiListItemText-primary MuiTypography-body1 MuiTypography-displayBlock"
                    >
                      Mohammed Acomb
                    </span>
                    <p
                      class="MuiTypography-root MuiListItemText-secondary MuiTypography-body2 MuiTypography-colorTextSecondary MuiTypography-displayBlock"
                    >
                      macombbi@theglobeandmail.com
                    </p>
                  </div>
                </div>
                <div
                  class="MuiListItemSecondaryAction-root"
                >
                  <span
                    aria-disabled="false"
                    class="MuiButtonBase-root MuiIconButton-root PrivateSwitchBase-root-15 MuiCheckbox-root MuiCheckbox-colorSecondary MuiIconButton-colorSecondary"
                  >
                    <span
                      class="MuiIconButton-label"
                    >
                      <input
                        class="PrivateSwitchBase-input-18"
                        data-indeterminate="false"
                        type="checkbox"
                        value=""
                      />
                      <svg
                        aria-hidden="true"
                        class="MuiSvgIcon-root"
                        focusable="false"
                        viewBox="0 0 24 24"
                      >
                        <path
                          d="M19 5v14H5V5h14m0-2H5c-1.1 0-2 .9-2 2v14c0 1.1.9 2 2 2h14c1.1 0 2-.9 2-2V5c0-1.1-.9-2-2-2z"
                        />
                      </svg>
                    </span>
                    <span
                      class="MuiTouchRipple-root"
                    />
                  </span>
                </div>
              </li>
              <li
                class="MuiListItem-container"
              >
                <div
                  class="MuiListItem-root MuiListItem-gutters MuiListItem-secondaryAction"
                >
                  <div
                    class="MuiListItemAvatar-root"
                  >
                    <div
                      class="MuiAvatar-root MuiAvatar-circle"
                    >
                      <img
                        class="MuiAvatar-img"
                        src="https://robohash.org/undenecessitatibusvoluptate.png?size=50x50&set=set1"
                      />
                    </div>
                  </div>
                  <div
                    class="MuiListItemText-root MuiListItemText-multiline"
                  >
                    <span
                      class="MuiTypography-root MuiListItemText-primary MuiTypography-body1 MuiTypography-displayBlock"
                    >
                      Frederich Acott
                    </span>
                    <p
                      class="MuiTypography-root MuiListItemText-secondary MuiTypography-body2 MuiTypography-colorTextSecondary MuiTypography-displayBlock"
                    >
                      facottci@eventbrite.com
                    </p>
                  </div>
                </div>
                <div
                  class="MuiListItemSecondaryAction-root"
                >
                  <span
                    aria-disabled="false"
                    class="MuiButtonBase-root MuiIconButton-root PrivateSwitchBase-root-15 MuiCheckbox-root MuiCheckbox-colorSecondary MuiIconButton-colorSecondary"
                  >
                    <span
                      class="MuiIconButton-label"
                    >
                      <input
                        class="PrivateSwitchBase-input-18"
                        data-indeterminate="false"
                        type="checkbox"
                        value=""
                      />
                      <svg
                        aria-hidden="true"
                        class="MuiSvgIcon-root"
                        focusable="false"
                        viewBox="0 0 24 24"
                      >
                        <path
                          d="M19 5v14H5V5h14m0-2H5c-1.1 0-2 .9-2 2v14c0 1.1.9 2 2 2h14c1.1 0 2-.9 2-2V5c0-1.1-.9-2-2-2z"
                        />
                      </svg>
                    </span>
                    <span
                      class="MuiTouchRipple-root"
                    />
                  </span>
                </div>
              </li>
              <li
                class="MuiListItem-container"
              >
                <div
                  class="MuiListItem-root MuiListItem-gutters MuiListItem-secondaryAction"
                >
                  <div
                    class="MuiListItemAvatar-root"
                  >
                    <div
                      class="MuiAvatar-root MuiAvatar-circle MuiAvatar-colorDefault"
                    >
                      <svg
                        aria-hidden="true"
                        class="MuiSvgIcon-root MuiAvatar-fallback"
                        focusable="false"
                        viewBox="0 0 24 24"
                      >
                        <path
                          d="M12 12c2.21 0 4-1.79 4-4s-1.79-4-4-4-4 1.79-4 4 1.79 4 4 4zm0 2c-2.67 0-8 1.34-8 4v2h16v-2c0-2.66-5.33-4-8-4z"
                        />
                      </svg>
                    </div>
                  </div>
                  <div
                    class="MuiListItemText-root MuiListItemText-multiline"
                  >
                    <span
                      class="MuiTypography-root MuiListItemText-primary MuiTypography-body1 MuiTypography-displayBlock"
                    >
                      Delilah Adamson
                    </span>
                    <p
                      class="MuiTypography-root MuiListItemText-secondary MuiTypography-body2 MuiTypography-colorTextSecondary MuiTypography-displayBlock"
                    >
                      dadamsonca@over-blog.com
                    </p>
                  </div>
                </div>
                <div
                  class="MuiListItemSecondaryAction-root"
                >
                  <span
                    aria-disabled="false"
                    class="MuiButtonBase-root MuiIconButton-root PrivateSwitchBase-root-15 MuiCheckbox-root MuiCheckbox-colorSecondary MuiIconButton-colorSecondary"
                  >
                    <span
                      class="MuiIconButton-label"
                    >
                      <input
                        class="PrivateSwitchBase-input-18"
                        data-indeterminate="false"
                        type="checkbox"
                        value=""
                      />
                      <svg
                        aria-hidden="true"
                        class="MuiSvgIcon-root"
                        focusable="false"
                        viewBox="0 0 24 24"
                      >
                        <path
                          d="M19 5v14H5V5h14m0-2H5c-1.1 0-2 .9-2 2v14c0 1.1.9 2 2 2h14c1.1 0 2-.9 2-2V5c0-1.1-.9-2-2-2z"
                        />
                      </svg>
                    </span>
                    <span
                      class="MuiTouchRipple-root"
                    />
                  </span>
                </div>
              </li>
              <li
                class="MuiListItem-container"
              >
                <div
                  class="MuiListItem-root MuiListItem-gutters MuiListItem-secondaryAction"
                >
                  <div
                    class="MuiListItemAvatar-root"
                  >
                    <div
                      class="MuiAvatar-root MuiAvatar-circle"
                    >
                      <img
                        class="MuiAvatar-img"
                        src="https://robohash.org/etdictaalias.png?size=50x50&set=set1"
                      />
                    </div>
                  </div>
                  <div
                    class="MuiListItemText-root MuiListItemText-multiline"
                  >
                    <span
                      class="MuiTypography-root MuiListItemText-primary MuiTypography-body1 MuiTypography-displayBlock"
                    >
                      Raquel Adaway
                    </span>
                    <p
                      class="MuiTypography-root MuiListItemText-secondary MuiTypography-body2 MuiTypography-colorTextSecondary MuiTypography-displayBlock"
                    >
                      radawayig@mtv.com
                    </p>
                  </div>
                </div>
                <div
                  class="MuiListItemSecondaryAction-root"
                >
                  <span
                    aria-disabled="false"
                    class="MuiButtonBase-root MuiIconButton-root PrivateSwitchBase-root-15 MuiCheckbox-root MuiCheckbox-colorSecondary MuiIconButton-colorSecondary"
                  >
                    <span
                      class="MuiIconButton-label"
                    >
                      <input
                        class="PrivateSwitchBase-input-18"
                        data-indeterminate="false"
                        type="checkbox"
                        value=""
                      />
                      <svg
                        aria-hidden="true"
                        class="MuiSvgIcon-root"
                        focusable="false"
                        viewBox="0 0 24 24"
                      >
                        <path
                          d="M19 5v14H5V5h14m0-2H5c-1.1 0-2 .9-2 2v14c0 1.1.9 2 2 2h14c1.1 0 2-.9 2-2V5c0-1.1-.9-2-2-2z"
                        />
                      </svg>
                    </span>
                    <span
                      class="MuiTouchRipple-root"
                    />
                  </span>
                </div>
              </li>
              <li
                class="MuiListItem-container"
              >
                <div
                  class="MuiListItem-root MuiListItem-gutters MuiListItem-secondaryAction"
                >
                  <div
                    class="MuiListItemAvatar-root"
                  >
                    <div
                      class="MuiAvatar-root MuiAvatar-circle"
                    >
                      <img
                        class="MuiAvatar-img"
                        src="https://robohash.org/eligendiquifuga.png?size=50x50&set=set1"
                      />
                    </div>
                  </div>
                  <div
                    class="MuiListItemText-root MuiListItemText-multiline"
                  >
                    <span
                      class="MuiTypography-root MuiListItemText-primary MuiTypography-body1 MuiTypography-displayBlock"
                    >
                      Brewster Addicott
                    </span>
                    <p
                      class="MuiTypography-root MuiListItemText-secondary MuiTypography-body2 MuiTypography-colorTextSecondary MuiTypography-displayBlock"
                    >
                      baddicottev@columbia.edu
                    </p>
                  </div>
                </div>
                <div
                  class="MuiListItemSecondaryAction-root"
                >
                  <span
                    aria-disabled="false"
                    class="MuiButtonBase-root MuiIconButton-root PrivateSwitchBase-root-15 MuiCheckbox-root MuiCheckbox-colorSecondary MuiIconButton-colorSecondary"
                  >
                    <span
                      class="MuiIconButton-label"
                    >
                      <input
                        class="PrivateSwitchBase-input-18"
                        data-indeterminate="false"
                        type="checkbox"
                        value=""
                      />
                      <svg
                        aria-hidden="true"
                        class="MuiSvgIcon-root"
                        focusable="false"
                        viewBox="0 0 24 24"
                      >
                        <path
                          d="M19 5v14H5V5h14m0-2H5c-1.1 0-2 .9-2 2v14c0 1.1.9 2 2 2h14c1.1 0 2-.9 2-2V5c0-1.1-.9-2-2-2z"
                        />
                      </svg>
                    </span>
                    <span
                      class="MuiTouchRipple-root"
                    />
                  </span>
                </div>
              </li>
              <li
                class="MuiListItem-container"
              >
                <div
                  class="MuiListItem-root MuiListItem-gutters MuiListItem-secondaryAction"
                >
                  <div
                    class="MuiListItemAvatar-root"
                  >
                    <div
                      class="MuiAvatar-root MuiAvatar-circle MuiAvatar-colorDefault"
                    >
                      <svg
                        aria-hidden="true"
                        class="MuiSvgIcon-root MuiAvatar-fallback"
                        focusable="false"
                        viewBox="0 0 24 24"
                      >
                        <path
                          d="M12 12c2.21 0 4-1.79 4-4s-1.79-4-4-4-4 1.79-4 4 1.79 4 4 4zm0 2c-2.67 0-8 1.34-8 4v2h16v-2c0-2.66-5.33-4-8-4z"
                        />
                      </svg>
                    </div>
                  </div>
                  <div
                    class="MuiListItemText-root MuiListItemText-multiline"
                  >
                    <span
                      class="MuiTypography-root MuiListItemText-primary MuiTypography-body1 MuiTypography-displayBlock"
                    >
                      Lisle Adnet
                    </span>
                    <p
                      class="MuiTypography-root MuiListItemText-secondary MuiTypography-body2 MuiTypography-colorTextSecondary MuiTypography-displayBlock"
                    >
                      ladnet2o@nature.com
                    </p>
                  </div>
                </div>
                <div
                  class="MuiListItemSecondaryAction-root"
                >
                  <span
                    aria-disabled="false"
                    class="MuiButtonBase-root MuiIconButton-root PrivateSwitchBase-root-15 MuiCheckbox-root MuiCheckbox-colorSecondary MuiIconButton-colorSecondary"
                  >
                    <span
                      class="MuiIconButton-label"
                    >
                      <input
                        class="PrivateSwitchBase-input-18"
                        data-indeterminate="false"
                        type="checkbox"
                        value=""
                      />
                      <svg
                        aria-hidden="true"
                        class="MuiSvgIcon-root"
                        focusable="false"
                        viewBox="0 0 24 24"
                      >
                        <path
                          d="M19 5v14H5V5h14m0-2H5c-1.1 0-2 .9-2 2v14c0 1.1.9 2 2 2h14c1.1 0 2-.9 2-2V5c0-1.1-.9-2-2-2z"
                        />
                      </svg>
                    </span>
                    <span
                      class="MuiTouchRipple-root"
                    />
                  </span>
                </div>
              </li>
              <li
                class="MuiListItem-container"
              >
                <div
                  class="MuiListItem-root MuiListItem-gutters MuiListItem-secondaryAction"
                >
                  <div
                    class="MuiListItemAvatar-root"
                  >
                    <div
                      class="MuiAvatar-root MuiAvatar-circle"
                    >
                      <img
                        class="MuiAvatar-img"
                        src="https://robohash.org/recusandaeaperiamlaborum.png?size=50x50&set=set1"
                      />
                    </div>
                  </div>
                  <div
                    class="MuiListItemText-root MuiListItemText-multiline"
                  >
                    <span
                      class="MuiTypography-root MuiListItemText-primary MuiTypography-body1 MuiTypography-displayBlock"
                    >
                      Reggi Ahren
                    </span>
                    <p
                      class="MuiTypography-root MuiListItemText-secondary MuiTypography-body2 MuiTypography-colorTextSecondary MuiTypography-displayBlock"
                    >
                      rahren9b@parallels.com
                    </p>
                  </div>
                </div>
                <div
                  class="MuiListItemSecondaryAction-root"
                >
                  <span
                    aria-disabled="false"
                    class="MuiButtonBase-root MuiIconButton-root PrivateSwitchBase-root-15 MuiCheckbox-root MuiCheckbox-colorSecondary MuiIconButton-colorSecondary"
                  >
                    <span
                      class="MuiIconButton-label"
                    >
                      <input
                        class="PrivateSwitchBase-input-18"
                        data-indeterminate="false"
                        type="checkbox"
                        value=""
                      />
                      <svg
                        aria-hidden="true"
                        class="MuiSvgIcon-root"
                        focusable="false"
                        viewBox="0 0 24 24"
                      >
                        <path
                          d="M19 5v14H5V5h14m0-2H5c-1.1 0-2 .9-2 2v14c0 1.1.9 2 2 2h14c1.1 0 2-.9 2-2V5c0-1.1-.9-2-2-2z"
                        />
                      </svg>
                    </span>
                    <span
                      class="MuiTouchRipple-root"
                    />
                  </span>
                </div>
              </li>
              <li
                class="MuiListItem-container"
              >
                <div
                  class="MuiListItem-root MuiListItem-gutters MuiListItem-secondaryAction"
                >
                  <div
                    class="MuiListItemAvatar-root"
                  >
                    <div
                      class="MuiAvatar-root MuiAvatar-circle"
                    >
                      <img
                        class="MuiAvatar-img"
                        src="https://robohash.org/quaeratatnon.png?size=50x50&set=set1"
                      />
                    </div>
                  </div>
                  <div
                    class="MuiListItemText-root MuiListItemText-multiline"
                  >
                    <span
                      class="MuiTypography-root MuiListItemText-primary MuiTypography-body1 MuiTypography-displayBlock"
                    >
                      Claudio Aird
                    </span>
                    <p
                      class="MuiTypography-root MuiListItemText-secondary MuiTypography-body2 MuiTypography-colorTextSecondary MuiTypography-displayBlock"
                    >
                      caird40@guardian.co.uk
                    </p>
                  </div>
                </div>
                <div
                  class="MuiListItemSecondaryAction-root"
                >
                  <span
                    aria-disabled="false"
                    class="MuiButtonBase-root MuiIconButton-root PrivateSwitchBase-root-15 MuiCheckbox-root MuiCheckbox-colorSecondary MuiIconButton-colorSecondary"
                  >
                    <span
                      class="MuiIconButton-label"
                    >
                      <input
                        class="PrivateSwitchBase-input-18"
                        data-indeterminate="false"
                        type="checkbox"
                        value=""
                      />
                      <svg
                        aria-hidden="true"
                        class="MuiSvgIcon-root"
                        focusable="false"
                        viewBox="0 0 24 24"
                      >
                        <path
                          d="M19 5v14H5V5h14m0-2H5c-1.1 0-2 .9-2 2v14c0 1.1.9 2 2 2h14c1.1 0 2-.9 2-2V5c0-1.1-.9-2-2-2z"
                        />
                      </svg>
                    </span>
                    <span
                      class="MuiTouchRipple-root"
                    />
                  </span>
                </div>
              </li>
              <li
                class="MuiListItem-container"
              >
                <div
                  class="MuiListItem-root MuiListItem-gutters MuiListItem-secondaryAction"
                >
                  <div
                    class="MuiListItemAvatar-root"
                  >
                    <div
                      class="MuiAvatar-root MuiAvatar-circle"
                    >
                      <img
                        class="MuiAvatar-img"
                        src="https://robohash.org/etdolorsaepe.png?size=50x50&set=set1"
                      />
                    </div>
                  </div>
                  <div
                    class="MuiListItemText-root MuiListItemText-multiline"
                  >
                    <span
                      class="MuiTypography-root MuiListItemText-primary MuiTypography-body1 MuiTypography-displayBlock"
                    >
                      Yolanthe Aldwick
                    </span>
                    <p
                      class="MuiTypography-root MuiListItemText-secondary MuiTypography-body2 MuiTypography-colorTextSecondary MuiTypography-displayBlock"
                    >
                      yaldwick7d@purevolume.com
                    </p>
                  </div>
                </div>
                <div
                  class="MuiListItemSecondaryAction-root"
                >
                  <span
                    aria-disabled="false"
                    class="MuiButtonBase-root MuiIconButton-root PrivateSwitchBase-root-15 MuiCheckbox-root MuiCheckbox-colorSecondary MuiIconButton-colorSecondary"
                  >
                    <span
                      class="MuiIconButton-label"
                    >
                      <input
                        class="PrivateSwitchBase-input-18"
                        data-indeterminate="false"
                        type="checkbox"
                        value=""
                      />
                      <svg
                        aria-hidden="true"
                        class="MuiSvgIcon-root"
                        focusable="false"
                        viewBox="0 0 24 24"
                      >
                        <path
                          d="M19 5v14H5V5h14m0-2H5c-1.1 0-2 .9-2 2v14c0 1.1.9 2 2 2h14c1.1 0 2-.9 2-2V5c0-1.1-.9-2-2-2z"
                        />
                      </svg>
                    </span>
                    <span
                      class="MuiTouchRipple-root"
                    />
                  </span>
                </div>
              </li>
              <li
                class="MuiListItem-container"
              >
                <div
                  class="MuiListItem-root MuiListItem-gutters MuiListItem-secondaryAction"
                >
                  <div
                    class="MuiListItemAvatar-root"
                  >
                    <div
                      class="MuiAvatar-root MuiAvatar-circle MuiAvatar-colorDefault"
                    >
                      <svg
                        aria-hidden="true"
                        class="MuiSvgIcon-root MuiAvatar-fallback"
                        focusable="false"
                        viewBox="0 0 24 24"
                      >
                        <path
                          d="M12 12c2.21 0 4-1.79 4-4s-1.79-4-4-4-4 1.79-4 4 1.79 4 4 4zm0 2c-2.67 0-8 1.34-8 4v2h16v-2c0-2.66-5.33-4-8-4z"
                        />
                      </svg>
                    </div>
                  </div>
                  <div
                    class="MuiListItemText-root MuiListItemText-multiline"
                  >
                    <span
                      class="MuiTypography-root MuiListItemText-primary MuiTypography-body1 MuiTypography-displayBlock"
                    >
                      Colan Aldwinckle
                    </span>
                    <p
                      class="MuiTypography-root MuiListItemText-secondary MuiTypography-body2 MuiTypography-colorTextSecondary MuiTypography-displayBlock"
                    >
                      caldwinckle17@ed.gov
                    </p>
                  </div>
                </div>
                <div
                  class="MuiListItemSecondaryAction-root"
                >
                  <span
                    aria-disabled="false"
                    class="MuiButtonBase-root MuiIconButton-root PrivateSwitchBase-root-15 MuiCheckbox-root MuiCheckbox-colorSecondary MuiIconButton-colorSecondary"
                  >
                    <span
                      class="MuiIconButton-label"
                    >
                      <input
                        class="PrivateSwitchBase-input-18"
                        data-indeterminate="false"
                        type="checkbox"
                        value=""
                      />
                      <svg
                        aria-hidden="true"
                        class="MuiSvgIcon-root"
                        focusable="false"
                        viewBox="0 0 24 24"
                      >
                        <path
                          d="M19 5v14H5V5h14m0-2H5c-1.1 0-2 .9-2 2v14c0 1.1.9 2 2 2h14c1.1 0 2-.9 2-2V5c0-1.1-.9-2-2-2z"
                        />
                      </svg>
                    </span>
                    <span
                      class="MuiTouchRipple-root"
                    />
                  </span>
                </div>
              </li>
              <li
                class="MuiListItem-container"
              >
                <div
                  class="MuiListItem-root MuiListItem-gutters MuiListItem-secondaryAction"
                >
                  <div
                    class="MuiListItemAvatar-root"
                  >
                    <div
                      class="MuiAvatar-root MuiAvatar-circle MuiAvatar-colorDefault"
                    >
                      <svg
                        aria-hidden="true"
                        class="MuiSvgIcon-root MuiAvatar-fallback"
                        focusable="false"
                        viewBox="0 0 24 24"
                      >
                        <path
                          d="M12 12c2.21 0 4-1.79 4-4s-1.79-4-4-4-4 1.79-4 4 1.79 4 4 4zm0 2c-2.67 0-8 1.34-8 4v2h16v-2c0-2.66-5.33-4-8-4z"
                        />
                      </svg>
                    </div>
                  </div>
                  <div
                    class="MuiListItemText-root MuiListItemText-multiline"
                  >
                    <span
                      class="MuiTypography-root MuiListItemText-primary MuiTypography-body1 MuiTypography-displayBlock"
                    >
                      Flor Alfonsetto
                    </span>
                    <p
                      class="MuiTypography-root MuiListItemText-secondary MuiTypography-body2 MuiTypography-colorTextSecondary MuiTypography-displayBlock"
                    >
                      falfonsettonx@photobucket.com
                    </p>
                  </div>
                </div>
                <div
                  class="MuiListItemSecondaryAction-root"
                >
                  <span
                    aria-disabled="false"
                    class="MuiButtonBase-root MuiIconButton-root PrivateSwitchBase-root-15 MuiCheckbox-root MuiCheckbox-colorSecondary MuiIconButton-colorSecondary"
                  >
                    <span
                      class="MuiIconButton-label"
                    >
                      <input
                        class="PrivateSwitchBase-input-18"
                        data-indeterminate="false"
                        type="checkbox"
                        value=""
                      />
                      <svg
                        aria-hidden="true"
                        class="MuiSvgIcon-root"
                        focusable="false"
                        viewBox="0 0 24 24"
                      >
                        <path
                          d="M19 5v14H5V5h14m0-2H5c-1.1 0-2 .9-2 2v14c0 1.1.9 2 2 2h14c1.1 0 2-.9 2-2V5c0-1.1-.9-2-2-2z"
                        />
                      </svg>
                    </span>
                    <span
                      class="MuiTouchRipple-root"
                    />
                  </span>
                </div>
              </li>
              <li
                class="MuiListItem-container"
              >
                <div
                  class="MuiListItem-root MuiListItem-gutters MuiListItem-secondaryAction"
                >
                  <div
                    class="MuiListItemAvatar-root"
                  >
                    <div
                      class="MuiAvatar-root MuiAvatar-circle MuiAvatar-colorDefault"
                    >
                      <svg
                        aria-hidden="true"
                        class="MuiSvgIcon-root MuiAvatar-fallback"
                        focusable="false"
                        viewBox="0 0 24 24"
                      >
                        <path
                          d="M12 12c2.21 0 4-1.79 4-4s-1.79-4-4-4-4 1.79-4 4 1.79 4 4 4zm0 2c-2.67 0-8 1.34-8 4v2h16v-2c0-2.66-5.33-4-8-4z"
                        />
                      </svg>
                    </div>
                  </div>
                  <div
                    class="MuiListItemText-root MuiListItemText-multiline"
                  >
                    <span
                      class="MuiTypography-root MuiListItemText-primary MuiTypography-body1 MuiTypography-displayBlock"
                    >
                      Auria Allison
                    </span>
                    <p
                      class="MuiTypography-root MuiListItemText-secondary MuiTypography-body2 MuiTypography-colorTextSecondary MuiTypography-displayBlock"
                    >
                      aallisonpf@people.com.cn
                    </p>
                  </div>
                </div>
                <div
                  class="MuiListItemSecondaryAction-root"
                >
                  <span
                    aria-disabled="false"
                    class="MuiButtonBase-root MuiIconButton-root PrivateSwitchBase-root-15 MuiCheckbox-root MuiCheckbox-colorSecondary MuiIconButton-colorSecondary"
                  >
                    <span
                      class="MuiIconButton-label"
                    >
                      <input
                        class="PrivateSwitchBase-input-18"
                        data-indeterminate="false"
                        type="checkbox"
                        value=""
                      />
                      <svg
                        aria-hidden="true"
                        class="MuiSvgIcon-root"
                        focusable="false"
                        viewBox="0 0 24 24"
                      >
                        <path
                          d="M19 5v14H5V5h14m0-2H5c-1.1 0-2 .9-2 2v14c0 1.1.9 2 2 2h14c1.1 0 2-.9 2-2V5c0-1.1-.9-2-2-2z"
                        />
                      </svg>
                    </span>
                    <span
                      class="MuiTouchRipple-root"
                    />
                  </span>
                </div>
              </li>
              <li
                class="MuiListItem-container"
              >
                <div
                  class="MuiListItem-root MuiListItem-gutters MuiListItem-secondaryAction"
                >
                  <div
                    class="MuiListItemAvatar-root"
                  >
                    <div
                      class="MuiAvatar-root MuiAvatar-circle"
                    >
                      <img
                        class="MuiAvatar-img"
                        src="https://robohash.org/teneturlaborevoluptatem.png?size=50x50&set=set1"
                      />
                    </div>
                  </div>
                  <div
                    class="MuiListItemText-root MuiListItemText-multiline"
                  >
                    <span
                      class="MuiTypography-root MuiListItemText-primary MuiTypography-body1 MuiTypography-displayBlock"
                    >
                      Andy Anmore
                    </span>
                    <p
                      class="MuiTypography-root MuiListItemText-secondary MuiTypography-body2 MuiTypography-colorTextSecondary MuiTypography-displayBlock"
                    >
                      aanmoreoo@pcworld.com
                    </p>
                  </div>
                </div>
                <div
                  class="MuiListItemSecondaryAction-root"
                >
                  <span
                    aria-disabled="false"
                    class="MuiButtonBase-root MuiIconButton-root PrivateSwitchBase-root-15 MuiCheckbox-root MuiCheckbox-colorSecondary MuiIconButton-colorSecondary"
                  >
                    <span
                      class="MuiIconButton-label"
                    >
                      <input
                        class="PrivateSwitchBase-input-18"
                        data-indeterminate="false"
                        type="checkbox"
                        value=""
                      />
                      <svg
                        aria-hidden="true"
                        class="MuiSvgIcon-root"
                        focusable="false"
                        viewBox="0 0 24 24"
                      >
                        <path
                          d="M19 5v14H5V5h14m0-2H5c-1.1 0-2 .9-2 2v14c0 1.1.9 2 2 2h14c1.1 0 2-.9 2-2V5c0-1.1-.9-2-2-2z"
                        />
                      </svg>
                    </span>
                    <span
                      class="MuiTouchRipple-root"
                    />
                  </span>
                </div>
              </li>
              <li
                class="MuiListItem-container"
              >
                <div
                  class="MuiListItem-root MuiListItem-gutters MuiListItem-secondaryAction"
                >
                  <div
                    class="MuiListItemAvatar-root"
                  >
                    <div
                      class="MuiAvatar-root MuiAvatar-circle"
                    >
                      <img
                        class="MuiAvatar-img"
                        src="https://robohash.org/quaeautvoluptas.png?size=50x50&set=set1"
                      />
                    </div>
                  </div>
                  <div
                    class="MuiListItemText-root MuiListItemText-multiline"
                  >
                    <span
                      class="MuiTypography-root MuiListItemText-primary MuiTypography-body1 MuiTypography-displayBlock"
                    >
                      Eberhard Annwyl
                    </span>
                    <p
                      class="MuiTypography-root MuiListItemText-secondary MuiTypography-body2 MuiTypography-colorTextSecondary MuiTypography-displayBlock"
                    >
                      eannwyll7@blogger.com
                    </p>
                  </div>
                </div>
                <div
                  class="MuiListItemSecondaryAction-root"
                >
                  <span
                    aria-disabled="false"
                    class="MuiButtonBase-root MuiIconButton-root PrivateSwitchBase-root-15 MuiCheckbox-root MuiCheckbox-colorSecondary MuiIconButton-colorSecondary"
                  >
                    <span
                      class="MuiIconButton-label"
                    >
                      <input
                        class="PrivateSwitchBase-input-18"
                        data-indeterminate="false"
                        type="checkbox"
                        value=""
                      />
                      <svg
                        aria-hidden="true"
                        class="MuiSvgIcon-root"
                        focusable="false"
                        viewBox="0 0 24 24"
                      >
                        <path
                          d="M19 5v14H5V5h14m0-2H5c-1.1 0-2 .9-2 2v14c0 1.1.9 2 2 2h14c1.1 0 2-.9 2-2V5c0-1.1-.9-2-2-2z"
                        />
                      </svg>
                    </span>
                    <span
                      class="MuiTouchRipple-root"
                    />
                  </span>
                </div>
              </li>
              <li
                class="MuiListItem-container"
              >
                <div
                  class="MuiListItem-root MuiListItem-gutters MuiListItem-secondaryAction"
                >
                  <div
                    class="MuiListItemAvatar-root"
                  >
                    <div
                      class="MuiAvatar-root MuiAvatar-circle"
                    >
                      <img
                        class="MuiAvatar-img"
                        src="https://robohash.org/dolorquiaest.png?size=50x50&set=set1"
                      />
                    </div>
                  </div>
                  <div
                    class="MuiListItemText-root MuiListItemText-multiline"
                  >
                    <span
                      class="MuiTypography-root MuiListItemText-primary MuiTypography-body1 MuiTypography-displayBlock"
                    >
                      Alethea Anstiss
                    </span>
                    <p
                      class="MuiTypography-root MuiListItemText-secondary MuiTypography-body2 MuiTypography-colorTextSecondary MuiTypography-displayBlock"
                    >
                      aanstiss51@deviantart.com
                    </p>
                  </div>
                </div>
                <div
                  class="MuiListItemSecondaryAction-root"
                >
                  <span
                    aria-disabled="false"
                    class="MuiButtonBase-root MuiIconButton-root PrivateSwitchBase-root-15 MuiCheckbox-root MuiCheckbox-colorSecondary MuiIconButton-colorSecondary"
                  >
                    <span
                      class="MuiIconButton-label"
                    >
                      <input
                        class="PrivateSwitchBase-input-18"
                        data-indeterminate="false"
                        type="checkbox"
                        value=""
                      />
                      <svg
                        aria-hidden="true"
                        class="MuiSvgIcon-root"
                        focusable="false"
                        viewBox="0 0 24 24"
                      >
                        <path
                          d="M19 5v14H5V5h14m0-2H5c-1.1 0-2 .9-2 2v14c0 1.1.9 2 2 2h14c1.1 0 2-.9 2-2V5c0-1.1-.9-2-2-2z"
                        />
                      </svg>
                    </span>
                    <span
                      class="MuiTouchRipple-root"
                    />
                  </span>
                </div>
              </li>
              <li
                class="MuiListItem-container"
              >
                <div
                  class="MuiListItem-root MuiListItem-gutters MuiListItem-secondaryAction"
                >
                  <div
                    class="MuiListItemAvatar-root"
                  >
                    <div
                      class="MuiAvatar-root MuiAvatar-circle"
                    >
                      <img
                        class="MuiAvatar-img"
                        src="https://robohash.org/quomaximeaccusantium.png?size=50x50&set=set1"
                      />
                    </div>
                  </div>
                  <div
                    class="MuiListItemText-root MuiListItemText-multiline"
                  >
                    <span
                      class="MuiTypography-root MuiListItemText-primary MuiTypography-body1 MuiTypography-displayBlock"
                    >
                      Tammi Arber
                    </span>
                    <p
                      class="MuiTypography-root MuiListItemText-secondary MuiTypography-body2 MuiTypography-colorTextSecondary MuiTypography-displayBlock"
                    >
                      tarberfa@taobao.com
                    </p>
                  </div>
                </div>
                <div
                  class="MuiListItemSecondaryAction-root"
                >
                  <span
                    aria-disabled="false"
                    class="MuiButtonBase-root MuiIconButton-root PrivateSwitchBase-root-15 MuiCheckbox-root MuiCheckbox-colorSecondary MuiIconButton-colorSecondary"
                  >
                    <span
                      class="MuiIconButton-label"
                    >
                      <input
                        class="PrivateSwitchBase-input-18"
                        data-indeterminate="false"
                        type="checkbox"
                        value=""
                      />
                      <svg
                        aria-hidden="true"
                        class="MuiSvgIcon-root"
                        focusable="false"
                        viewBox="0 0 24 24"
                      >
                        <path
                          d="M19 5v14H5V5h14m0-2H5c-1.1 0-2 .9-2 2v14c0 1.1.9 2 2 2h14c1.1 0 2-.9 2-2V5c0-1.1-.9-2-2-2z"
                        />
                      </svg>
                    </span>
                    <span
                      class="MuiTouchRipple-root"
                    />
                  </span>
                </div>
              </li>
            </ul>
            <div
              class="MuiBox-root MuiBox-root-19 makeStyles-footer-13"
            >
              <button
                class="MuiButtonBase-root MuiButton-root MuiButton-contained MuiButton-containedPrimary"
                tabindex="0"
                type="button"
              >
                <span
                  class="MuiButton-label"
                >
                  Load more
                  <span
                    class="MuiButton-endIcon MuiButton-iconSizeMedium"
                  >
                    <svg
                      aria-hidden="true"
                      class="MuiSvgIcon-root"
                      focusable="false"
                      viewBox="0 0 24 24"
                    >
                      <path
                        d="M19 13h-6v6h-2v-6H5v-2h6V5h2v6h6v2z"
                      />
                    </svg>
                  </span>
                </span>
                <span
                  class="MuiTouchRipple-root"
                />
              </button>
            </div>
          </div>
        </div>
      </div>
    </div>
  </div>
</body>
`;
