<svg width="76" height="131" viewBox="0 0 76 131" fill="none" xmlns="http://www.w3.org/2000/svg">
<path d="M73.0583 3.26436C61.4224 4.13694 50.2682 8.41744 41.1291 15.6766C31.8427 23.0005 25.0742 33.3277 21.7872 44.6167C18.7578 55.0543 17.9869 67.9062 24.0721 77.4922C27.0157 82.1003 31.3838 85.5538 36.6332 87.178C41.6706 88.7199 47.2161 88.7024 52.2605 87.1482C62.8627 83.8489 70.2533 74.0561 72.4995 63.4364C73.6279 58.0188 73.8469 52.0527 71.3588 46.9628C68.6763 41.4313 62.8259 38.8416 57.2068 37.4154C46.608 34.7381 35.0159 36.1889 25.3353 41.2614C15.5075 46.3987 8.23091 55.3329 4.69511 65.8177C1.23815 76.1623 1.54654 87.5548 6.03029 97.4947C10.316 107.065 18.213 114.939 27.6395 119.503C29.8892 120.621 32.2967 121.459 34.7111 122.153C36.9136 122.764 38.0875 119.365 35.8132 118.75C26.5724 116.283 18.3654 110.338 12.9145 102.511C7.26204 94.3864 4.93343 84.5516 6.27555 74.7519C7.54584 64.9486 12.4658 55.6114 20.0509 49.2126C27.6359 42.8138 37.7352 39.4899 47.6593 39.758C52.6196 39.928 57.8288 40.9022 62.2599 43.0625C64.578 44.2557 66.6596 45.8694 67.9159 48.163C69.0355 50.3059 69.5664 52.7081 69.6628 55.1611C70.0518 64.9012 65.4384 75.3335 57.3207 80.8422C49.5763 86.0811 38.4028 86.3282 31.0684 80.2097C23.1802 73.6322 22.3146 61.8526 23.7829 52.419C25.3861 41.6959 30.4235 31.4283 37.8631 23.5822C45.2273 15.8045 54.9254 10.3728 65.4102 8.0039C67.8843 7.4765 70.4266 7.02446 72.955 6.85975C73.8959 6.76163 74.7859 6.22898 74.8385 5.15141C74.8087 4.28586 73.9957 3.23808 73.0583 3.26436Z" fill="#EC5938"/>
<path d="M29.7944 128.467C31.4957 127.542 33.2006 126.545 34.7617 125.541C35.6518 125.009 36.4736 124.401 37.2953 123.793C38.1136 123.256 38.8635 122.645 39.2682 121.729C40.2354 119.615 38.2467 117.574 37.1026 115.934C35.9584 114.294 34.7354 112.794 33.4406 111.291C31.8689 109.558 29.2319 111.95 30.8036 113.683C31.8969 114.888 32.9149 116.162 33.8611 117.432C34.3359 118.032 34.7354 118.699 35.2103 119.298C35.4118 119.596 35.6816 119.969 35.8831 120.267C35.9514 120.343 36.0162 120.49 36.0846 120.565C36.0881 120.493 36.0916 120.421 36.0232 120.346C36.0303 120.202 36.1056 120.134 36.1126 119.99C36.0338 120.131 35.9584 120.199 36.0338 120.131C34.9212 120.796 33.6473 121.814 32.4559 122.62C31.0454 123.488 29.6349 124.355 28.1561 125.147C26.1499 126.417 27.7952 129.594 29.7944 128.467Z" fill="#EC5938"/>
</svg>
