id_to_ignore,rec_id,rec_role,dup_index,sex,birthDate,title,forenames,surname,county,townCity,postCode,contactDetail,nameTypeID,nameTypeDesc,addressStatusTypeID,addressStatusTypeDesc,contactTypeID,contactTypeDesc,natSensRecTypeID,natSensRecTypeDesc,supersedingFlag,accessGranted,addressLine1,nino,nino_suffix
1001,1,org,,f,23-Nov-1967,mr,kyle,scoby,,lower winchendon,tq1 3ud,scoby@gmail.com,1,Name1,,?,3,Personal Mobile Telephone Number,U6,Unrestricted Access,N,Y,19 tenison-woods circuit,RJ428577,B
1002,2,org,,f,26-Dec-2000,,sadhna,sikka,county durham,luton (west),ls14 1aa,00919498936244,1,name1,,?,3,personal mobile telephone number,u6,unrestricted access,n,y,3 slightplace,MW200002,A
1003,3,org,,m,29-Jun-1997,,claire,aarts,leicestershire,ibstock,le9 3gj,61818616745223|00447700900123|00441144960123,1,Name1,,?,3,Personal Mobile Telephone Number,U6,Unrestricted Access,N,Y,NA de chair street,LB765460,D
1004,4,org,,m,23-Dec-1978,dr,Michael,Holding,Leeds,leeds,ls11 5rb,9099014818|02081114129,1,name1,,?,3,personal mobile telephone number,u6,unrestricted access,n,y,18 bemboka crescent,AE767818,D
1005,5,org,,f,05-Sep-1982,,shawn,hurst,yorkshire moors national park,st paul's,yo22 4hn,9099014809|07961684342,1,name1,,?,3,personal mobile telephone number,u6,unrestricted access,n,y,9 bemboka crescent,AE767809,C
1006,6,org,,f,29-Feb-1960,,shawne,hurst,yorkshire moors national park,cardiff,ne14 7hn,9099014810|01410654223,1,name1,,?,3,personal mobile telephone number,u6,unrestricted access,n,y,10 bemboka crescent,AE767810,C
1007,7,org,,m,02-Jan-1963,dr,taylor-saige,gayle,greater manchester,liverpool,ng25 7bg,9099014813|07565692897,1,name1,,?,3,personal mobile telephone number,u6,unrestricted access,n,y,13 bemboka crescent,AE767813,A
1008,8,org,,f,29-Feb-1960,,shawne,hurst,yorkshire moors national park,stourport-on-severn,ne13 7nh,9099014811|02085746922,1,name1,,?,3,personal mobile telephone number,u6,unrestricted access,n,y,11 bemboka crescent,AE767811,C
1009,9,org,,f,23-Sep-1966,,william,chirat-hivat,essex,oxford,o11 5rb,9099014817|02037812345|08003289393,1,name1,,?,3,personal mobile telephone number,u6,unrestricted access,n,y,17 bemboka crescent,AE767817,B
1010,10,org,,m,02-Nov-1965,dr,Jazzy-saga,par ker,Newcastle,Tyne and wear,ne13 1po,9099014806|07455150801|07429590060|07950456106,1,name1,,?,3,personal mobile telephone number,u6,unrestricted access,n,y,6 bemboka crescent,AE767806,A
1011,11,org,,m,10-Aug-1965,dr,mike,o'calloway,bolton,bolton,ls10 4rb,9099014819|07544725740|02071882321,2,name2,,?,4,personal mobile telephone number,u7,unrestricted access,n,y,19 bemboka crescent,AE767819,A
1012,12,org,,m,06-Jan-1987,mr,Steve,Smith,,lower winchendon,ls12 3nh,9099014821|wrong.email.com|07753210550,1,Name1,,?,3,Personal Mobile Telephone Number,U6,Unrestricted Access,N,Y,19 tenison-woods circuit,AE767821,C
1013,13,org,,f,16-Apr-1938,,quvenzhan,wallis,greater manchester,cardiff,ng25 0bg,9099014808|07900000001,1,name1,,?,3,personal mobile telephone number,u6,unrestricted access,n,y,8 bemboka crescent,AE767808,A
1014,14,org,,m,13-Dec-1990,,Greame,Swan,,,ls3 5pi,9099014820|07553210559,1,name1,,?,3,personal mobile telephone number,u13,unrestricted access,n,y,,AE767820,A
1015,15,org,,m,14-Apr-1983,,paris,smith,,,wd7 8dp,0428096805|01204576830|07795433811|07943803211|07950456106,1,name1,,?,3,personal mobile telephone number,u13,unrestricted access,n,y,,GN129520,A
1016,16,org,,m,24-Apr-1999,,benjamin,nevis,,,NE1 8HL,0428096805|01204576830|07795433811|07943803211|07950456106,1,name1,,?,3,personal mobile telephone number,u13,unrestricted access,n,y,,HP129521,B
1017,17,org,,f,12-Sep-1998,,Samantha,gleadow,,,ls12 8UP,2809678|01204576830|07795433811|07943803211|07950456106,1,name1,,?,3,personal mobile telephone number,u13,unrestricted access,n,y,,HP126722,B
1018,18,org,,m,22-Dec-1989,,alexander,simon,,,lv11 7QP,0428096235|01204576830|07795433811|07943803211|07950456106,1,name1,,?,3,personal mobile telephone number,u13,unrestricted access,n,y,,HP126823,B
1019,19,org,,f,02-Aug-1910,,ella,tash,,,wf3 1ua,0717317674|01204576830|07795433811|07943803211|07950456106,1,name1,,?,3,personal mobile telephone number,u13,unrestricted access,n,y,,AE211099,C
1020,20,org,,f,04-Oct-1980,,victoria,rose,,,Sw7 9PG,0426796235|01204576830|07795433811|07943803211|07950456106,1,name1,,?,3,personal mobile telephone number,u13,unrestricted access,n,y,,HP126924,A
1021,21,org,,m,22-Nov-1982,,vijesh,morgan,,,Nj9 8kG,0426793425|01204576830|07795433811|07943803211|07950456106,1,name1,,?,3,personal mobile telephone number,u13,unrestricted access,n,y,,HP127126,A
1022,22,org,,m,01-Jan-1970,,Bob,Taylor,,port sunlight,Ne27 0la,0426793005|07950456106,1,Name1,,?,3,Personal Mobile Telephone Number,U6,Unrestricted Access,N,Y,68 australie close,MW000135,A
1023,23,org,,f,01-Jan-1980,,Kerry,James,,port sunlight,ne4 9qb,0426793115,1,Name1,,?,3,Personal Mobile Telephone Number,U6,Unrestricted Access,N,Y,68 australie close,MW000136,A
1024,24,org,,m,31-Dec-2002,,Brett,Lee,,,MN4 8UP,9099014822|01204576830|07795433811|07943803211|07950456106,1,name1,,?,3,personal mobile telephone number,u13,unrestricted access,n,y,,AE767823,C
1025,25,org,,m,31-Dec-2002,,Brett,Lee,,,FK1 5UL,0120457683|07795433811|07943803211|07950456106,1,name1,,?,3,personal mobile telephone number,u13,unrestricted access,n,y,,AE767824,C
1026,26,org,,m,10-Jan-1987,,Paul,Hayman,,,Ny9 0yk,9099014823 EXT 446|01204576830|07795433811|07943803211|07950456106,1,name1,,?,3,personal mobile telephone number,u13,unrestricted access,n,y,,AE767825,C
1027,27,org,,m,14-Feb-1987,,Andrew,Flintoff,,,ls1 4bn,9099014824|01204576830|07795433811|07943803211|07950456106,1,name1,,?,3,personal mobile telephone number,u13,unrestricted access,n,y,,AE767826,C
1028,28,org,,m,29-Oct-1990,,Tony,Blair,,,Bn9 8jk,9099014825|01204576830|07795433811|07943803211|07950456106,1,name1,,?,3,personal mobile telephone number,u13,unrestricted access,n,y,,AE767827,C
1029,29,org,,f,01-Jan-1975,,Fillipa,Jones,,port sunlight,ne4 9bs,0426793335|07455150801,1,Name1,,?,3,Personal Mobile Telephone Number,U6,Unrestricted Access,N,Y,68 australie close,MW000138,A
1030,30,org,,f,01-Jan-1989,,Stewart,Kilter,,port sunlight,ch5 4pq,0426793445|07455150801,1,Name1,,?,3,Personal Mobile Telephone Number,U6,Unrestricted Access,N,Y,68 australie close,MW000139,B
1031,31,org,,f,01-Jan-1973,,Jane,Macdonald,,port sunlight,l17 0bz,0426793446|07455150801,1,Name1,,?,3,Personal Mobile Telephone Number,U6,Unrestricted Access,N,Y,68 australie close,MW000140,B
1032,32,org,,f,01-Jan-1981,,Gill,Flloweer,,port sunlight,Ne4 7jd,0426793447|07455150801,1,Name1,,?,3,Personal Mobile Telephone Number,U6,Unrestricted Access,N,Y,68 australie close,MW000141,C
1033,33,org,,f,01-Jan-1976,,Jacks,Christina,,port sunlight,ne4 5su,0426793448|07455150801,1,Name1,,?,3,Personal Mobile Telephone Number,U6,Unrestricted Access,N,Y,68 australie close,MW000142,A
1034,34,org,,m,17-Aug-1972,,r-ane,starc,,,le15 9qz,9099014801|test@email.com|07700900012|01134960010|01124960010,1,Name1,,?,3,Personal Mobile Telephone Number,U6,Unrestricted Access,N,Y,,AE767801,B
1035,35,org,,m,17-Aug-1972,,r.ane,starc,,,le15 9qz,9099014802|test1@email.com|01610541231,1,Name1,,?,3,Personal Mobile Telephone Number,U6,Unrestricted Access,N,Y,,AE767802,B
1036,36,org,,m,17-Aug-1972,,r'ane,starc,,,le15 9qz,9099014803|test2@email.com|0167112233|07700900012|0011190112432|003534567902121,1,Name1,,?,3,Personal Mobile Telephone Number,U6,Unrestricted Access,N,Y,,AE790802,B
1037,37,org,,m,16-Apr-1969,,yeda,coster-waldau,,,w1j 7nt,9099014804|01610900123,1,Name1,,?,3,Personal Mobile Telephone Number,U6,Unrestricted Access,N,Y,,AE767804,B
1038,38,org,,m,16-Apr-1969,,yeda,smith-johnson,,,w1j 7nt,9099014805|01410871221,1,Name1,,?,3,Personal Mobile Telephone Number,U6,Unrestricted Access,N,Y,,AE767805,B
1039,39,org,,f,17-Aug-1972,,O'suliya,gordon,,,im9 4eb,9099014807|07710079304,1,Name1,,?,3,Personal Mobile Telephone Number,U6,Unrestricted Access,N,Y,,AE767807,B
1040,40,org,,f,14-Mar-1975,,shawne,hurst,,,hx6 4qs,9099014812|07943803211,1,Name1,,?,3,Personal Mobile Telephone Number,U6,Unrestricted Access,N,Y,,AE767812,D
1041,41,org,,f,02-Jan-1963,,taylor-saige,par ker,,,im9 4eb,9099014814|07565692111,1,Name1,,?,3,Personal Mobile Telephone Number,U6,Unrestricted Access,N,Y,,AE767814,A
1042,42,org,,m,16-Apr-1938,,jenny mandy ross liam,davison,,,cr2 6hx,9099014815|01204576830|07795433811|07943803211|0019765121112|00447432108501|003534567902333|07950456106,1,Name1,,?,3,Personal Mobile Telephone Number,U6,Unrestricted Access,N,Y,,AE767815,A
1043,43,org,,f,06-Jan-1987,,Steve,Smith,,,LS12 3NH,9099014821|02071882329|08003289393,1,Name1,,?,3,Personal Mobile Telephone Number,U6,Unrestricted Access,N,Y,,AE767822,C
1044,44,org,,m,29-Oct-1990,,Tony,Blair,,,ML9 3PB,9099014825|01204576830|07795433811|07943803211|07950456106,2,Name1,,?,3,Personal Mobile Telephone Number,U6,Unrestricted Access,N,Y,,AE767828,C
1045,45,org,,f,22-Oct-1988,,victoria,foster,,,Ap9 9UG,0426793425|01204576830|07943803211|07950456106,1,Name1,,?,3,Personal Mobile Telephone Number,U6,Unrestricted Access,N,Y,,HP127025,A
1046,46,org,,m,01-Jan-1985,,Connie,Smith,,,ne12 8nh,0426793225,1,Name1,,?,3,Personal Mobile Telephone Number,U6,Unrestricted Access,N,Y,,MW000137,A
1047,47,org,,f,01-Jan-1987,,Jo,Smith,,,ne4 5su,0426793448|07455150801,1,Name1,,?,3,Personal Mobile Telephone Number,U6,Unrestricted Access,N,Y,,MW000143,B
1048,48,org,,f,01-Jan-1977,,Sue,Yo,,,ne4 5su,0426793448|07755338866,1,Name1,,?,3,Personal Mobile Telephone Number,U6,Unrestricted Access,N,Y,,MW000144,B
1049,49,org,,f,30-Mar-2000,,Xing,hamilton,,,ne60 5PL,0426793568|01204576830|07795433811|07943803211|07950456106,1,Name1,,?,3,Personal Mobile Telephone Number,U6,Unrestricted Access,N,Y,,MW000155,B
1050,50,org,,f,12-Jan-1980,,Su,yop,,,ne24 5GP,0426793998|01204576830|07795433811|07943803211|07950456106,1,Name1,,?,3,Personal Mobile Telephone Number,U6,Unrestricted Access,N,Y,,MW000187,B
1051,51,org,,f,23-Oct-1957,,beau,keblovszky,,,ct20 3bs,356845068|07544725740|001161321123|07432288264,1,Name1,,?,3,Personal Mobile Telephone Number,U6,Unrestricted Access,N,Y,,PA333485,B
1052,52,org,,f,23-Oct-1957,,beau,jones,,,ne34 6ts,356845068|07544725740|07432288264,1,Name1,,?,3,Personal Mobile Telephone Number,U6,Unrestricted Access,N,Y,,PA333333,B
1053,53,org,,m,15-Jul-2000,,Stuart,Broad,,,MK13 9KL,0775238700|0897654345|sbroad12@yahoo.com|07432109503|07544725740|01204576830|07950456106|07432288264,1,Name1,,?,3,Personal Mobile Telephone Number,U6,Unrestricted Access,N,Y,,AC974514,C
1054,54,org,,m,01-Jan-1978,,NORA,PORTER,,,NE3 5JA,7700900123|01144960123|0123123434566,1,Name1,,?,3,Personal Mobile Telephone Number,U6,Unrestricted Access,N,Y,,MW000683,A
1055,55,org,,f,15-Mar-1980,,TOM,HARDY,,,NE28 8RL,0955 5544112|0675 9944551|0456 7766443|0780986903,2,Name1,,?,3,Personal Mobile Telephone Number,U6,Unrestricted Access,N,Y,,MW000749,A
1056,56,org,,m,01-Jan-1950,,FREDO,NAMEOVERTHIRT,,,NE28 9BY,0755 5467832|07121111445,1,Name1,,?,3,Personal Mobile Telephone Number,U6,Unrestricted Access,N,Y,,MW000932,A
1057,57,org,,f,01-Jan-1982,,TOM,ONE,,,NE28 9BY,,1,Name1,,?,3,Personal Mobile Telephone Number,U6,Unrestricted Access,N,Y,,MW000678,A
1058,58,org,,f,01-Jan-1980,,SAM,STEWARD,,,NE28 9BY,9876534567,1,Name1,,?,3,Personal Mobile Telephone Number,U6,Unrestricted Access,N,Y,,MW000689,A
1059,59,org,,f,02-Aug-1910,,Ella,Tash,,,YO76 1UA,0717317674|01204576830|07795433811|07943803211|07950456106,1,Name1,,?,3,Personal Mobile Telephone Number,U6,Unrestricted Access,N,Y,,AE213099,C
1060,60,org,,f,11-Jun-1928,,melissa,bjondic,,,PL25 5HR,251200584,1,Name1,,?,3,Personal Mobile Telephone Number,U6,Unrestricted Access,N,Y,,AB487142,B
1061,61,org,,f,22-Feb-1990,,lilly-martin-tony,iron.lady.uk,,,GP115MN,276744911,1,Name1,,?,3,Personal Mobile Telephone Number,U6,Unrestricted Access,N,Y,,AB558869,B
1062,62,org,,f,10-Nov-1972,,Mick,verma,,,HP2 5TP,0775878434|mick99@yahoo.com,1,Name1,,?,3,Personal Mobile Telephone Number,U6,Unrestricted Access,N,Y,,AC874513,B
1063,63,org,,f,15-Jul-2000,,Stuart,Broad,,,MK13 9KL,0775238700|0987654644|sbroad99@yahoo.com,1,Name1,,?,3,Personal Mobile Telephone Number,U6,Unrestricted Access,N,Y,,AC884515,D
1064,64,org,,f,10-Nov-1972,,Mick,verma,,,HP2 5TP,0775878434|mick12@yahoo.com,1,Name1,,?,3,Personal Mobile Telephone Number,U6,Unrestricted Access,N,Y,,AC974512,A
1065,65,org,,f,11-Sep-1999,,robert,nomatch,,,HU7 4PG,301054731,1,Name1,,?,3,Personal Mobile Telephone Number,U6,Unrestricted Access,N,Y,,JA999720,A
1066,66,org,,f,29-Sep-1942,,jack,gardenar,,,MK18 2JZ,440118217,1,Name1,,?,3,Personal Mobile Telephone Number,U6,Unrestricted Access,N,Y,,JR464140,A
1067,67,org,,f,05-Sep-1982,,ben,hurst,,,YO22 4HN,394550275,1,Name1,,?,3,Personal Mobile Telephone Number,U6,Unrestricted Access,N,Y,,JT838072,A
1068,68,org,,f,05-Sep-1982,,shenae,hurst,,,NE21 4HN,394550275,1,Name1,,?,3,Personal Mobile Telephone Number,U6,Unrestricted Access,N,Y,,JT838073,B
1069,69,org,,f,02-Jan-1963,,taylor-saige,ming,,,NG25 0BG,381285181,1,Name1,,?,3,Personal Mobile Telephone Number,U6,Unrestricted Access,N,Y,,JZ631989,B
1070,70,org,,f,12-Jan-1980,,s,yop,,,NE24 5GP,426793785,1,Name1,,?,3,Personal Mobile Telephone Number,U6,Unrestricted Access,N,Y,,MW000197,C
1071,71,org,,f,22-May-1960,,Sachin,T,,,LS3 5GP,426793664,1,Name1,,?,3,Personal Mobile Telephone Number,U6,Unrestricted Access,N,Y,,MW000257,B
1072,72,org,,f,22-May-1960,,Sachin,Te,,,LS3 5GP,426793875,1,Name1,,?,3,Personal Mobile Telephone Number,U6,Unrestricted Access,N,Y,,MW000307,C
1073,73,org,,f,15-Aug-1999,,A,B,,,JK12 8KL,1526793875,1,Name1,,?,3,Personal Mobile Telephone Number,U6,Unrestricted Access,N,Y,,MW000308,C
1074,74,org,,f,17-May-1952,,jessica,greenhalgh,,,LE15 9QZ,222959347,1,Name1,,?,3,Personal Mobile Telephone Number,U6,Unrestricted Access,N,Y,,PT306257,B
1075,75,org,,f,17-May-1952,,j'ane,gordon,,,LE15 9QZ,0322959347|j.ane@gmail.com,1,Name1,,?,3,Personal Mobile Telephone Number,U6,Unrestricted Access,N,Y,,PT568951,D
1076,76,org,,f,17-May-1952,,j'ane,gordon,,,LE15 9QZ,0222959348|j_ane@gmail.com,1,Name1,,?,3,Personal Mobile Telephone Number,U6,Unrestricted Access,N,Y,,PT568952,A
1077,77,org,,f,16-Apr-1969,,janet,coster-waldau,,,E6 5NS,276744973,1,Name1,,?,3,Personal Mobile Telephone Number,U6,Unrestricted Access,N,Y,,PT568958,D
1078,78,org,,f,16-Apr-1969,,janet,smith-johnson,,,E6 5NS,276744973,1,Name1,,?,3,Personal Mobile Telephone Number,U6,Unrestricted Access,N,Y,,PT568960,A
1079,79,org,,f,02-Jan-1963,,taylor-saige,ming,,,NG25 0BG,381285181,1,Name1,,?,3,Personal Mobile Telephone Number,U6,Unrestricted Access,N,Y,,PT568961,B
1080,80,org,,f,27-Dec-1945,,Brian Michael,Bay,,,NE22 1BQ,1526793875,1,Name1,,?,3,Personal Mobile Telephone Number,U6,Unrestricted Access,N,Y,,AB125308,C
1081,81,org,,f,27-Dec-1945,,Brian,Cost,,,NE22 1BQ,1626793865,1,Name1,,?,3,Personal Mobile Telephone Number,U6,Unrestricted Access,N,Y,,AB125309,B
1082,82,org,,f,27-Dec-1945,,Bill James,Island,,,NE22 1BQ,1726793875,1,Name1,,?,3,Personal Mobile Telephone Number,U6,Unrestricted Access,N,Y,,AB125310,C
1083,83,org,,f,12-Jan-1963,,anne-marrie,parker,,,LS18 9UY,1826793805,1,Name1,,?,3,Personal Mobile Telephone Number,U6,Unrestricted Access,N,Y,,AB125311,A
1084,84,org,,f,23-Jan-2000,,sandra,maxim,,,NE2 2BP,1826799005,1,Name1,,?,3,Personal Mobile Telephone Number,U6,Unrestricted Access,N,Y,,AB125345,B
1085,85,org,,f,23-Jan-2000,,arnold,long,,,NE56 5JK,251200894,1,Name1,,?,3,Personal Mobile Telephone Number,U6,Unrestricted Access,N,Y,,AB125347,B
1086,86,org,,f,06-Apr-1965,,,bernardson,,,RG1 5QL,458125341,1,Name1,,?,3,Personal Mobile Telephone Number,U6,Unrestricted Access,N,Y,,AC723756,A
1087,87,org,,f,27-Aug-1999,,jhonny,root,,,L19 9DB,9099014991,1,Name1,,?,3,Personal Mobile Telephone Number,U6,Unrestricted Access,N,Y,,AE767555,B
1088,88,org,,f,27-Aug-1999,,jhonny,root,,,L19 9DB,9099014992,1,Name1,,?,3,Personal Mobile Telephone Number,U6,Unrestricted Access,N,Y,,AE767556,B
1089,89,org,,f,30-Oct-1995,,james,flower,,,NE12 9SL,1099014802,1,Name1,,?,3,Personal Mobile Telephone Number,U6,Unrestricted Access,N,Y,,AE767803,A
1090,90,org,,f,20-May-1996,,thomas ,o'calloway,,,SW1A 1AA,61778102963,1,Name1,,?,3,Personal Mobile Telephone Number,U6,Unrestricted Access,N,Y,,AE767816,B
1091,91,org,,f,20-Feb-1992,,jim,ross,,,YO1 8BG,jim.ross@yopmail.com|9898789674,1,Name1,,?,3,Personal Mobile Telephone Number,U6,Unrestricted Access,N,Y,,AE767886,B
1092,92,org,,f,27-Aug-1999,,jhonny,root,,,L19 9DB,9099014993,1,Name1,,?,3,Personal Mobile Telephone Number,U6,Unrestricted Access,N,Y,,AE797557,B
1093,93,org,,f,20-Feb-1992,,jim,ross,,,YO1 8BG,jim.ross@gmail.com|7738709400,1,Name1,,?,3,Personal Mobile Telephone Number,U6,Unrestricted Access,N,Y,,AE797887,B
1094,94,org,,f,20-Oct-1948,,jeam-sammy shane,wat son,,,NE42 8LL,1099017802,1,Name1,,?,3,Personal Mobile Telephone Number,U6,Unrestricted Access,N,Y,,AE947803,A
1095,95,org,,f,17-May-1952,,elly,butler,,,LE15 9CB,322959347,1,Name1,,?,3,Personal Mobile Telephone Number,U6,Unrestricted Access,N,Y,,CT129093,B
1096,96,org,,f,17-May-1952,,elly,butler,,,LE15 9CB,222959347,1,Name1,,?,3,Personal Mobile Telephone Number,U6,Unrestricted Access,N,Y,,CT129094,C
1097,97,org,,f,29-Sep-1942,,jake,velasquez,,,SN4 0EY,761927642,1,Name1,,?,3,Personal Mobile Telephone Number,U6,Unrestricted Access,N,Y,,GN786270,C
1098,98,org,,f,09-Sep-1999,,Theresa,Wilson,,,NE12 9QQ,,1,Name1,,?,3,Personal Mobile Telephone Number,U6,Unrestricted Access,N,Y,,JL929292,A
1099,99,org,,f,09-Sep-1999,,Theresa,Wilson,,,NE66 1NB,,1,Name1,,?,3,Personal Mobile Telephone Number,U6,Unrestricted Access,N,Y,,JS929291,A
1100,100,org,,f,24-Dec-1991,,kabir,singh,,,LS10 1AG,919099000000,1,Name1,,?,3,Personal Mobile Telephone Number,U6,Unrestricted Access,N,Y,,MW200001,A
1101,101,org,,f,22-May-1990,,Li Xiu,Wang,,,NG21 0BG,381288888,1,Name1,,?,3,Personal Mobile Telephone Number,U6,Unrestricted Access,N,Y,,MW200005,B
1102,102,org,,f,22-May-1990,,Li Jing,Wang,,,NG22 0EZ,381287777,1,Name1,,?,3,Personal Mobile Telephone Number,U6,Unrestricted Access,N,Y,,MW200006,C
1103,103,org,,f,06-Jun-1990,,James Duncan Henry,Thompson,,,M22 0AZ,381286666,1,Name1,,?,3,Personal Mobile Telephone Number,U6,Unrestricted Access,N,Y,,MW200007,D
1104,104,org,,f,06-Jun-1990,,James Duncan,Thompson,,,M18 0AS,381285555,1,Name1,,?,3,Personal Mobile Telephone Number,U6,Unrestricted Access,N,Y,,MW200008,A
1105,105,org,,f,06-Jun-1990,,James,Thompson,,,NS66 8AA,381284444,1,Name1,,?,3,Personal Mobile Telephone Number,U6,Unrestricted Access,N,Y,,MW200009,B
1106,106,org,,f,30-Nov-2002,,Ian,bothom,,,,919499000000,1,Name1,,?,3,Personal Mobile Telephone Number,U6,Unrestricted Access,N,Y,,MW200046,A
1107,107,org,,f,17-May-1952,,jessica,greenhalgh,,,LE15 9QZ,322959347,1,Name1,,?,3,Personal Mobile Telephone Number,U6,Unrestricted Access,N,Y,,NT306258,B
1108,108,org,,f,16-Oct-1931,,kobe,moses,,,CR2 6HX,61210993238,1,Name1,,?,3,Personal Mobile Telephone Number,U6,Unrestricted Access,N,Y,,NW880008,D
1109,109,org,,f,16-Oct-1931,,kobe,moses,,,CR2 6HX,61210993238,1,Name1,,?,3,Personal Mobile Telephone Number,U6,Unrestricted Access,N,Y,,NW884778,D
1110,110,org,,f,14-Mar-1975,,christian,hurst,,,HX6 4QS,324505547,1,Name1,,?,3,Personal Mobile Telephone Number,U6,Unrestricted Access,N,Y,,RY483428,D
1111,111,org,,f,01-Aug-1903,,erin,spee,,,NE3 3YH,,1,Name1,,?,3,Personal Mobile Telephone Number,U6,Unrestricted Access,N,Y,,TH506076,A
1112,112,org,,f,01-Aug-1903,,erin,spee,,,YO1 4LY,705609576,1,Name1,,?,3,Personal Mobile Telephone Number,U6,Unrestricted Access,N,Y,,TH506077,A
1113,113,org,,f,26-Sep-1942,,jack,nevis,,,S71 1BL,775878426,1,Name1,,?,3,Personal Mobile Telephone Number,U6,Unrestricted Access,N,Y,,WX774537,B
1114,114,org,,f,26-Sep-1942,,john,nevis,,,S71 1BL,775878427,1,Name1,,?,3,Personal Mobile Telephone Number,U6,Unrestricted Access,N,Y,,WX774538,C
1115,115,org,,f,27-Sep-1940,,Henary-samual,jackson,,,LS23 5PW,775000490,1,Name1,,?,3,Personal Mobile Telephone Number,U6,Unrestricted Access,N,Y,,WX779805,B
1116,116,org,,f,27-Sep-1940,,Henary samual,jackson,,,LS23 5PW,775000490,1,Name1,,?,3,Personal Mobile Telephone Number,U6,Unrestricted Access,N,Y,,WX779834,C
1117,117,org,,f,01-Sep-1962,,robin,macceady,,,S72 3CL,775878427,1,Name1,,?,3,Personal Mobile Telephone Number,U6,Unrestricted Access,N,Y,,WX884547,D
1118,118,org,,f,01-Sep-1962,,robert,macceady,,,S72 3CL,775878499,1,Name1,,?,3,Personal Mobile Telephone Number,U6,Unrestricted Access,N,Y,,WX884548,A
1119,119,org,,f,01-Jan-1945,,gary,smithson,,,S75 5CL,7795433812,1,Name1,,?,3,Personal Mobile Telephone Number,U6,Unrestricted Access,N,Y,,HP006001,C
1120,120,org,,f,02-Jan-1945,,gary,smithson,,,S75 5CL,7795433813,1,Name1,,?,3,Personal Mobile Telephone Number,U6,Unrestricted Access,N,Y,,HP006002,C
1121,121,org,,f,03-Jan-1945,,gary,smithson,,,S75 5CL,7795433814,1,Name1,,?,3,Personal Mobile Telephone Number,U6,Unrestricted Access,N,Y,,HP006003,C
1122,122,org,,f,04-Jan-1945,,gary,smithson,,,S75 5CL,7795433815,1,Name1,,?,3,Personal Mobile Telephone Number,U6,Unrestricted Access,N,Y,,HP006004,C
1123,123,org,,f,05-Jan-1945,,gary,smithson,,,S75 5CL,7795433816,1,Name1,,?,3,Personal Mobile Telephone Number,U6,Unrestricted Access,N,Y,,SX170101,A
1124,124,org,,f,06-Jan-1945,,gary,smithson,,,S75 5CL,7795433817,1,Name1,,?,3,Personal Mobile Telephone Number,U6,Unrestricted Access,N,Y,,SX172401,A
1125,125,org,,f,07-Jan-1945,,gary,smithson,,,S75 5CL,7795433818,1,Name1,,?,3,Personal Mobile Telephone Number,U6,Unrestricted Access,N,Y,,SX173001,A
1126,126,org,,f,08-Jan-1945,,gary,smithson,,,S75 5CL,7795433819,1,Name1,,?,3,Personal Mobile Telephone Number,U6,Unrestricted Access,N,Y,,SX710101,A
1127,127,org,,f,09-Jan-1945,,gary,smithson,,,S75 5CL,7795433820,1,Name1,,?,3,Personal Mobile Telephone Number,U6,Unrestricted Access,N,Y,,WB116666,B
1128,128,org,,f,10-Jan-1945,,gary,smithson,,,S75 5CL,7795433821,1,Name1,,?,3,Personal Mobile Telephone Number,U6,Unrestricted Access,N,Y,,SX172001,A
1129,129,org,,f,11-Jan-1945,,gary,smithson,,,S75 5CL,7795433822,1,Name1,,?,3,Personal Mobile Telephone Number,U6,Unrestricted Access,N,Y,,SX171501,A
