{
	"languages": "Sprachen",
	"appLanguages": "Applicaton Sprachen",
	"appCurrencies": "Applicaton Währungen",
	"emailInput": "Bitte schreiben Sie eine E-Mail",
	"passwordInput": "Bitte schreiben Sie eine Password",
	"myAdresses": "Meine Adressen",
	"myOrders": "Meine Bestellungen",
	"login": "Anmeldung",
	"register": "Registrieren",
	"settings": "Einstellungen",
	"whislist": "Wunschzettel",
	"logout": "Ausloggen",
	"serviceHelp": "Service / Hilfe",
	"checkOut": "Auschecken",
	"allCategories": "ALLE KATEGORIEN",
	"allProducts": "Alle Produkte",
	"products": "Produkte",
	"orderDetail": "Bestelldetails",
	"orderNumber": "Bestellnummer",
	"variantError": "Bitte wählen Sie variante.",
	"addToCartMessage": "Das Produkt würde dem Warenkorb hinzugefügt.",
	"categories": "Kategorien",
	"recomendedCategories": "Empfohlene Kategorien",
	"variants": "Varianten",
	"relatedProducts": "Verwandte Produkte",
	"similarProducts": "Ähnliche Produkte",
	"addToCart": "IN DEN WARENKORB LEGEN",
	"productSearch": "Produkt Suche",
	"signIn": "Sign In",
	"edit": "Edit",
	"firstname": "Vorname",
	"lastname": "Nachname",
	"recomendedProducts": "Empfohlene Produkte",
	"productNotAvailable": "Dieses Produkt ist derzeit nicht verfügbar",
	"deliverytime": "Lieferzeit ca.",
	"workdays": "Werktage",
	"readyToShipToday": "Heute versandbereit",
	"topSale": "Top Sale",
	"visitedProducts": "Besuchte Produkte",
	"passwordFalsch": "Password oder mail sind falsch",
	"oldPasswordFalsch": "Password ist falsch",
	"userProfile": "User Profile",
	"formularSuccess": "Ihre Transaktion ist erfolgreich",
	"formularError": "Bitte überprüfen Sie Ihr Formular",
	"orderStatus": {
		"open": "Open",
		"in_process": "in Bearbeitung",
		"completed": "Abgeschlossen",
		"cancelled_rejected": "storniert/abgelehnt"
	},
	"CheckoutSelectBillingAddress": "Zahlungsadresse auswählen",
	"CheckoutSelectShippingAddress": "Lieferadresse auswählen",
	"aboutShop": "About Shop",
	"emailBereits" : "Diese E-Mail Adresse ist bereits registriert worden"
}
