Question 1 : 134
Question 2 : 6
Question 3 : 9
Question 4 : 100669.57
Question 5 : 
Question 6 : 685.22
Question 7 : 4.08
Question 8 : 30566
Question 9 : 1224
Question 10 : 82226.4
Question 11 : 1173.39
Question 12 : 4.44
Question 13 : 11210.2
Question 14 : 799.2
Question 15 : 141339.6