#include "arm_nnfunctions.h"
const q15_t aq15_dense_1_weights[2048] = {-2003, -541, -1905, -1725, -167, 623, 2323, -917, -852, 1204, -1592, 595, -1325, -958, 989, 669, 1438, 796, -616, 940, -1161, -1164, 1907, 519, 1641, 2015, 826, -1682, 252, -1359, -1659, -1673, -1173, 1851, -619, -561, -1756, -806, 242, -535, -255, 970, 1536, 115, -560, 1652, 57, 11, -1265, -796, 864, 1413, -1350, 338, 1091, -419, -1520, 1427, 966, -900, -802, 534, -1713, 2134, 168, 459, 912, 1124, 1286, -848, 1891, 196, 1109, -1772, 1057, 1075, -1548, 1357, -1120, 52, -337, -1177, 1305, -334, -1068, -293, 2082, -1423, 1254, 1498, 1252, -1996, 1873, 1385, 761, 1557, 1985, 1839, 1428, -262, 145, -1098, -1049, -1567, -1451, 1302, 1178, 56, 992, -125, 338, 174, 1268, -1541, 1394, -364, 2044, 544, 220, -124, 1593, 1160, -2002, 1087, -1141, -1657, 1818, 344, 732, 461, -557, -932, 1033, 216, 1407, 492, -1955, 2012, 898, 530, 784, -1644, 1254, -391, -1588, -507, -1727, -532, 422, 1629, 1073, 864, 1934, -628, 1355, -2365, -1765, -1030, 1407, -868, 1631, 274, 465, 71, 1315, -235, 2222, -522, 1737, 1197, 157, 1261, 1639, -250, 172, -1197, 1074, -1366, -1481, 813, 918, 532, 2472, 1542, 1306, 1880, -95, 456, 1162, -852, 1946, -589, -1903, 54, 1095, 1392, -1561, 1490, -92, 1022, -322, 1727, 577, 3041, -307, -1069, -1883, -1640, -1259, 1368, -1367, -632, -702, 1616, -673, -964, -230, 723, 1006, 1150, -1447, 103, -349, 588, 1955, -1656, 1467, 906, -1021, -1945, 1905, 462, -1027, -1043, 859, -645, -495, -1101, -2026, -867, 615, 642, 1986, -785, 645, -1491, 1922, 890, 163, -1223, -306, 856, -155, -1866, -524, -1581, 1018, 841, 114, -263, -2047, 623, -688, 1183, 709, 882, -498, -942, -34, 801, 353, 1142, -1500, 1663, 439, -1590, 282, 1903, 234, -1190, -1763, 668, -1070, 1959, -1037, 2305, -1599, -1721, -641, -856, 1697, -1166, 1716, 998, -1418, -1694, -1349, 251, 353, 1625, -1097, -865, -1624, 1190, -627, -2080, 1018, 1891, -1582, 912, 1890, 2269, -292, 286, -824, -373, 324, -1178, 135, -207, 36, 618, -1313, -1309, -420, -1879, 1082, -102, -1884, -2252, 435, -2336, 245, -1964, -2298, 616, 509, -1526, -501, -362, 830, -706, 1357, -1102, 1080, 346, 1399, 1103, 1603, -846, 1467, -394, -1427, 1297, 241, 1124, -1508, 1688, 1366, -1332, 841, 91, 229, -570, -2047, -1880, 1536, -834, 1288, -1864, 1283, 2027, 1324, 1025, 793, 161, 1043, -1299, -1816, -1118, 1964, 786, 1117, -401, 1228, 1417, -795, 1616, 570, 1804, -1507, 125, -1408, -1416, -365, -370, -1811, 1061, 1086, -747, 758, -723, 1278, -1923, 784, -1519, 1340, 962, 1848, -909, 539, -767, -112, -488, -10, -1582, 569, 380, 147, 550, 510, -442, -2057, -801, 1484, -761, -1796, 610, 887, -732, -1038, 735, -1600, 1488, -1258, -1622, 1788, 1027, -900, -676, 981, 1016, -868, 2277, -108, 1697, -1552, 1977, -1970, -1403, 1234, 726, -1313, 120, -652, -988, -690, 1336, 1229, -1160, -965, -781, -2006, -1585, -1988, 1227, -825, 117, -898, -820, -1843, -1918, -576, 776, -1027, -1767, -339, -1306, -330, -1146, 1710, 108, 1038, -235, 1826, 1639, -1433, -1773, -9, 678, 1635, 2427, -892, -1820, -671, 551, -1820, -1769, -1966, -1720, -1309, 769, 1133, -1211, 682, -1026, 1277, -1497, -375, 222, 1500, -1622, -524, -2222, 343, 588, -2134, 622, 1470, 1761, -981, 1180, -1422, 639, 301, -816, -1436, -796, 243, -94, -1874, -389, 666, 1144, -1737, -453, 828, -2078, -194, 1165, -530, 671, 692, -1172, -1220, -2031, -1066, 198, 479, 395, -12, -1, -1108, -1996, -1199, 1926, 297, 544, -121, 1962, 1682, -1796, -1196, -53, -1260, -43, 1732, -1186, 779, -1775, -1649, 7, 237, 1290, 1916, -1415, -88, -176, 1990, 169, -2011, 79, -1457, 1645, -1633, -1963, 1970, 414, 1254, 938, 110, -2457, 289, -1411, 1478, -253, 412, -1979, 897, -2123, 1218, 1684, 1299, -1789, 1602, -435, -2047, -27, -1992, 1362, 2010, -1830, 1169, -1717, 1199, -743, -1129, 1638, -628, -562, 1825, 453, -1720, 585, -80, 835, -1240, 1630, -1368, -1639, 1630, -1176, -274, 1985, -639, 408, -29, 1451, -293, 1652, -1316, -865, -809, 246, 644, -241, 1877, -1747, 1843, 678, 572, 895, -865, -358, 1872, -1745, -183, 126, -2040, 834, 1639, 181, 813, 1401, 1728, -907, -351, -1884, 190, -72, -655, 237, -1654, 1407, 204, 1033, -1465, -1279, 2106, 389, -1175, -968, 1692, 1256, 1251, 1900, -1831, 1377, -1044, -1315, 594, -1748, -1707, 1465, 2498, 361, 733, 758, 1651, -1349, 1536, -1117, 1515, -1363, -1447, -820, -1872, -615, 402, -381, 1345, 2101, 1673, 785, 4, 175, 1342, -1056, -1686, -1521, -1786, 933, 1770, -628, -530, 1328, -339, -737, 0, 898, -1307, -722, 2013, 2008, -1349, 862, 1592, -1076, -1970, 897, 520, 687, -1584, -1165, 127, -1831, 46, -2581, -2197, -830, -394, 1324, -201, -86, -2009, -1784, -467, 594, -1504, -1470, 1681, 1636, 42, -623, -1877, -1241, 1057, 1611, -627, 933, 634, -2003, -1284, -730, -504, 1462, -775, -1341, -1354, 1141, -894, -644, 971, 915, -437, 883, 62, -89, -564, 1078, -1048, -1553, 188, -334, -529, -700, -683, -1137, 1655, -1836, -1793, 1511, 686, -2209, 954, -2021, -341, -1941, 881, 368, -800, -994, -1190, -1669, 1117, -467, 464, 1428, 634, -418, 1464, 1691, 2523, -3, 1105, 1040, -759, 658, -1797, -1439, -1901, -742, 1582, -475, -1385, -836, 1316, -247, 2210, 3, 1194, -1353, 1604, 552, 1786, 2452, 807, -1545, 273, 226, -1761, 1630, 483, 1901, -1380, -204, -1283, -1668, -1780, -568, -551, -829, -981, -1204, 1242, -449, -1689, -687, -887, -689, -1103, 470, 1261, 1604, 890, 1963, 636, 148, 586, -163, 1423, 470, -925, 131, -732, -571, 1504, 776, -1260, -1955, 1474, -571, -268, 1683, -491, 792, -841, -1071, 1993, 975, -1043, 36, 936, -430, -249, -1222, -15, -94, 1218, 893, 1519, -2616, 430, 700, -317, -1728, 280, -1227, 771, 181, 1157, -507, 1226, 926, 722, -895, 1432, -709, -1833, 1662, -314, 1466, 209, -562, -201, -59, 516, -473, 453, 107, 792, -767, -512, 495, -594, -1169, 1209, -960, 213, 1923, -1277, -1490, -1129, -866, -1172, 1347, -477, -1671, 943, -1202, 324, 993, 1236, 400, -138, -1374, -1088, -845, 1496, 654, 686, 704, 564, 2011, 1128, -894, -764, 1540, -1212, -1909, -972, 1657, 363, -203, 779, -1658, -1661, 404, -722, 1443, -94, 1097, 651, 1758, 1992, -1786, -903, 1914, -1557, -203, 1046, 1826, -790, -2387, -2101, -1838, -587, 1551, 2047, 1380, -670, -1322, -1969, -447, -769, 1633, -1104, 52, -1048, -2156, -1732, -1278, 723, -1012, 1837, 1402, -1440, 704, -1322, 93, -1798, 694, -57, 56, 520, 210, 1022, 1414, 1556, -2147, -103, 1922, -1943, 125, -647, -569, 563, -977, -112, -1435, -632, -510, -849, 1875, 997, 2175, -498, 166, 383, -65, 1034, -70, -1918, 1959, -805, 734, 189, 904, -1514, -1041, 237, -2157, 987, 1729, -474, -349, -1456, 1057, 112, -1175, 371, -906, -624, -1315, 281, 1640, -1937, 1057, 1897, -1806, -285, 1067, 1699, 700, 1222, -1576, 810, -106, 717, 1872, 367, -1075, -1802, 519, -297, -1257, 1530, 1307, 1418, -1891, -2054, -1277, -688, -1179, -1982, -827, -1350, -470, -1772, -638, -1476, -778, 458, 1013, 2037, 1397, 88, 504, -1576, 1691, 166, -2015, 658, 17, -354, 734, 372, 1782, -1499, 1357, 6, 110, 1255, -1067, -2041, -769, -1198, -1401, 283, 83, -535, -1633, -1528, -641, -1741, -1430, -59, 496, -1589, -1542, 1661, -1530, 1409, -508, 1644, 897, 1382, 1397, -476, 916, -1983, -205, 1813, -288, -1295, -256, -1320, 760, 334, 1483, -1730, -1002, -842, -1011, 620, 2017, -836, -1108, 1915, -28, -1435, -1791, 1303, -567, 1010, -243, 732, 905, -321, -120, 1637, 1583, -742, 1847, 702, 349, 1440, -265, -1254, 63, -860, 397, -867, -168, 1296, 188, 928, 184, -1501, -387, -249, -1886, -388, -1284, -185, -1845, -207, -881, 123, 1841, 644, -1450, -1585, -2014, 1616, 779, -1783, 852, -494, -1451, 1823, -1327, 702, -1498, 1247, -1727, -1534, 1728, 1740, -1612, 1608, 1023, -2123, 257, 787, 590, 1473, 333, -45, 2129, 952, -957, -946, 1733, 1230, 692, 1180, -706, -923, -604, -1563, 416, -1694, -1235, 1559, 1930, 1582, 1905, -856, -940, 91, 1775, -212, 2035, -227, -1072, -138, 1147, 1022, 1606, -1506, 264, 1021, -1807, 116, 1221, -2080, -300, -1741, 1480, -1062, -1695, 1646, -1459, 907, 1270, 1932, 1257, 992, 280, 1025, 1984, -713, -180, -1163, 891, -602, -1368, 560, 1220, -1504, 1623, -1945, -333, 159, 547, -809, 589, 473, -577, 1336, 757, -1921, 1683, 1748, 672, 1107, 836, 1402, 944, -566, 1451, 135, 285, 318, 538, 839, 498, -1592, 1391, 2347, 570, -1518, 211, 1411, -789, -1400, 2223, 1097, 259, -1285, -693, -1371, 405, -193, 1044, 688, -982, 1053, -744, -197, 633, -701, -2288, 511, -582, -1295, -1030, 200, -1723, 249, -1161, 469, 364, 1601, 1293, 1376, -1053, -1446, -270, -1909, -1553, 251, 1085, -1667, -1899, 1400, 1311, -1937, -873, -1368, -500, -190, 636, -1990, -2019, -1291, -462, -727, -1911, -1447, -582, -2009, 1891, -1749, -744, -423, 1783, 1676, -37, -138, -1529, 717, 1661, -1340, 630, 10, -209, -1704, 745, 1362, -794, -1835, 1650, -832, 588, -1384, -957, 81, 170, -336, -1422, 1636, 1082, 450, -1741, 1219, 646, -1936, 227, -1116, -1285, -281, 1660, -1971, 664, -618, -1605, -972, 1147, 1576, 925, -357, 1670, -1067, 1243, -940, 1407, -555, -148, -1830, -1420, -540, -1604, -849, 1351, -1145, -2053, -1334, -602, -611, 1211, -1447, -1852, -1684, 8, 251, -1429, -9, -1313, -799, -1117, 296, -727, 892, -1161, -1317, 993, 1482, 971, 1800, 664, -156, -72, 1065, 879, 432, -1260, -1301, -497, 650, -202, -1231, 563, -1549, 30, -1725, 914, 1324, 161, 344, 1507, -502, -1111, -1360, 771, 574, -1998, 1386, -1277, 524, -1368, 1925, -930, 1509, 1963, -336, -388, 32, -445, 396, -232, -924, 207, -1574, -504, 361, -1045, 1591, 1771, -934, -231, 730, -1390, 1270, -504, -1316, 2013, -393, -250, 2025, -1523, -51, -1833, 1382, 1171, 1570, 638, 872, -73, -554, 924, 198, 898, -227, 794, -1084, 998, -864, -1649, -1865, 1259, 1048, 1362, 222, 601, -859, 824, 1775, 570, 1409, 875, 255, -690, -2220, -1281, -355, -1128, 1879, 449, 1485, -755, 692, 280, -221, 210, -1727, -323, 1554, 1166, 175, -2004, 1132, -699, 334, -1298, 1568, -226, 469, -1321, 1522, 948, -1949, 140, -419, -246, -2374, 1326, 1821, -1659, 2076, -169, 59, -961, -1919, 1108, -1068, -1776, -1644, -1097, 1527, 474, -1872, -597, 72, -1991, -1093, -898, 296, 2027, 184, -1859, -2035, 1454, -822, 725, -594, 1778, 1387, -1042, -856, -820, -1884, -1778, -92, -1115, -1286, 1670, -1790, -1824, 1199, -1781, 829, 39, -2028, -305, -1592, -1893, -1913, -1380, -525, -4, -754, -562, -1839, 178, -561, -1475, -78, -1396, -1538, -963, 1226, -965, 317, -1961, -1201, -2214, 805, -808, 956, 1687, -167, -1242, -386, 1273, -2183, 1851, 601, 1589, -1081, -2072, 1249, 1769, -342, -1074, -1120, 106, -1815, -1855, 909, -92, 637, 1499, 166, 201, -1983, 994, 1126, -335, -834, -146, 1272, 117, 1020, -465, -674, -1347, 423, 2249, -965, -320, -1337, 756, 903, -618, -741, 739, 1427, 1588, 819, -1539, -778, -1881, -901, -1195, 588, 227, -1582, 971, 1453, 918, -922, 1875, -1125, 0, -1754, 1713, -859, -1914, -914, -1792, -909, 1135, -558, -527, -38, -613, 167, 890, 1946, -1625, -105, 661, -1344, -1466, 190, -284, 595, -770, -859, -953, 855, -2119, 458, -734, -67, -134, 918, 1239, 615, -488, -2317, 837, 328, 1096, -275, -2276, -894, 1128, -816, -2400, -1747, 1213, 551, 1258, -2445, 764, -1863, 29, -494, 1637, 1290, -1553, 1548, -194, -1330, 2161, -912, 1116, -1821, 1926, -1414, 1697, -1527, -1596, 1017, 165, 665, -1915, 672, -715, 1512, -826, -603, -2017, 1441, 835, 2124, -1, 1805, -1596, -928, 533, 916, 308, 1257, -1265, -1967, 1641, -1350, -391, -1586, 1870, 939, 1084, -1035, -1944, -881, 540, -645, 1468, -1443, -1522, -1011, -1231, 63, -790, -195, 785, 1871, 866, 910, 1708, -507, 1469, -2037, -2085, -573, -2038, 440, -894, -322, -2286, 1425, -1724, -1615, -94, 532, -17, -1793, -731, 632, -878, 1027, -79, -1502, -895, 1137, -1358, -1001, 1359, -1003, 1185, 991, 1072, -505, 1163, 815, -1198, 470, -639, -900, 874, 161, 521, -384, -971, 775, -1306, -736, -212, 1794, 1186, -1853, 1981, -1623, -830, -1865, -127, -455, 1957, 309, -695, 1515, -931, 912, 1482, -312, 1456, 2071, -1248, 400, -33, 1694, -2061, -1331, -522, -1890, 1780, -2059, 406, -351, -2297, 1188, -613, -1321, -699, -1776, 1340, 1121, -1564, -349, -1113, -397, 279, 1417, 235, 1756, -352, 142, -438, -1384, -2056, -1776, 1454, -1258, 1204, -1994, 586, 124, -1840, 192, 395, 1370, 1432, -496, -1708, 1496, 517, -402, -1909, -1437, 590, -836, -1544, -1439, 290, -229, -1067, -1971, 1894, 1348, -1788, -1588, -1239, 85, 1691, 458, -1497, -257, 1044, -1209, -1289, 431, 1153, 377, 921, 1739, 531, 504, 1456, 1232, 670, 650, -35, -1842, 1905, -659, 101, -569, -1600, -711, 1483, 1330, -985, -1378, 1786};
const q15_t aq15_dense_1_bias[64] = {246, 689, 110, -492, -335, 468, 1013, -146, 578, -126, -386, -765, -366, 486, -260, -152, -382, 0, -120, 746, -538, 774, -933, -284, -63, 102, 422, 18, 591, 209, -29, 137, 301, -408, -587, 415, 623, -438, -98, 1062, -74, -1381, 483, -26, 845, 282, -5, -96, -38, -798, -1476, 0, 0, 252, -1249, 23, -600, -184, -64, -711, -610, -363, 0, 710};
const q15_t aq15_dense_2_weights[4096] = {273, 1030, -262, 593, -603, 639, 605, -359, -475, 546, -1091, -664, 1130, 401, 663, -1673, 13, -1712, 1247, 1456, -947, 319, -940, -1038, 221, -1115, -10, -1336, -20, -857, -1521, 219, -900, 588, 204, 941, -1244, -892, 278, 240, 814, 1081, -712, -955, 1153, -379, 274, -1363, -1122, 1, 1040, -1142, 1488, 996, 1480, -1498, 616, 685, 1621, -611, -68, -1162, 87, 1666, -683, 1527, -783, -364, 1596, -151, 481, 200, -14, 207, 474, 151, 104, 575, 862, -673, -752, -1100, -840, -792, 1019, -389, 192, 2140, 1745, 1551, 583, -543, -57, 864, -1243, -1459, 100, 860, 21, -642, 1593, 1257, -654, -1517, -1587, -294, 391, -452, 452, 1808, 1100, -1436, 531, -1486, -723, -1491, 1096, -534, 1585, -1459, 1119, 94, -1200, 529, 301, -1648, -535, -1069, 1048, -1446, 353, -1439, 2042, 1674, -257, -980, -1158, -478, -837, -85, 785, -1859, -1350, -1087, -597, 16, -780, -2158, 1219, 1048, -1030, 1650, -1694, -914, 1558, -1849, 226, -243, 539, -298, -279, -1542, -2039, -420, -1486, -1009, 1362, -59, -1512, -1443, 86, -797, -397, -239, -943, 95, -1503, 174, -695, -1061, -1182, 378, -504, 481, -1051, -2637, -1500, -125, -2173, -1711, 403, -1231, -999, 373, -1480, 1432, -1431, -1527, 942, -1678, -1092, 749, -128, -302, 894, 970, 1221, -1374, -1511, 690, -1255, 366, 1508, -15, -1349, -875, -104, -571, 364, -1697, -990, -1584, -140, -709, 448, 662, 225, -1610, 1530, -244, 1679, 1532, 7, 1682, -272, -24, -156, 1319, 1130, -1222, 1692, -1583, -1454, 682, 1568, 758, -1134, 902, 1180, -606, -43, -814, -757, 959, -789, -1073, 1021, -1789, 1389, -1733, -389, -364, -1034, 1197, 482, -1546, 803, 1527, 1083, 1243, -1871, 1302, -74, 1088, -1605, -994, -984, 807, -739, -815, 1529, 1132, 437, -1091, 57, -1674, -1382, -22, 1596, -10, -1500, -1183, 1279, -1449, 207, 1425, -378, 1160, -397, 1251, 553, -360, 992, -1066, 319, -1320, -945, -1135, 426, -482, 543, 304, -1457, 1281, 446, -842, -907, 1095, -452, 339, 229, -1016, -1700, -1634, 1734, 142, -1369, -90, 54, 923, 323, 273, 219, -1108, -173, 396, -1679, 1317, -1649, -1656, -1361, -981, -1289, -529, -19, -971, 1586, 10, 1193, 1727, -1709, -1139, 1209, 1507, -1086, 477, -1084, -1635, 333, -680, 961, 505, -1421, 17, -521, 904, 22, 1372, -994, -8, 1425, -1529, -1504, 1424, 433, -1222, 729, 439, 555, -1620, 422, -919, -1440, -1725, -185, -1136, 722, -561, -1873, -1293, -1119, 1112, 1483, -962, -1251, -983, 1478, -1832, -72, 1346, -636, -878, -686, -94, 323, -1809, -615, -257, -332, -957, 631, 423, -1905, -1349, -244, -73, -1382, -602, 426, 154, 797, 224, -1251, 412, -751, 457, -78, 1063, 438, -16, -724, -926, -1381, 697, -1849, -1677, 889, 891, -1614, 1603, 1415, 104, 869, 1228, 304, -336, -231, -149, 769, 941, 407, 637, -783, -106, 1350, 1411, -126, -1713, -744, -151, -1321, 673, -296, -116, -211, -718, 1155, 1340, -1615, -673, 1047, 677, -1202, -551, -99, 711, -1264, -1266, -1878, 1549, 411, 1194, -1345, -295, 964, -1421, 260, 980, 826, -1556, -657, -162, -952, -795, 872, 561, -919, 56, -978, 1197, 793, -1141, -1308, 1143, -211, -747, -631, 173, 416, -1728, 1006, 677, 184, 1016, 428, 736, 936, -1052, 536, 1636, 155, 389, 878, 1656, -843, 1056, -1652, 1578, 1393, 1687, 461, 72, 768, -351, 767, -413, -1293, -203, 2050, 600, -446, 1368, 481, 867, 1385, 1347, 763, 818, 264, -1492, -808, -1186, 358, 1543, -1000, 825, 790, 770, 535, 488, -778, -988, 850, 1264, -95, 1270, 1338, 786, 1647, 937, -92, 1766, 1375, 190, -443, 253, 1112, -89, -563, -1608, -955, 1241, 1758, 249, 1744, 1492, -1461, -698, 304, -396, 1331, 967, -1487, -778, 674, 350, 1147, -1488, -941, -1207, 127, -255, -1049, -292, -1697, -130, 1074, -703, 1355, 800, 370, -1065, 1901, -396, 1445, 1906, -122, 330, 1617, 1162, -841, -1199, 112, 198, 348, -389, -201, -247, -1529, 1291, 439, 1290, 1100, 378, -1570, 567, 1920, 892, 1694, 836, -1756, -66, 1936, 790, 629, 9, 487, 1256, 1512, -1868, -79, 1075, 918, 300, 495, 464, 783, 1638, -523, 368, 1336, 145, -198, 1828, 905, 1365, -235, -430, -744, 347, 784, 602, -556, -81, 622, 1709, 1638, -1251, -1225, -700, 924, -228, 203, -25, -405, 442, -1084, 1170, 1774, -144, 907, -7, 502, -838, 873, -1475, -1480, -469, 417, 424, -1876, 1476, -111, 364, -1399, -808, 1674, 726, 793, -1482, -56, -1228, -668, 1333, 1373, -1230, -1079, 286, 580, 467, 863, 1046, -94, 824, -1694, 901, -989, -2229, -401, 1270, -137, 180, 104, -1744, 935, 865, -798, -1744, 787, -1417, 830, 77, 1705, 498, 1602, -1576, 956, -674, 854, -803, -582, -246, -1046, -970, -1092, 88, 31, 170, -22, 459, -1843, -371, -541, -1429, 1655, -1142, 311, -98, 1109, 876, 273, 774, -406, -858, 404, -1091, 671, -763, -858, -504, 367, 1123, 420, 638, 178, 752, -1242, -1259, -1757, 348, 1963, 733, -100, -1509, -1475, -325, -955, -456, 1580, -639, -1166, -1474, 690, 351, -1776, -40, -477, 104, 1338, -1143, -2536, -1651, 942, -1068, -1426, -65, 1803, -1011, -342, 922, 143, -959, -882, 1757, 1768, 802, -469, 1045, -348, 171, -1244, 1001, -379, -190, -117, -1418, -1365, 333, -343, -1800, -718, -152, 759, -628, -37, -1717, 993, 1423, -1451, 898, -1651, -501, 1186, 1837, 355, 2036, -793, 257, 1779, -409, -591, 114, 1071, 1191, 246, -702, 542, -1299, 1422, 1151, -88, -1842, 1084, -1319, 1621, -1611, 962, -1263, 1505, 1102, 1436, -53, 1659, 703, 851, 614, 691, -411, -1445, -823, 529, 1282, -170, 397, 206, 1821, -1085, -1297, -1385, 1624, -748, -1521, -557, -1413, 2213, -1773, 838, 1767, -404, 848, 1357, -522, 890, 1003, -1105, -6, -1338, -575, 962, 1581, 1608, 801, -1374, 133, -721, 144, -661, -1509, 654, 126, 255, 423, 848, -200, -607, -134, 147, -1586, 15, -1708, 1915, -696, -191, 937, -553, -165, 1682, 1441, 1574, 1469, -701, 408, 852, 121, -885, 1514, -1087, 1385, 1366, 415, 929, -429, -826, -1083, 837, 374, 1092, -503, 872, 1873, -490, -700, -1637, 113, -1213, 874, 1266, -269, -68, 1128, 336, 112, 1290, -2093, 1213, -673, -691, -907, 1077, 1060, 1027, -1878, -1269, -285, 1577, -310, 1146, 1466, 1371, 1207, 96, 38, 798, -1438, 264, 2279, 1320, 1053, -911, -1766, -1945, -1142, -520, -890, 246, 893, -239, 1295, 971, 1074, 762, -1258, -1162, 979, 1126, 505, 344, 359, 752, -149, -317, -1259, 203, 370, 1830, 922, -27, -552, -285, 947, -1760, -357, -1005, -676, 1484, -1671, 1713, -637, 1610, 1312, 226, 1483, -820, 1271, 447, -1373, 931, 847, 1041, 722, -999, 744, -1104, -960, -303, 143, -628, -1474, 537, 1021, 11, -228, 826, 452, 1313, -272, -1395, -437, 1605, 1176, -111, -1521, -667, 965, -872, -755, -681, -1176, -1178, 353, 526, 523, -1598, -1383, -1057, -935, 801, 209, -1773, -901, 284, 666, 450, 69, 1098, -1252, 1132, 1603, -174, 421, 1844, 1026, -1196, 1491, -266, 310, -630, -1507, -1047, -248, 726, -1982, 683, 64, 579, 923, 195, -1487, 1798, 262, -1, -544, 662, -1474, -1797, -158, -482, -1109, -1356, -56, -295, 1114, -1262, -469, 1677, 1837, 1635, -407, -1132, 939, 415, -505, 594, 124, 233, -489, -926, 408, -1339, 1287, 776, 978, 1220, 232, -888, 913, -1596, -522, 1076, 431, -1072, -659, -230, -1759, 405, 400, -669, 577, -197, 307, -437, 60, 190, 981, 1364, 1793, -479, 1879, 129, 957, -937, 59, 762, -1261, 1049, -869, -215, 951, -1513, 2213, 751, -1854, -1423, -1559, -1176, 791, 301, 1176, -653, -1519, 1013, -1173, -1592, -1145, 790, 967, -944, -664, 153, 1642, 663, -1439, 336, 1710, 579, -1428, 291, -83, 379, -1134, 1780, 1799, -1438, -930, 990, -160, -377, -270, 651, -150, 1393, -1496, 1224, 1354, -321, -888, 729, -1421, 1409, 1231, -375, 302, -1086, 487, 1543, -991, -1236, -12, -656, 595, 1505, 607, -836, 598, 1515, 889, 799, 421, 100, -1180, -876, -1658, 1442, 18, -1114, 982, 973, 959, -1502, -1180, 785, -180, -1799, 1347, -1110, 1187, 1304, 1502, 585, -2159, 311, -761, 713, -303, -60, -1776, -1459, 1668, 807, 980, -1208, -1469, 592, 1375, 1290, 157, -329, -1211, 337, -1279, -1286, -383, 1, -933, -258, -92, 1481, -851, 1137, 478, -1260, -694, 885, -992, 770, 1400, -1744, 739, -553, 1065, -2504, -1220, -1242, -186, -240, -3, -1402, -1492, 658, -369, -156, -1370, 1723, -1960, -348, -486, 872, -940, -1578, 649, 1155, 1573, 2159, -473, -137, -755, 123, 1274, 241, -1133, -837, 531, 1218, -625, -1991, -1365, 548, 2144, 749, 357, -2100, -120, -640, 827, 1809, 1453, -463, 1437, -1443, -1230, 1547, -761, -722, -1535, 1392, -56, -451, -1373, 990, 1117, -1386, -1104, -2092, -715, -872, -1219, 48, 162, 859, -498, -1260, 574, 1224, 445, 601, -724, 643, -60, -265, -290, 973, 282, 1374, -1960, -890, -443, -1923, -415, -710, 1450, -1377, -1312, -693, -338, 24, -1615, -1808, 25, 129, -1205, 1536, 323, 428, -1527, 41, -1402, 719, 78, 807, -964, -877, 96, 878, 1402, -687, 535, 869, -475, 419, -1765, 702, -1107, 10, 644, -867, -1355, -1308, -927, -155, -169, -1708, 507, 1512, 468, 1436, -23, -1147, -94, 1453, -1287, -967, -551, 221, 2080, 1638, -1219, -1550, 748, -338, -1406, 1495, -742, 1863, 931, 38, 410, 469, -946, 576, 1726, 728, 1193, 564, 755, -1124, -501, 1322, -1256, -102, 557, -1187, 49, 1583, 1750, -753, -314, 650, -76, -644, -1156, 584, 2110, -159, 1033, 264, 64, 880, -245, 1187, -1991, -671, -902, -1338, 1464, 1373, -105, -75, 330, -1447, -1352, -1002, -1228, -438, 387, -1546, -1818, -1132, -1164, -833, 1430, 1209, -868, 225, -7, 947, 1088, 740, -2253, -899, -1466, 604, -1541, 1175, 1621, 1649, -15, 411, -347, 354, 644, 820, 1137, -397, 1168, -127, -1066, -1585, -1066, -686, -1105, -1597, 960, 1860, -705, -1257, 882, -499, -832, 1495, 1660, 1168, -118, 516, 940, -298, -958, 441, 475, -585, -480, 207, 453, 264, -550, 810, 298, -1123, -1403, -892, -398, 779, -1573, 609, 1120, -343, 2009, -564, 1232, -980, 1051, 932, 343, -380, -1387, 1060, 1325, 1604, 530, 69, 31, 1042, 819, -167, -277, -1352, -832, 659, -450, 413, -335, -523, -736, 547, -886, -2173, 1539, -1657, 1084, 1038, 626, -762, 1753, 1559, -838, -491, 1169, 695, 1396, 1328, 1208, -1330, 430, -255, -1466, 1373, -143, 1333, -1096, 359, -1397, -1076, -1449, 249, 1499, 1200, -326, 582, -806, 1572, -1499, -191, 1115, 1079, -1023, 313, -939, 683, -449, -1183, -590, -1202, 1281, 137, 428, 293, -925, -2032, 1657, 1348, -1697, -1761, 643, 722, 1146, 1719, -653, -1801, -1550, 1025, 1214, -1727, 1249, 989, -792, -294, -327, 607, 497, 199, -1587, 337, -343, -1519, 959, -826, -745, -1129, 1063, -1515, 981, 806, 1266, 1458, 851, 1384, -280, 46, -154, -762, -206, -1041, -678, 986, 834, 2024, 226, 433, -1491, 398, -49, -957, -343, 11, -1104, -293, 1513, -1627, 868, -320, 446, -390, 34, 1233, -1029, 93, -292, 1448, -28, -118, 216, -184, 1056, -776, -559, -1215, 1013, -323, 1443, 1812, -1235, -902, 975, -477, 372, 1359, 12, -229, -155, 2030, 1712, -1290, 846, 1117, 116, 568, 1244, 373, 393, 177, 667, 263, -663, 380, 484, -1439, 1130, -25, 1387, -2076, 1237, -467, 956, 405, 1008, -2016, 7, 830, -528, -971, -828, -1450, -889, -1069, 212, 1133, 2088, -1270, -1670, 1026, -615, 344, 1482, 51, 1066, -1067, 1258, 241, -519, -559, 1775, 1349, 1019, -1000, -1198, 1489, 1411, -1004, 547, 999, -1263, -62, -105, 512, -183, 556, -1877, -1836, 387, 895, -987, -1190, -45, -1212, -340, 266, 554, 1789, 1589, 603, 651, -900, -173, -177, 1816, 444, 298, -258, -590, 127, -1473, -311, -198, 1006, -1578, -491, 2011, -333, 75, -176, 737, 1663, 438, 1568, -694, -585, -1015, -598, -457, 1000, -400, 686, 9, -929, -737, 1357, -917, 770, 940, 458, -1105, 1866, -253, 1614, -701, -1275, -1502, 1428, 339, 346, 1433, 620, -935, 954, 932, 638, -98, -287, -967, 690, 792, -1382, 296, 496, 345, 1143, 930, 836, 23, 1734, 454, -137, 1162, 449, 356, -517, -1449, 148, 687, -1445, -1664, 483, 1586, -271, 1632, -17, -1711, -504, 1645, -816, 385, -594, 1720, -1237, -1428, -1825, -164, -1735, 995, 320, 854, -246, -1351, 1757, 785, -337, 805, 1141, 1229, 1204, 756, -1467, 338, -954, -1594, -503, -20, -1143, -1229, 40, 1140, 468, -572, -458, 788, -996, 645, -1634, -31, 384, -120, 2070, 1214, 772, -644, 1246, 917, -1534, -126, -171, -1311, -186, 587, 1488, 1708, -252, 1310, 1852, -529, -1717, 1986, 1510, 740, 117, 1293, 1219, 447, 1355, 427, -130, 246, 835, -1223, 6, -137, 253, 670, 166, -654, -890, 1933, 809, 167, 1771, -1829, -274, -543, -105, -736, -1536, 273, -127, 1000, 248, -951, -1211, 1308, 1293, 1230, 460, 2008, 1259, 1344, 703, 538, 1155, 283, 668, -1427, 664, -1385, 1463, 1828, -826, 1189, 1274, 1441, -124, 1267, -575, 224, 520, 1211, 1577, 1135, 781, 1522, -149, -1697, 100, -1164, 972, -380, 1649, 841, -1035, 238, -8, -52, -683, -226, -1274, 95, -72, 334, 1031, -1734, -1105, -179, -1473, 928, 61, -1419, -1076, -1035, -858, -1651, 1688, -1096, -216, 1556, 1595, -683, -1073, -706, 339, -191, -104, 985, 1231, 534, 732, -234, 1610, -372, -211, 1571, -1686, -100, 1688, 302, -893, 1085, -643, -632, -1026, -580, 1334, 165, -1088, -1202, -1342, 1457, 1604, -970, 599, -805, 1949, 276, 375, 1015, 1746, 1274, 1573, -849, 430, -952, -1168, -1086, 212, 338, 1467, -1757, 153, -1752, -681, -1183, 10, 923, -307, -489, 20, 193, 990, -1616, 1177, -2396, -419, -1369, -263, -1032, -774, 385, 894, 677, 994, 212, -439, 1314, 114, 532, 1450, 1702, 426, -1592, 1402, 1531, 288, -1567, -557, -895, -1018, -992, -649, 1485, 99, 1601, -957, 1227, 584, 393, -1042, -985, 206, -767, 1086, 210, 665, 787, 556, -1593, 1150, 343, 805, -1307, -1471, 257, 696, 812, -310, 318, 63, -511, -288, 480, -917, 1483, -1501, 738, 1266, -1189, -364, -756, -1082, -1680, -271, 787, -1243, -976, 1336, 1273, -586, 820, 1796, 88, -50, 1022, -152, -647, -800, -212, 1633, 214, -289, -721, -834, 575, -1059, 933, 1017, 995, -1461, 642, 1046, 1471, -1643, -1259, 570, -819, 1473, 1201, 1081, -930, 402, 1594, 1320, -790, -430, 250, 985, 1432, -87, 1528, 412, -1578, 1118, 1002, -313, 897, -151, 1077, 1492, 605, -656, 421, -1131, -167, -1221, 1053, -554, -779, -228, 1434, 288, -901, 663, -1415, 400, -1564, 627, 1472, 938, 845, -1119, 676, 844, -72, -1464, -810, 247, -611, 1047, -796, -1733, -264, -826, -333, -948, 1325, -889, -1160, -1204, 1200, -234, -27, -1325, -137, 940, 1121, 1061, -429, 1444, -958, -1490, -622, -423, 913, -657, 875, 1414, 368, 1224, 728, 1697, -841, -264, -167, 966, 576, -1050, -58, -475, -900, -1910, -1206, 1233, -901, 519, -797, -292, 867, 1077, 125, -1298, 1180, 1092, 1421, -943, 120, -1302, 1752, 1454, 431, 491, -480, 1870, -1133, -648, -1333, 705, -1694, 1412, -2, -777, -753, 1287, -1330, -940, -478, 507, -412, 1545, -1727, 608, 402, 343, -746, 1192, -770, -1600, 725, -665, 1701, 452, -747, 1234, 1817, 351, 1058, 853, -997, 516, -1356, 915, 520, 1144, -776, -415, -1308, 269, 1206, -2167, -1784, -616, -1605, 77, 1570, -133, -2046, -944, -341, -301, -2041, -1251, -876, -1221, -400, -399, -158, -638, -1007, 116, -1153, -910, 1179, -1624, -1550, 1156, 1185, 535, 148, 213, -437, 649, 1416, -2106, 1506, -1093, -227, 734, -187, 329, 1535, 1552, 555, 1605, -230, 226, 631, 284, -631, -767, -508, 40, 985, -1676, 1500, 2245, 849, -710, -630, 88, 1003, -1496, -500, 658, 993, 1495, 1256, -771, -1628, 1022, -82, 45, -359, -1649, -479, 494, -807, 563, 1959, 78, -770, 1156, -62, 309, -819, 382, 1684, -196, -63, -622, 1736, -603, -1786, -1163, -1015, -1750, 472, 424, -1707, 1419, 966, -445, -132, -1779, 598, -231, 1197, 1260, 748, -497, 1497, -308, -1092, -1720, 1054, -1086, 659, -928, -576, -2877, 463, -1192, -872, -567, 354, -586, 1239, -1667, -933, -1548, 1998, -34, 491, -802, 684, -887, -967, 781, 584, 1640, 977, -900, 1149, -1007, -1518, -53, 760, -1750, -889, 789, -1400, -1747, 65, 1236, -410, -1123, 1061, -1324, -71, 1359, 1252, 89, 878, 1175, -1234, -206, 792, 1871, 1471, 632, 1725, -274, -215, -538, 955, 106, -900, 753, 422, 640, 153, 1350, 490, 521, -123, -1066, -568, -1724, -1463, 147, -1303, -1371, -1052, 1586, 1050, 204, -402, -1098, -112, -1199, 344, 1118, -498, 1240, 180, -1227, 1101, 1462, -913, -1760, 758, -1701, 1624, 418, -719, -1052, -1552, 1347, 119, 1206, 1635, 725, 384, 1368, -1365, 1586, -192, -1700, 1713, 8, -10, -1578, 1626, -526, -1232, -1145, -814, -1037, -612, 1129, -244, -890, -9, -1227, 751, 338, 968, -1464, -1567, -608, -1678, 540, -474, -75, -1764, -1833, 1302, -618, 1267, 337, -1286, 1289, -1890, 1519, 1440, -875, 1032, 513, 1163, 263, 985, -1037, -641, -501, 952, 1309, 1120, -271, 1274, -979, 1528, 239, -95, 130, -1539, 605, 878, -1299, 1201, -1106, -1631, -1118, -153, -867, -471, -384, 753, 625, 626, 63, 795, -430, 980, 640, 1259, 98, -255, -1867, 863, -373, -1113, -58, 188, 190, -1588, -491, 653, 329, -983, -633, -1682, 922, 44, -258, -1353, 1205, -839, 903, 1713, 511, -1155, 996, 332, 916, 44, -1764, -1222, -1839, -1130, -1751, -995, 388, -659, -22, -1492, 723, -465, 831, -1407, -531, -1368, -1411, 1192, 675, 280, -327, 1410, -1744, -61, 526, -813, -13, -1244, 1241, -1760, -905, 443, -348, 385, -1353, -620, 659, -1176, -1025, -1336, -353, 975, 327, -1563, -1088, -497, 1384, 1154, -2542, 1733, 1797, 1325, -1389, 920, -1116, -295, -1486, 236, -662, 751, 1784, -1153, -1151, 139, 1641, 204, -1405, -851, 713, 1037, -282, -1064, -1663, 751, -1082, 1868, 1799, -351, -345, 324, -192, -52, -1593, 560, -820, -1010, 1207, -1142, 1482, 1621, 1678, 557, -1203, 1272, -1538, -1243, -69, -1316, -1651, 203, -953, -897, 117, -1345, -1400, -992, -480, -515, 1030, -474, 1762, -414, 866, 62, 1230, 1961, 1745, -492, 1757, 1826, -1328, 1193, 976, -442, 1730, 65, -1077, 1701, -726, -770, 640, 627, 222, 104, -1625, -423, 1971, 1741, -105, -1491, -541, -107, 1271, 760, -492, 1582, -76, -1783, -1234, -14, -1053, 242, 275, 1675, 350, 1565, 225, -1149, 1639, 1327, 398, 1750, 514, 1153, 1955, -1405, -1344, 779, -1072, -140, 118, -173, 1488, 952, -1949, -1766, -813, 63, 795, 1435, 42, 1255, -1584, -1369, 1407, 972, 1565, -61, -220, 687, -1726, 1113, 959, -1662, 1617, 328, 1022, -982, -628, 1008, 436, -1064, 819, 519, -541, -524, 166, 8, -1880, -923, 837, 213, -1043, -120, -638, -352, 1325, 1094, -426, 727, 1522, 613, -1117, 1512, 1125, 574, 1148, -27, -681, 589, 1556, -1460, 135, 1008, 476, -1690, -193, -952, -622, -504, 1642, -1084, 653, -1929, -13, 511, -1445, 179, -604, 1510, 1253, 2192, -415, -311, 2097, -932, 1713, 306, 1015, -1059, 541, 2022, -1625, -324, -1787, -1843, 819, 23, -1243, 1148, -1348, 1561, 1626, -145, 446, -654, 1636, 2226, -342, 892, 262, 173, -1788, -952, -873, 2077, -710, -885, -1562, -18, 1124, -880, 1118, 1351, -1491, -1063, 1301, -1228, 1575, -956, -205, 500, 874, -505, -1771, -20, -690, -1423, 586, -1862, -597, -950, 1457, -1633, -1979, -1225, 1380, -154, -1414, 455, -922, 693, -1439, -643, -1391, -972, 396, 1088, -1728, -1452, 966, -346, -563, 1383, -1784, 751, 357, 289, 1649, 575, -360, -2150, -718, 1241, -178, -548, 81, 671, 280, -1329, -253, -1576, 1663, 809, -1067, 766, 73, 693, 1715, -680, -141, 700, -1595, -1659, -1100, -1467, -1092, 1526, -964, 1640, -398, -1338, -193, -863, -340, 1084, -984, -600, -1046, 913, 1535, 234, -1687, -699, 1206, -669, -1758, -413, 108, -1483, 1531, 1609, 533, -88, -1193, -147, 1358, 947, -1259, 1301, 642, 437, -156, -130, 1269, 499, 686, 1292, 155, -707, 1353, -1519, 249, -1590, 1684, -1238, -523, -616, -1550, -1734, -1593, 529, -798, 356, -585, 284, 181, -341, 10, -435, 335, -1572, 1277, 49, -160, 397, 873, 1432, -22, 100, -1415, 656, 298, 983, 1602, -952, 1360, 161, -551, 272, -1684, 178, -916, -750, 60, 1006, -793, -859, -529, 342, 482, 1007, -1162, 1783, 399, 1070, -382, -1428, 518, 332, -767, -548, -188, -1041, -144, 593, -588, -874, 397, -1612, -1697, -825, -711, 116, 1414, -304, -1475, -403, -1616, -314, 185, -709, 627, -1525, -185, -282, 1486, -1000, 1131, -868, 526, -1584, -639, -60, -1097, 277, 919, -1219, 1368, -542, -298, -41, 762, -1534, 843, -1285, 588, 1730, 1568, -813, 1329, -520, -1592, 1455, 1646, -1025, -836, 999, -504, -806, 1360, -136, 112, -504, -189, -1587, 1204, -870, 244, 1326, -19, -1013, -1257, -1069, -139, -635, -228, 727, -110, 658, 288, -1719, -597, -2011, -768, 298, 795, 1052, 409, 1555, -1405, -342, 888, -1039, 227, 939, -58, -536, -1188, -200, -299, -489, -867, 771, -1970, 377, -858, 162, 836, -252, 579, -312, -1741, -1688, -2344, -36, -1563, 1021, 1493, 2, -85, -152, 729, 1096, 840, -598, -1813, -1018, -696, 1200, -1370, -476, 451, -37, 1548, 940, 565, -238, -95, -1614, -1718, 478, 1155, 614, 1300, 99, -1375, -1135, -438, -1832, -1025, 664, 1123, -1365, -490, -874, 831, 85, -1109, 816, 1318, -195, 314, 700, -1454, -677, -1024, 1060, -1331, -87, -275, -44, 1738, 500, 1569, 2204, 1300, -1718, 1971, 491, 1619, 1944, 84, -190, -1012, 1706, 1408, -646, 558, -604, -203, 184, 954, -1583, -1680, -1402, -1481, 442, 131, -33, -295, -903, 1476, 733, -730, 1161, -803, 69, -1061, -611, -924, 1348, -2023, 258, -919, 411, 674, -1450, 895, -1045, -751, -1707, -1438, -715, -1281, -1554, 922, -1424, 1344, -1787, 1414, 411, -1654, 1070, 1040, -1418, -327, -61, -186, 1625, -420, -550, -1701, 606, 359, -78, 1131, 1063, 129, -1741, -1090, -672, 675, -810, -322, -862, -1061, 106, 1124, -997, -663, -948, -1032, 632, -1000, -579, 1041, -1660, 610, -617, 120, 470, 1351, -2001, -196, -927, 380, 803, -1574, 1129, 46, -1320, 569, 1588, 1001, -704, -276, 1399, -323, -1480, -1646, 1084, -1673, 723, 28, -1136, 333, -484, -1422, 853, -738, 518, -1158, -521, 883, 862, 1536, -1422, 541, 222, -1854, -1378, -5, -230, -1481, -2298, -1619, 1214, -1846, 460, 1260, 165, -1356, -307, -1799, 1514, -1683, -272, 195, 108, 588, -513, 295, 1584, 825, 463, -961, 436, 2178, 712, -286, 368, 468, -1259, 2093, 1156, 908, 1275, 743, 138, 2040, -421, 71, 865, 739, -691, -1043, 2448, -397, -642, -1143, 457, 425, 2158, -617, 2259, -392, -474, -1660, 445, -454, -1052, 313, 555, -1882, -42, 132, -804, 621, 259, 68, 886, -872, 1190, 234, 961, -23, 373, 474, 744, 180, 1941, 148, -858, 142, 1942, -97, 1802, 1004, 1790, 198, -1162, -262, -221, 329, -473, -817, -229, 1777, 1061, -1411, -995, -425, -49, -1137, 661, -871, 651, 24, 1067, 287, 1686, 465, 1359, -396, -356, -1460, 1274, -1587, 815, -239, 757, -239, -245, -1506, 1573, -969, 566, 1013, -258, 807, 1750, 259, -1236, -699, -1678, 1974, -313, 584, -1010, 521, -188, -1528, -211, -1330, 762, -222, -1227, 1608, -913, -956, -1447, 782, 30, 572, 981, -1453, 281, -1814, 957, -397, -1634, 335, 1524, 1307, -246, 30, 1329, 217, -283, 460, -191, 1703, -919, -217, -1662, -48, -1037, 340, -799, 44, 1327, 1241, -1777, -1367, -575, -1018, 935, 822, 1047, -1194, 277, 155, 1039, -1494, -689, 318, 603, -1711, -110, -217, -918, -1545, 1135, 106, -395, -927, -190, 38, 1542, 973, 892, 84, -1700, 217, 1090, 444, -357, 1376, -845, 239, 1141, 773, -1091, 1027, -150, 621, 938, 1204, -188, 1686, -1690, 505, 625, -402, 593, -234, 791, -725, -848, 1050, -1389, 1056, -79, 736, 430, 1360, 496, 1214, 560, 646, 383, -1631, -1535, 642, -134, -88, -823, 284, -750, 272, -462, -108, 1353, 179, 231, 1566, 200, 388, -966, 1383, -192, -719, 1231, 652, -1790, 1031, 619, 496, -1372, -250, 484, 41, -488, -1504, 1188, -547, 1518, 747, 1170, 875, -1798, 1604, 1385, 436, 942, -178, -2251, 1369, -975, -97, 13, 753, -888, -1107, 1067, 493, 244, 898, 1134, -1302, -1344, 239, 1607, 520, 737, -740, -171, -137, -1641, 358, 1175, 1460, -745, -32, -407, 569, -592, 742, -1538, -1753, -682, 1245, 382, 1543, 658, -1594, -674, -530, 1491, 1133, -754, 850, -516, -1241, -1664, -643, -1249, -776, 1256, -1601, -715, 609, -469, -1282, 956, -15, 1372, -333, -1242, 362, 832, -217, -882, 72, -665, 1492, 1074, 643, -914, 830, -268, -865, 731, -1337, 466, -1074, 1229, -1312, 154, -749, -1447, -1707, -461, -562, -70, -486, -593, -790, 1067, -1446, 1066, -153, -36, -1525, 1523, 212, 916, 470, 357, 245, -587, -1156, -583, 1333, -542, -104, 1331, -349, 753, -1664, 1013, -1535, -427, 655, 1155, 1942, -401, -1740, -679, -81, 1012, 54, -1270, -1436, -762, -982, -971, -991, -1038, -131, -632, 839, -1356, 1780, 422, -49, -265, -1025, -817, -1036, 1436, -144, 1861, -1586, -74, -418, 1324, 352, 942, -1253, -1634, -1092, 1887, -508, -1511, 1330, 1139, -951, 1273, 939, 865, 104, 255, -1282, -1037, 1745, 1691, 1087, -632, -161, 1642, 2008, -894, 1685, -595, -91, 1120, -1313, -203, -1911, 1382, -884, 339, 712, 937, -499, 1241, 667, -789, -329, 32, -1171, 1725, 1790, 925, 556, 1300, -502, 207, -566, 700, 995, 1679, 1598, -1237, -665, -195, 564, -16, 1435, -139, -901, -1702, 1553, 1577, -927, 1355, -1812, 492, 313, -797, 584, -1462, 544, -1275, 1314, -1574, 369, 569, 894, -1790, -1623, 1266, 167, -389, -101, -569, -994, 862};
const q15_t aq15_dense_2_bias[64] = {-344, 136, 151, 0, -419, -13, -155, -441, -828, 570, 392, -461, 112, 370, 294, 599, -1247, -647, -285, -855, -439, -140, -282, 281, 499, 387, -235, -609, 333, -352, 305, 161, -497, -887, 24, -12, -240, 113, 164, 293, -1503, 2, -27, -411, -598, -1223, 378, 686, 99, -4, -205, -132, 289, 631, -293, -440, 314, 912, -239, -734, 70, 167, -1350, -340};
const q15_t aq15_dense_3_weights[64] = {-414, 1873, 1132, -302, 2313, 1274, 1686, 599, -366, -626, 2390, 958, 2331, 941, 710, -695, -1112, 2473, -261, -2386, 1584, 2320, 2147, -1163, -1736, 1952, 1836, -1345, 1600, -298, 407, -1344, -503, -114, 1625, -676, 1461, -1604, 1318, 1948, -2143, 990, -1695, 1987, -1782, -1388, 1668, -799, 2008, 834, 781, -1444, 1984, -2871, 1146, -350, -245, -1692, -1910, -402, 188, -1829, -2214, -646};
const q15_t aq15_dense_3_bias[1] = {407};
const q15_t aq15_conv1d_1_weights[288] = {1205, 2477, -2523, -2365, -1560, -2964, -1212, 398, 3291, -1701, -1188, -2677, 3032, -3012, 2885, -329, 2438, -843, -1738, 2686, -1098, 2524, 2033, 1371, 2543, 2347, -1487, 298, 474, 1443, -3650, 1964, -2180, -3313, -344, 996, 1859, -336, 2145, 2626, 123, -2606, 3287, -2150, -443, -406, -6, -1164, 771, 3010, -2634, -2002, -1043, -2133, -3139, -1848, 1358, 2448, 651, -3401, -3132, 3267, 3223, -1250, -372, -3211, -897, -1691, 3378, -161, -515, 909, -1880, 2012, 2290, 1632, 1752, 2837, -2167, -1383, 2876, 74, -1811, -1656, 2678, -517, 1991, 1747, -1742, -168, -1047, -819, -693, 32, 1419, 2586, -1254, 266, -2584, 2136, 1935, -2393, -539, 895, -2134, -599, -78, 2133, 1408, -3596, -1319, -529, -706, 1718, 1025, -161, 385, -2970, -832, 328, 1345, 39, 2969, -328, 3273, 2359, 2206, -1707, 2810, 1779, -2534, -2822, -1918, 96, -3461, 3499, 529, -3045, -3039, 2722, -2776, 850, -2015, -249, -2227, -896, 2618, -1226, 458, 1754, 1940, -198, 305, -1093, -129, -368, 1321, -1942, -65, -2993, -1414, 867, -394, -84, 476, 865, 346, 2528, 768, 1117, 2899, -2208, -50, 209, -959, 2130, 1892, -2079, -2385, -467, 2149, -1094, -2120, 2716, 2943, -148, 2521, 308, -2313, 1344, 1627, 1368, 793, -2167, -929, 74, -507, 2272, 2338, -2874, -71, 1943, -2624, 922, -1430, -992, 2836, 396, -639, -1932, 1465, 2564, 1259, -2298, 562, -1451, -1014, -1504, 676, 1848, 2734, -1739, 507, 2834, -263, 1522, -677, -1074, 53, 2009, 346, 1241, -1155, -144, 500, -2443, 1019, 299, 1301, -3164, -2706, -647, 867, -985, -675, -1627, 1078, 1040, -177, -1955, -1240, 3021, -559, 2936, 2516, 2009, -1129, 229, 295, 1586, -412, 627, 2024, -1259, -1250, -3648, -544, 2230, -1098, -1674, -2838, -2387, 3259, -3051, -7, 1198, 1683, -2435, 3030, -588, 2730, 2556, 3159, -2620, 2595, -1449, 2553, -577};
const q15_t aq15_conv1d_1_bias[32] = {633, 150, 690, 895, -165, -890, -827, -963, -1437, -569, 2018, -21, 1869, -1197, -594, -1052, -2370, 2253, 248, -450, 630, 1667, -2314, -1493, 720, -105, -339, -767, 796, -552, -803, 198};
const q15_t aq15_conv1d_2_weights[6144] = {504, -135, 63, 525, -144, 126, -604, -1029, -2, 456, 130, -490, -568, -161, -399, 301, -257, 148, -617, 126, -527, 30, -434, 472, -212, -141, 621, -719, 124, -17, -59, -585, -669, 450, 604, -1335, -504, 207, 416, -88, 537, -650, 509, 484, -4, 614, -514, -1538, -790, -73, 74, 105, -505, -101, -707, 176, 215, -285, 174, -448, -647, -840, 576, 628, -1620, -1018, 392, -406, 155, -665, -500, -443, -337, 35, 187, 105, 746, 19, -280, -242, 224, -429, 100, -1134, 253, 332, -43, -692, 642, 363, -464, 198, -200, -23, 253, -431, -60, -281, 173, -987, 588, 555, 54, 375, 158, -583, 431, -367, -517, -579, 603, -199, -198, -442, -589, -267, -192, 260, -164, 62, 540, -803, 374, -177, 0, -452, -1055, 19, -519, -94, -537, -879, -546, -647, -1151, -642, 241, -382, 739, 579, -113, -305, -403, 133, -497, -79, -176, -709, 414, 691, 278, -587, -66, -81, -661, -173, -57, 480, -474, -613, 597, 662, -345, 180, -557, -465, -451, -88, -449, 241, 360, -508, 333, -579, -1011, -335, -545, -506, 375, -473, 261, 144, -960, 142, -21, 453, 779, 511, 404, -62, -504, 548, 92, 688, 292, -348, -301, -387, -616, 642, 407, -328, 728, 737, -284, 532, 476, -506, -137, 868, 500, -142, -215, -450, 253, 446, 496, 448, 197, -106, 463, 690, 531, -342, -946, 318, -42, 432, 344, -668, -372, -175, -572, -169, -969, -475, -16, 81, 683, -156, -597, -486, -71, -351, -12, 180, -257, -665, -324, -660, 199, 232, 54, -339, 158, -331, -327, 833, -162, 168, 189, -107, -1100, -397, 290, 547, -220, 38, 181, 403, -512, 235, -19, -74, 400, 54, 216, -114, 240, -264, -665, -373, 760, -510, 454, 333, 141, 300, 80, 458, 154, 255, 494, 733, -456, 1266, 26, -150, 8, 311, -401, -451, 854, 657, -274, 41, 78, 248, 323, -564, -711, -354, -386, 244, -351, -901, -331, -121, 492, -716, 819, 46, 158, -110, -361, 162, -393, -1039, -708, -542, -935, -308, -393, -974, 598, -117, -77, -139, -452, -276, -26, -75, -185, -224, -736, 205, -414, 674, -231, 347, -1111, -536, -747, 310, -611, -342, 354, 605, -143, -101, -396, -901, 399, -305, -17, 161, -54, 628, 407, 5, -513, 439, -84, -458, 60, 505, 348, -469, 103, -779, 417, -623, -352, -403, -475, 277, 110, 15, -680, -441, 344, -7, -473, 181, 557, -510, 349, 333, -402, 518, 28, -715, -674, 368, 373, -460, 343, -566, 581, 451, -167, 88, -722, 28, -444, 394, 465, -1, -206, -203, -24, -413, 129, -173, -376, -326, 45, -276, -492, 299, -387, -732, -741, -601, 635, 341, -706, -560, -584, -422, -140, -459, 763, -743, -395, -192, 210, -24, -413, -232, -444, -697, 324, -356, -493, 488, 583, 128, 663, -241, -511, -444, -334, 593, -149, 329, 80, -303, -733, -484, -364, -45, -272, -394, 91, 579, -26, 596, 275, 467, 126, -112, -95, -262, -470, -263, -371, -257, -464, -160, -692, 691, -285, 467, -451, -455, -682, -109, -112, 66, -197, -364, -91, 682, -400, -51, -375, 385, -645, 336, -629, -95, -77, -714, -449, -429, -669, 510, -59, 229, -225, -739, -225, -124, -159, -125, -254, -462, 388, -93, 685, 45, 520, 417, 356, -28, -658, 593, -308, 139, 582, -237, 361, -66, 249, 70, -77, -215, 666, 539, -77, 657, 211, -288, -20, -498, 27, -523, -692, 242, 461, 73, 229, 370, 99, -430, 266, 304, -193, -561, 208, -469, -560, -383, -50, 131, 638, 854, 236, 122, 86, -435, 162, 778, 757, -713, 341, -311, 719, 41, -796, 222, 196, -894, 749, -153, -641, -557, 440, -141, -7, -788, 717, 1038, 135, -351, 128, 542, 775, -144, -215, 224, -669, 12, 417, -886, -855, -514, 429, 399, 455, 113, -290, -419, -577, -448, -675, 943, -363, 214, -731, 210, -397, 327, 1047, 223, -840, -81, -193, -423, -486, 738, -626, 23, -536, -277, 723, -652, 471, -443, 221, -226, 408, -173, -467, 500, 733, 88, 132, 645, -349, -393, 153, 66, -75, 535, 281, -300, -461, 606, 622, -389, -491, 407, -558, -265, -452, 394, -92, 169, -445, 393, -343, -369, -37, -282, 49, -843, 576, -666, 803, 290, -500, -478, 263, -713, 267, 279, -526, -104, 557, -188, 663, -292, 559, -149, -82, 214, 61, 466, -585, -114, -249, 113, 728, -302, -69, -577, -433, 171, 522, 507, 2, -527, 257, 480, -582, 227, -569, 273, 539, -464, -400, -468, 494, 556, -1175, 201, 96, 224, 492, -880, 503, -399, -84, -458, -285, -464, -695, 192, 648, -276, 382, 207, 335, 755, -483, -203, 136, -102, -218, -528, -126, -26, -650, 459, -214, -59, 166, -1142, -570, -198, -154, -383, 38, -250, 215, -884, 791, -274, -678, 328, -567, 59, -414, -292, -110, 348, 458, 391, -720, -776, -44, -499, -272, -463, 485, -391, 952, 78, 47, 289, 395, -387, -514, 403, -790, -793, -504, -518, -102, 693, -284, -261, -67, 489, -223, 504, 334, -210, 670, 262, -586, -422, -430, -360, -1152, -450, -528, 788, 280, -653, 0, -839, -751, -1107, 397, -512, -989, -713, -221, 369, -741, 30, 17, -88, -515, -143, -336, -740, 658, -1114, 394, -582, 482, -404, 338, -571, -1114, -272, -438, -163, -323, 545, -579, -927, -524, -142, -481, -411, 635, -69, 333, 6, -368, -92, -801, 467, -820, 16, 297, 26, -324, 66, -695, 661, -545, 271, -620, 15, 325, 417, 685, -660, -823, -133, -229, 605, 75, 367, 802, -613, -292, 410, -692, 1080, 212, -291, -282, -367, -471, 1024, -268, -736, -210, -1159, -228, 605, -51, -14, -729, 195, -105, -1092, 616, -709, -1100, -686, 398, 215, 128, -190, 304, 657, -294, -754, -23, 10, -950, -69, 432, 40, 278, -758, 28, -537, -494, -399, -875, -87, -309, 691, -759, -781, -424, -79, 22, -280, -156, 11, 180, -156, 100, 470, 461, 289, -606, -100, -769, -533, 680, 227, 889, 468, 16, 569, 222, -1184, 409, 831, -128, -36, -607, -103, 549, 23, 497, 196, 111, 276, 314, 341, -629, 753, 529, 432, -770, 562, 262, -742, 483, 101, -332, -254, 420, 294, 541, 140, 531, -759, -172, 1059, 272, 502, 268, 56, -560, 477, -501, 99, -264, 766, -629, -123, -561, -508, -158, 393, 279, 853, 417, 621, 193, 593, 450, 557, -451, -726, -430, 403, -55, -692, -403, 373, 548, 139, 34, 111, -82, -375, -233, 224, -391, 465, 90, 573, -457, -684, -685, -642, -121, 1076, -419, 957, -566, 665, 18, 373, 580, 42, 120, -583, -621, 724, -339, 1163, 378, 78, 173, 419, 418, -328, -273, 467, -599, 435, -787, -142, -128, 599, -353, -12, -318, -20, 628, -1023, 285, 638, -651, 184, 873, 454, -294, 968, 547, 849, -810, 362, 339, -679, 710, 126, -209, 660, -538, 366, 301, 169, -960, -634, 550, -558, -176, -668, -670, 135, -632, -215, -295, 259, 770, -778, -249, 668, 147, -818, 305, 250, -530, 329, 510, 341, -562, -241, 516, 201, -183, -60, -782, 223, -81, 163, 660, 280, 311, -510, 183, 717, 129, 674, 267, 47, -633, -535, -257, -426, -321, -139, -619, 81, -586, -571, -324, 366, 59, 414, -269, 15, 913, -953, 216, 274, -585, 109, -763, -289, 229, -61, -350, -415, -74, 217, 580, 420, 658, 664, 638, 434, -620, 262, -393, -983, 539, 265, 81, 374, -480, -43, 189, -144, -558, 194, -596, -39, -316, 488, 370, -240, 367, 474, -182, -564, -201, 631, 127, 146, -555, -157, 626, -130, -404, 274, -57, 290, 68, 454, -540, 183, -342, -147, -531, 8, -781, 147, 402, -405, 531, 215, 261, -191, 9, -350, -581, 244, 266, 89, 548, 671, 146, 546, -248, -484, 148, -298, 605, 807, 582, 692, -161, -339, 579, 638, -703, -323, -237, 478, 466, -86, 513, -99, 358, -397, -121, -410, -328, 347, -60, -474, -247, -522, 829, 74, -318, 160, 609, -286, 110, -1913, -356, -294, 307, 45, 202, 485, 324, 649, 254, -511, -288, -529, -670, 601, -27, -101, 134, 268, -217, -181, 417, -789, -427, -227, 597, -204, -93, -270, -287, 457, -313, 531, -797, -471, 71, -496, -510, -293, -490, 54, 74, -428, -371, 220, -350, -562, 547, 364, 374, 82, -411, -791, -1084, -1027, 796, 37, -330, 150, -1049, -533, -348, 713, -545, 377, -781, 918, 25, 711, -537, -538, 145, 124, 573, -720, -611, 245, 346, 160, 315, 389, -117, 187, 363, -899, -311, -569, -30, -856, 356, -306, 14, -638, -543, -255, 357, -9, 387, 551, -506, 454, 19, 486, 162, -576, -621, 242, -297, -862, 4, 29, -106, 140, -675, -178, 510, -979, 274, 250, -435, -489, 238, 116, -303, -212, 560, -567, -438, 484, -483, -451, -878, -54, 193, -506, -428, -340, 746, 6, -52, 382, 83, 237, -347, -213, -335, -491, 396, -524, 437, 543, 60, -258, -710, 230, -224, 260, -10, -307, -724, 290, 400, -283, -440, -477, 920, 282, -787, 70, -578, 568, -503, 750, -122, 48, -323, -268, 586, 393, -948, 35, -218, -939, -91, -945, -198, 254, -188, 520, -403, -263, -336, -366, 510, -1215, 712, -1034, 305, 248, -575, -707, 712, -554, 13, 677, -250, -145, -248, 311, -394, -127, 235, 492, -810, 425, 75, -177, -318, -62, 547, -117, 391, 946, 25, -772, 203, 148, 121, 490, -313, 811, 591, 712, 691, -156, -476, -101, 568, -500, -917, 204, -710, -236, -683, 178, -440, 756, 665, 512, -448, -1016, -823, 181, 297, -301, -350, 916, -663, -76, -152, 187, -303, -554, 28, 554, -325, 286, -372, -295, 469, -104, -908, 299, -134, -4, -649, -947, -542, 535, 611, -335, 341, -156, 576, 366, 349, -453, -36, 964, -382, 639, -740, 146, -419, 606, -65, 161, 62, -283, -183, -518, 100, -350, 244, -320, 6, 657, -183, 1064, 221, -905, -292, 385, 632, -363, -79, 134, -1724, -803, -709, -809, 510, 773, 586, -284, 47, -965, -192, -270, -674, -324, -312, -327, -501, -515, -656, -546, -288, 441, -617, -1231, -128, 386, -429, -748, -1000, -393, -943, 310, 486, -626, 585, 185, 407, -177, -505, -597, 640, -261, 618, -625, 1008, 845, 392, 93, -495, -60, -761, 260, 102, 581, -23, 448, 369, 268, -760, 100, -425, -647, -494, -197, 258, 137, 678, 1032, 501, -861, 535, 593, -133, -1251, -637, 546, 504, 321, -501, 621, 459, 49, 466, -995, -700, -256, -88, 93, -563, -207, 491, 19, -810, 385, 132, -399, 390, -572, 639, -500, 431, 224, -1111, 840, 72, 42, -414, 624, 1018, -52, -562, 456, 117, 681, -644, 627, -85, -596, -358, 531, -694, -1043, 246, 467, 37, -10, 472, -297, 1000, 142, 366, 106, -481, -26, 157, -34, 230, 630, 42, 304, 42, 580, -566, 206, -740, 35, -786, -392, -539, -143, 674, -252, -14, 286, -507, -441, -569, 71, 560, -396, 43, 408, 374, -998, 271, 601, -354, -99, -514, -795, 439, 516, 155, 47, 159, 859, 304, -540, 390, 92, 107, -188, -574, 348, -455, -346, -203, -167, 579, -201, 304, -139, -421, -931, 430, 141, -748, 923, -317, -139, 346, -101, -396, 178, 584, -261, 237, -534, 862, 218, 644, 454, -764, 521, -212, 736, 805, -758, 514, -679, 455, 180, 83, 472, 428, 600, 395, -470, -88, -281, -39, 352, -367, 226, -321, 769, -171, -59, 322, -1351, -519, -493, -1364, -234, 133, -866, -371, -965, -31, 315, 648, -316, -47, -289, -863, -407, 792, -1327, 317, 972, -560, 330, 380, -233, -49, 10, 316, -735, -3, -429, 660, -188, 496, 198, 898, 887, -309, 19, -467, -230, -1090, -84, 169, -991, -197, 250, 392, 130, -619, -50, -213, 242, -460, -855, 34, 327, -113, -310, -198, 142, 966, -804, -435, 140, -232, -275, -719, -1007, 94, 646, 103, -190, -478, -1069, -369, -415, -780, 548, -865, -290, -153, -104, -275, -348, 271, 405, 538, 521, -769, -87, -254, -649, -163, -219, -482, -1117, -522, -148, -37, 295, 259, 555, -548, 395, -240, -629, -475, 37, -64, 304, 710, 520, -585, 419, -454, -505, 411, -6, 81, 218, 96, -540, 232, -454, 483, -349, 141, 125, -256, -213, 38, -258, 343, -760, 555, -53, -780, 765, 599, 608, 855, 362, 799, -608, 503, 91, -599, -421, 527, 528, -42, 450, -586, 173, 127, 231, -1009, -831, 184, -445, 223, -77, -116, 186, -82, -858, -468, 904, -415, 136, 115, -66, -291, 155, -718, 111, -804, -1291, -698, 1589, 106, -584, -679, -555, -763, -508, -135, 601, -1062, -604, 611, -238, 427, 186, 597, -477, -317, -476, -420, -1088, 254, -552, -432, -580, 400, -154, -22, -477, -816, -427, -469, -832, 318, -2186, -79, 458, 33, 24, -52, -249, 307, -175, 44, -51, -786, 54, -32, 474, 675, -959, 412, 388, -346, -693, -457, -628, -806, 105, 670, -477, -155, -272, 511, -1150, -98, -162, 268, 213, 597, -313, 242, -1, -573, -119, 279, -318, 536, -667, 81, 642, -288, 1161, -1042, -866, -4, -364, 458, -699, 715, -155, 535, -262, -155, 234, -934, 44, 576, 368, 239, 440, -217, -283, 26, 541, -66, -167, 550, -903, -586, 38, 180, 563, -493, 211, -184, -1263, -679, 452, -121, 93, -877, -195, 189, -86, -116, -18, -745, -861, -578, 88, 121, -92, 441, -445, 635, -199, -690, -724, -752, -625, -171, -223, 226, -381, 270, -1603, -643, 481, -155, -849, 570, 43, -326, -128, -47, -693, 647, -811, -41, -893, 462, -201, -344, -291, -193, 234, -684, 122, -1286, -1146, -394, -842, -274, 50, -85, -434, -136, 297, -684, 663, -1473, -735, 172, 216, -657, 124, 797, -582, -823, 343, 321, -381, 58, -27, -600, 574, 125, -10, 301, 128, -1677, 304, -6, 294, 359, -168, -582, 287, 9, -727, -843, -855, -147, -461, -176, 595, 635, 488, -75, 289, 385, -91, -147, -790, -143, -547, -584, 123, 870, 739, 177, 45, 313, 63, -255, -491, -108, 336, 21, 11, 302, 243, 455, -814, 130, -522, 296, 193, -267, -574, 111, -83, 763, -522, -620, -773, 62, -1390, -331, 662, 62, -159, 405, -594, -876, 704, 562, -923, 631, -266, -475, 207, -103, -546, -488, 204, 315, -309, 100, 458, 547, -4, -360, 254, -348, -350, -527, 278, 218, 868, -342, -514, -631, 670, 200, 370, 163, 654, 346, 46, -143, -144, -252, -180, 323, -206, 743, 843, -1129, 170, -702, -538, 755, -106, 217, 84, -333, -34, -333, -61, 572, 111, 18, -225, 167, 627, -565, -140, -172, 171, 406, -622, -360, 23, 144, 294, -316, 441, 433, -285, -598, 486, -377, -306, -620, 281, 520, 679, 276, -992, -550, 885, 555, 865, 504, -477, 456, 479, 295, -296, 38, -598, 449, -702, 66, 481, 232, 119, -339, 497, -471, -502, -895, -147, -329, -17, -455, -369, 965, 151, 345, -66, 570, 465, 15, 938, 449, 202, 440, -250, 357, 556, 273, 393, -715, -217, 289, -796, 442, 712, -363, 935, -193, 508, -682, 647, -671, -81, 204, -122, 774, 22, 377, 252, -150, 910, -540, -1108, 610, -11, -390, 480, 175, 114, -312, 277, 505, 74, 91, -416, -66, -110, -470, 74, -449, -616, -226, 199, -482, -602, -260, -505, -333, 741, 203, -182, 175, -366, -447, 929, -594, -453, 612, -928, 199, -224, 750, -211, -51, -69, -629, -61, -943, -1045, 503, -309, 456, -1070, 355, -978, -748, -529, 74, -533, 581, -135, 657, 395, 394, -127, 507, -24, 576, -119, 91, -180, -565, -465, -211, 187, -340, 50, 299, -436, -667, 390, -419, -91, -694, -778, 549, -186, -86, -443, -190, 76, 277, -261, -859, 126, 35, -207, 627, -277, -589, 267, -567, 141, -693, 482, 94, 650, 654, 391, -728, -221, -571, -991, -477, -733, -472, -451, 430, -964, 164, -594, -193, 304, -1279, -586, -55, 75, -193, 317, -353, -904, 696, 50, -213, 337, 143, -502, -492, 306, 251, -500, 704, 253, 75, -665, 256, -535, 524, -407, -4, -184, -236, 366, -162, 444, -692, -629, 487, 691, -162, 92, -213, -1065, -29, 674, 520, 565, 385, 692, -764, -444, -398, -243, -635, -805, 649, -97, -437, -418, -18, -500, -421, -349, -406, 130, 190, -472, -140, 144, 198, 389, 157, -787, 591, -102, -253, -21, 846, 458, 510, 465, -976, 16, -525, 217, 218, -346, -381, -248, 339, 277, 128, -842, -388, 510, -7, -96, -677, -333, 694, 439, -1177, 168, 477, -757, -489, 618, 661, -544, 581, -899, 2, -765, -1758, 349, -457, -707, -52, 690, 21, -8, -184, -185, -479, -448, -576, -266, -202, 53, -786, 933, -392, 673, 526, 302, 134, -435, 257, -286, 10, 238, 375, 313, 375, -30, 483, -1254, 99, 117, -927, -803, 366, -785, 293, -847, -287, -281, -319, 81, -550, 143, -104, -555, -324, -544, 833, 378, 268, -197, 98, -368, 188, -436, 619, -1166, -573, -263, -5, -1281, 188, 451, -64, -349, -967, 538, -411, -577, -752, -196, -1051, 260, 606, 77, 185, -1217, -941, -180, -242, 39, 346, 617, 134, -1418, -517, 447, 115, -292, -432, -586, 344, -772, 106, 102, -60, 377, -1012, 255, -401, 415, 654, -644, -1350, 238, -591, 352, -293, -415, -1365, -1052, -22, -496, 228, 473, 337, -145, -190, -931, -628, 16, -36, 637, -1116, -1178, 170, -1253, 441, -41, -1040, 193, 560, -708, -503, -1145, -818, 441, 735, 416, -1053, -636, -621, -648, 256, -41, -377, 608, -159, 1229, 336, -82, -453, 56, -409, 453, 193, -377, -348, 244, 647, 420, 387, 498, -1230, -138, -75, -328, -288, -11, -651, 448, -133, -311, -280, -676, 550, 367, -817, -277, 131, -28, -526, 162, 580, 409, 405, 618, 1165, -641, -709, -1069, -858, -254, -499, -227, -687, -408, 148, 381, 336, -111, -378, -23, 382, -428, -713, 504, 479, -918, -7, -269, -608, 243, -876, -478, 666, 8, -530, 28, 508, -243, -889, -40, 947, 15, -617, 360, -205, -238, -686, 294, 210, 318, -152, 292, 108, 379, -46, -407, 376, 658, -523, -104, -368, -697, -718, -191, -74, 580, -84, -339, 2, -611, 66, 205, -69, -296, -423, -483, -218, -1049, -454, -59, -805, 505, 398, 908, 451, 371, 354, -64, 131, -54, -618, -672, 268, -70, -301, 331, -534, -17, -841, -350, -2, 263, -467, 6, 363, -567, 120, 616, 459, -573, 603, -294, -64, -219, -121, 75, -544, -690, 535, -760, -498, 289, 699, -307, 407, 103, 322, -870, -983, -538, -288, 374, -321, 122, -504, 100, -844, 77, 139, 44, -38, 280, 583, 306, -721, 133, -700, 661, -159, 689, 302, 318, 309, 150, -300, -430, -185, -230, -373, -290, -123, -739, 681, 570, -478, -891, 309, -587, 229, -140, 39, 662, -184, -297, -369, 115, -849, 517, 245, 495, 674, -594, 596, -422, 35, 439, -635, 312, 387, -537, -125, -904, -62, 667, -447, -590, 130, 194, -675, 605, -959, -33, 753, -243, 492, 149, -589, 212, -694, -591, -192, 202, 371, -362, 532, -417, -1, 227, -41, -11, 260, -412, -541, 414, 559, 424, -431, 436, 579, -626, 335, 466, 482, -395, 363, 40, -17, -365, -274, -249, -231, 640, 698, -350, 367, -129, 80, -517, -89, 582, 372, -44, -444, 183, 366, 16, 124, 71, 46, 139, -527, 144, -248, 763, 298, 293, 732, 180, 359, 121, 18, -46, 195, 574, -631, 224, 302, -527, 823, 315, -695, -187, 427, -590, -688, -407, -536, 265, -571, -347, 451, 291, 427, 739, 592, 315, 400, 131, -419, 242, 184, 479, -214, 1023, 591, 593, -203, 723, -91, -281, 588, -409, 367, 21, 34, 1483, -501, -613, 183, 420, -418, -89, 284, 646, -583, -347, 88, 159, 113, 584, 488, -430, 230, -514, 611, 546, -192, 28, 73, -272, 654, -444, -770, 208, -155, -365, -576, 161, -275, 52, 501, 528, 190, 395, -425, -389, -775, -224, -389, -501, -502, 440, 446, -131, -711, -170, -448, 236, 28, 367, -478, -604, -585, 204, -358, 60, -13, -922, 744, 492, -134, -592, 547, 198, 51, -301, 189, 450, -618, -234, 34, -719, -218, 696, 563, -147, 13, -684, -59, 475, 490, -104, 142, 137, -1030, 523, -81, 254, 550, 614, 488, -918, 392, -666, 133, 169, 646, -843, -383, 427, -56, -375, 661, 805, 336, -472, 633, 18, 620, 601, 141, -240, 40, 1067, -652, -817, -498, -12, -205, -158, -467, -130, -1206, -366, -784, -222, 51, -8, -38, 117, -183, 380, 30, -852, 0, 676, -1754, -614, -254, 248, -742, 337, 284, -1013, 608, -329, 120, 326, 586, -56, -269, -290, -44, -287, -54, -308, -515, 1012, 102, -133, 539, 665, -569, 498, 212, 218, -203, 492, 132, 447, -73, 425, 76, -688, -466, 745, -381, 297, -187, -19, 330, 374, -332, -83, -76, 482, 425, -825, 80, -1099, -355, 573, 311, -100, -661, 10, 169, -872, -145, 425, 407, 224, -1082, -694, -338, -411, 641, -964, -1066, -1765, -838, -840, -649, -588, -150, 342, -614, 325, -339, 268, 270, -5, 331, -654, 356, 553, 123, 219, 578, -1580, -193, 529, 486, 183, -153, 435, -462, -562, -527, -619, -778, -858, 191, -547, 84, -205, 647, -701, -187, 569, -284, 70, -715, -627, -319, 186, 734, 715, -263, -697, -1903, -105, -161, 883, -568, 436, 416, -879, 387, 503, 288, -319, -683, 115, -310, 732, 88, 29, 237, -285, -661, -406, -314, 798, -183, -1099, 57, 538, 254, -223, -232, -222, 598, 527, 223, 711, -157, -49, 501, 11, 233, 356, -786, -55, 556, -1401, 613, 161, 74, 293, -204, -378, 389, -113, -70, 1021, -16, 135, 72, -616, 492, 509, -271, 432, -195, 468, -93, 178, 149, -690, 123, 375, -164, 788, -456, -1, -875, -993, -876, 559, -25, -520, -161, -124, -336, -108, 234, 216, -812, -202, -49, 234, -150, 112, 34, 99, -542, 101, -45, -203, -301, 209, 227, 312, -548, -1184, 434, -596, 330, 178, -361, 89, 399, -164, 425, -342, -807, 658, 92, -322, 576, -390, 121, -425, 533, -421, -756, 228, 322, 400, -65, 436, 289, -623, 711, 548, 514, 477, -456, 547, -15, 93, 492, 113, -386, -296, 462, 303, 318, 349, -648, 490, -126, -146, -637, -524, -413, -169, -616, 678, -65, -12, 492, -292, 577, 399, 611, 173, 310, -256, -712, 247, 406, -105, 31, -725, 154, -252, -727, 226, -93, -1291, 529, -251, -256, 761, -112, -215, -361, -202, -34, -740, 575, -39, 636, -580, -824, 184, 144, -104, 17, -1195, -712, 193, 557, -735, 134, 328, -418, -728, 6, -453, 282, 782, 834, 30, -14, -261, -686, -520, -731, 555, 200, -377, -339, 66, -8, 545, 652, -247, -664, -156, 526, 428, -86, -609, 163, 375, 495, -51, 570, 68, 49, 434, -78, -62, -3, -19, 330, 83, -805, -259, -108, 183, -357, -174, 336, 312, 32, -361, -648, -641, -101, -530, -77, -1046, 635, -426, 12, 544, 361, -591, 116, -526, 871, -211, 659, 93, -181, 386, -74, -673, -387, 543, 661, -109, 62, -167, 236, -294, 470, -462, 165, 631, -677, 59, -708, -554, -503, 906, -20, 424, -528, -26, 196, -489, -128, 55, -939, -79, -444, 436, -145, -250, -282, 364, -609, 774, -354, 174, -674, -1099, 399, -68, 347, -442, -384, 921, -406, -609, 144, 66, -620, 134, 107, 184, -874, 348, -324, 773, -183, -216, 432, 236, 452, 104, -313, 47, -707, -629, -440, 475, 984, -341, 306, -200, 506, 245, -512, 109, -91, -239, 216, -848, 107, -183, 414, 114, -510, -364, 204, 301, -674, -609, -467, 1320, -202, -27, -468, 191, -11, -152, 41, 291, -1067, -210, -450, -869, -307, -443, 129, -541, -285, 921, -442, 11, -155, -933, -847, 125, -435, -590, 28, -1101, -82, 843, -519, 498, -557, -655, 556, -683, 111, 28, -46, -189, 240, -159, -551, 441, -413, -687, -647, -971, -202, -4, -423, 291, -355, -416, -990, 430, 967, -398, 60, 17, 202, -139, -153, -271, -118, -547, -123, -786, -635, -16, 480, -346, 358, -361, 185, 623, -615, 96, -568, -511, 522, -596, 408, 371, -962, 343, 153, 158, -123, -928, 70, -253, -270, -718, 582, -354, -629, -651, -37, -440, -367, -293, -371, 470, 442, 19, -456, 686, -181, 722, -450, -909, 373, 88, -815, 188, -170, 144, -434, -439, 203, 72, -303, -822, -230, 1147, -618, 10, -83, 528, 188, -1135, 458, 437, -277, 497, -395, -518, -337, 158, 695, 337, 524, 244, 651, 197, -455, 1130, 127, -1113, 203, 620, 729, 496, -219, 603, -226, 621, -1086, -820, -688, 78, 111, -236, -216, 887, 9, -75, -564, -75, -49, -853, 215, -128, 85, 504, -37, -344, 8, 104, -116, -1364, 208, 260, -774, -544, -994, 275, 53, 561, -52, 910, -891, -507, 670, 423, 268, 551, -257, -816, -214, -513, 305, -1218, 347, 115, 638, 341, 552, -369, -532, 284, -734, 404, -210, -213, -116, 452, 641, -189, 665, 753, 93, -231, 490, 210, -108, 195, 696, 199, -481, 530, -267, 569, -393, -579, -687, 588, -438, 694, 348, -691, -103, 124, 880, -653, -78, -492, -806, 494, 305, -676, -1070, -126, -772, 1080, -540, -301, 391, 751, -217, 201, -47, -1, -314, -661, -166, -614, -1134, 371, 217, -556, -555, -12, 264, -279, -298, -451, -432, 529, 346, -124, 96, -304, 735, -839, 324, 154, 679, 582, 39, 160, -45, -345, -565, -335, -718, 181, 423, -756, -819, 146, -342, -648, -317, -68, 134, 1311, 561, 61, -130, 25, 470, -628, -1259, -55, -507, 106, 563, -582, -671, 785, -510, -550, -924, 543, -367, -150, -939, 39, 562, 1007, 597, 6, -605, 586, -606, -434, 291, 2, -425, 41, -191, -767, -632, -61, 150, -855, 21, -340, 125, 272, -604, 279, 488, -356, 183, 98, -676, -353, -296, -867, -745, -646, -1120, -191, 110, -928, -556, -108, 572, 60, 1, -458, 518, -324, -309, 594, -427, -491, 442, 898, -334, 69, 102, -26, -141, 165, -477, 372, 545, -349, 367, 249, -536, -514, -437, 427, 318, -472, 72, -24, -77, 181, 814, -868, 422, 496, -889, 628, -308, 686, 92, -856, 206, 761, 248, -151, -100, -412, 745, -208, -449, -321, 671, -59, -660, 530, -188, -584, 47, 97, 360, -335, 455, 956, -321, -271, -212, -234, 679, -764, -692, 682, 221, 756, 181, 204, 458, 273, -435, -334, 377, 643, -685, 693, 798, -685, -472, -741, 243, -282, 70, 656, -736, 154, -780, 547, 126, -340, 568, 571, 509, 432, -427, 246, 109, 505, 225, -160, -252, -103, -456, 108, -80, 347, 52, 118, 596, 223, -7, -102, 302, -128, 691, -178, -96, -189, 591, 199, -64, -520, -223, -796, 723, -419, -271, -211, -522, -425, 246, 866, -12, -415, 345, 473, 94, -372, 37, -291, -319, 75, -574, 462, 288, 568, -611, -811, -396, -566, 738, -68, -425, -401, 679, 683, -368, 137, -574, 141, 508, 131, 120, 491, 171, -105, 145, 142, -421, -715, 593, 762, 293, -342, -156, -768, 376, -656, -31, -543, 384, 399, 375, -193, -18, -303, -505, -550, 62, -701, -688, -130, -115, -115, 728, 143, -470, 62, -270, -575, -1090, -337, -453, -808, -240, 145, 216, 656, -652, 185, 413, -461, 142, 244, 558, 512, 299, 403, 140, -564, -533, 559, -489, -661, -946, 76, 572, -575, -291, 246, 548, 576, -364, -156, -283, -47, -1068, -96, -24, 547, -108, -335, 587, 102, 608, -261, -228, -46, -316, -66, 538, -129, 41, -292, 153, -232, 342, -12, 434, 341, -24, -666, -604, -416, -67, 498, -148, 631, -330, -231, 81, 382, 374, -394, -530, -838, -607, -613, 362, -549, 730, -299, -154, -540, 960, 207, -53, -63, -153, -205, 188, 240, 16, 448, -503, -256, 807, -589, -95, 115, 443, 517, 216, -823, 310, -329, -182, -818, -322, 384, -22, -337, 411, -766, -171, -185, -104, -346, -238, -669, 69, 562, -523, -399, 29, -101, -180, 520, 109, -551, 146, -580, 1183, 28, -138, 559, 316, 46, 252, -82, -532, 176, 243, -504, 565, -524, -65, -338, -494, -402, 398, -432, 170, -321, 591, 346, 541, 87, 413, 290, 88, 82, 524, -34, -215, -557, 178, 516, -5, 62, 536, 402, 146, 392, 44, -153, -209, -937, 562, 37, 519, -450, -74, 79, -11, -21, 15, 588, 138, 159, 41, -122, -653, 749, -464, -341, 112, 90, 439, -509, -102, -378, 309, -902, 455, -1200, 158, 659, -998, 217, -390, -170, 529, -186, 145, 170, 419, -209, 670, -447, -21, -78, -351, -680, -473, -302, 512, 230, 429, -185, 284, -41, 788, -59, 914, 466, -414, -486, -464, -517, -482, -1170, 315, 648, -74, -1, -831, -444, 739, -888, -985, -66, 504, -630, -201, -725, -22, 775, 512, 488, -129, 53, 129, -511, -908, 601, 198, 54, 163, -116, 296, -290, -791, -1072, -886, -120, -650, -489, -435, -430, -602, 204, 235, 457, -63, -22, 97, -830, 258, -251, -109, -353, -922, 619, 529, -12, 480, -327, 752, -739, 333, 319, -741, 466, -481, -264, 690, -520, -1035, 511, -128, -757, 328, -440, 457, -573, -595, -1075, -177, -467, 66, -702, 245, 450, 250, 50, -71, -589, -886, -379, -207, 531, 423, 759, -155, 283, -946, 657, 692, 712, -240, 431, -324, -146, -505, 357, -757, -849, -285, 258, -472, 80, 627, -10, -710, 516, 578, -99, 477, 67, 110, -247, -480, -521, 67, 341, -39, -765, 411, -356, -856, 391, -224, -298, -1272, 384, -648, 311, 434, -177, -557, 769, -472, -393, -605, 644, 502, -365, 588, 535, -238, 106, -360, 142, 18, -764, -378, -640, -147, 125, 658, 219, 283, -416, -681, 710, -64, -289, 263, -276, -867, -415, 673, -611, -518, -142, -531, -604, -695, 733, -668, 351, -88, 409, -727, 278, 137, 198, -671, 482, -330, 20, -702, -73, 622, -707, 363, -565, -891, 274, 388, 49, -712, -707, 49, -986, -156, 788, -465, 556, -136, -189, -270, -451, 455, 171, -506, 430, 61, 319, -111, -442, 418, -620, -363, 59, -583, -1325, -457, -457, -791, -321, -197, -639, -524, 1045, -328, 577, -508, 98, -708, 352, -152, 626, 35, -222, 56, -100, -134, 228, -807, 427, 49, -1190, -422, -163, -71, 32, -211, 535, -444, 404, 732, -391, -1232, 644, -748, -372, 552, -1547, -230, -191, -818, -33, 319, -583, 91, -135, -337, 16, 558, 566, 486, 481, -409, 607, -385, -691, -946, -255, -14, 755, 435, 415, 386, -117, -764, 516, -268, -786, 43, 1183, 406, 597, -372, 887, -124, 646, -336, -64, 535, -554, -168, -510, -453, -419, -67, -1235, -45, -698, -174, -9, -531, -497, -40, 75, -673, 798, -412, 204, -752, -942, -461, -33, -453, 760, -268, 381, 14, 145, -178, 550, -78, -1112, -389, 249, 345, 622, 100, 19, -188, -621, 522, 10, 60, -459, -47, -223, -405, -741, 219, 719, 420, 1562, 247, -612, 543, -728, -106, -529, -522, -122, -678, 94, 338, -494, 558, -612, 732, 29, 3, 123, 363, -65, -108, -857, 117, -40, -239, -613, -69, -446, 88, 113, 283, -67, 197, -763, 120, 634, 543, 577, 430, -137, 301, 416, 60, -221, -496, 228, -319, 58, 547, 324, -418, -376, 474, -571, 689, -284, 474, -515, -347, -819, -256, 609, 242, -684, 245, -632, 117, -566, -524, 281, 148, 387, -43, -388, -449, 61, 780, 275, -415, -320, -740, 218, 397, -545, 151, 1144, -544, 187, 211, -397, -72, -590, 238, -642, 507, -14, -704, 38, -10, 447, 335, -377, 455, 552, -373, -27, 336, -776, 27, -616, -104, 191, 507, -125, -632, -255, 266, 276, 629, -645, -770, 210, 187, -311, -491, -205, 270, -285, -650, -28, -317, -667, 6, -4, -171, 65, -799, -389, 130, 368, 323, 69, 281, 115, 57, 432, -68, 319, -43, 110, 584, 88, 75, -520, -716, 330, 385, 358, -261, -143, 453, 637, 503, 94, 184, -733, 358, -205, -302, -139, -108, -780, -665, 297, -739, 81, -637, -156, -308, -174, -915, 250, 410, 343, -661, 64, -504, 427, 383, 151, 180, -296, -212, 14, 551, -369, -604, -814, 1, -270, -381, -1030, 101, -692, -207, 417, 158, 144, 215, 570, 579, -196, -822, 554, -403, -29, -439, 396, -100, -557, -168, 582, 268, 24, 720, -169, -479, -57, -843, -844, 175, 648, -674, 356, -212, 132, -532, 481, -425, -354, -128, -114, -482, -127, -161, 23, -218, 419, 803, 47, 696, 424, -512, 984, -599, -1423, 672, -489, -49, -63, -566, -265, 346, 220, 363, 84, -95, -204, -610, 101, -541, -409, 497, -181, -278, -687, 584, 286, -509, 474, -325, -1, -624, 231, 218, -562, 47, -282, 386, -872, -113, 709, 608, -9, -283, 182, -24, 465, -143, 183, 18, 512, -740, 141, -606, 801, -243, -931, 466, 758, -288, 240, 231, -953, -239, -272, 1196, -1067, -454, -1186, -604, 183, 498, 594, -232, -195, -30, -58, 188, -888, -535, -1012, -650, 254, -658, -823, -50, -496, 453, 156, 49, 547, -397, -98, 562, -310, 115, 284, -236, -258, -613, -47, 4, 518, -335, 534, -859, 405, 246, -302, 228, 204, -672, -35, 193, -31, 67, -714, 427, -247, -545, -150, -189, -472, 443, 182, -474, 665, -732, -99, 595, -160, 303, -304, -248, 559, -237, -163, 37, -632, 120, -39, 478, 56, 133, 268, -212, -135, 84, -103, -318, 193, 267, 564, -485, 428, -615, -678, -86, 344, -541, -385, -697, -270, -397, 148, 307, -281, -183, -272, -570, -84, 550, 416, 139, 366, 340, -415, 495, -556, -488, -432, -649, 11, -236, 525, 387, -21, 326, -597, -609, -295, 61, -227, -163, -303, 405, -246, -574, 521, 71, 54, -263, -591, 601, -438, -66, 70, 48, 264, 253, -709, -773, 346, -451, -369, 250, -345, -398, -63, 644, -367, -678, 235, -741, 537, -164, 462, 657, -134, 47, -324, -562, -218, 344, 113, -559, 39, 148, -638, -311, -147, 654, -611, 611, -293, 629, 473, -736, -44, -511, 236, -3, -611, 299, -673, 542, -158, 231, -673, -14, -456, -352, -221, -221, 109, 298, -715, 45, -361, 68, 625, 651, -632, 606, -177, -470, 596, -600, 152, -742, -664, 197, -497, -494, 219, -111, 131, -211, -363, -499, 47, 528, -302, -240, 150, -559, 550, -495, -176, 327, -727, -490, 254, -734, -1, 92, 91, -753, 56, -319, -970, -952, -434, 164, -206, -564, -259, -521, 128, 177, 201, -1094, -1188, 599, 977, 391, 391, 551, -503, -766, -93, 506, 312, 264, -583, -178, 347, 124, -605, 401, -707, -602, 76, -136, 701, 153, 669, 85, 592, 482, -659, 411, 146, -1295, -105, 307, 711, -315, -209, -643, 77, -502, 181, 70, -644, -395, 718, -502, -659, 60, -666, -305, 274, -147, 453, 29, -56, -262, -433, -20, 321, -607, 134, -758, 648, -36, -90, 451, 867, -507, -58, -450, -713, 567, 515, -191, -62, -508, 602, -42, 381, 776, -621, -39, 477, -466, 547, -441, -224, 2, 458, 730, -509, 250, 119, -282, 322, 594, 281, 251, 487, 251, 23, 3, -202, -630, 529, -59, 707, -762, 19, 52, -85, -117, 158, -125, 510, -275, -130, 3, -637, -532, 669, 429, -318, -843, 222, 632, 537, -216, 300, -410, -290, -469, -348, 625, 77, -53, -510, 690, 2, 125, 290, -591, 430, -28, 512, 497, 110, 413, 647, -587, -484, 737, 631, -517, 452, -443, -69, -519, 77, 15, -1116, -232, -574, 457, 96, 545, -490, 849, 112, 178, -652, 260, 820, 87, -476, -329, 23, 506, 461, -473, -589, 69, 333, 665, -471, -733, -829, 19, -219, 696, 542, -551, 20, 144, 174, -556, 429, 32, 478, -778, 438, -300, 99, 61, -560, -204, 653, -374, -231, -527, 64, 460, -875, -57, -365, -601, -742, -9, -102, -1076, 442, 383, -556, 217, 748, -566, -363, -542, 207, -90, -25, -238, -809, 451, 391, 567, -420, 524, -547, -232, -904, -92, 506, -123, -826, -131, 811, -151, 507, -44, 188, -313, -1353, 431, 13, 255, -798, -167, 601, 198, -634, -548, -288, -570, -188, -559, -787, 520, -740, 485, 194, -135, 317, -947, 660, 133, -55, -570, -879, 127, 799, -601, 50, 796, -1022, -336, 21, -485, 26, 733, -693, -668, 775, -360, 848, -10, -362, 14, 95, -46, -137, -308, -1329, 385, -757, -99, 103, -396, 600, -710, 325, -228, 315, 380, 336, -507, -66, -139, -592, -475, 1043, 171, -212, -253, -582, 11, 369, 110, 265, -386, -323, 868, 433, 638, -346, -887, 63, -1635, -44, 326, -759, -34, -882, 428, 365, 275, -215, -693, -917, -1029, -381, -678, 1023, -120, 944, 504, -565, 93, -109, -490, -73, 734, 143, 112, -400, 576, -94, -364, 645, -60, -531, 270, -1446, 553, -607, -244, -422, -758, 54, -203, -591, 399, 440, -125, -685, 192, -901, -175, -1697, -569, 442, 311, 109, -403, -282, -697, 287, -268, -3, -132, 118, -1481, -129, -58, 399, 405, 790, -821, 329, 326, 611, 116, -940, -800, 547, 209, 416, 505, -339, 112, -258, 58, -823, -69, -14, -332, -572, -193, 79, -135, -909, 424, 411, 897, -78, 36, -197, -271, -700, -853, -1041, 198, 259, 441, 722, -654, 441, -972, 485, -553, 145, 674, -183, 124, 494, 454, -15, -128, -655, 180, 565, -558, 4, -1161, 33, -296, 567, -617, -298, -762, 940, 424, -379, 441, -333, 52, -272, -388, 571, -96, 438, -604, -700, 138, -644, 100, 46, 225, 750, -383, 404, 628, 445, 397, 283, -375, -496, 743, -1131, 522, -632, -8, 296, -708, 590, -294, -1169, -1554, -534, -264, -310, 625, 266, -67, 1163, -471, -88, -746, 452, 288, -609, -670, -165, -25, -305, 88, 377, -266, -460, 461, 168, 287, -860, -870, -693, 353, -77, -119, 381, -427, -834, 128, -300, -90, -801, -633, -148, 483, -319, -104, -700, 128, -562, -30, 186, -111, -179, -393, -459, -1419, -34};
const q15_t aq15_conv1d_2_bias[32] = {1191, -1410, 41, -403, -627, -1194, -441, 553, -870, 439, 1221, -1067, 1942, -78, -264, -469, 1117, -1120, 974, 67, -866, -1077, -1117, 331, -2234, 800, 369, 793, -179, -2268, -1114, 638};
const q15_t aq15_conv1d_3_weights[3072] = {446, -1372, -934, 137, -2511, 1039, 1675, -1738, 1010, 175, 1268, 9, -2400, -620, -1770, -268, -1621, -225, -2240, 1303, -1102, -207, 259, -696, 1774, 467, 756, -1728, 104, -755, -2680, -2112, -1523, 894, 562, 1430, -817, -262, -1544, -814, -2519, -182, 896, 1045, -1989, 1332, -828, 1499, -1016, 604, 987, -2034, -1738, 515, -1458, 1025, 1747, 645, -1761, 1105, 1088, -2498, 1249, 863, -2432, 152, 461, 1564, 948, -541, -1196, -454, 343, -1431, 1021, -385, -2618, 1800, 1490, 747, -949, 575, 537, 244, 383, -3078, -1463, 94, -947, 377, 1852, 429, -1146, -1294, 1006, -2779, 673, -175, -904, -1892, -2222, 391, -2460, -1613, 1133, -3346, 118, 512, 230, -1669, -1400, 1816, 677, -2599, -219, 1308, -1143, -394, 7, -204, -2147, 567, -200, 1040, 527, -1859, -2276, 960, 1616, 837, -440, -1389, 1231, -2394, 42, -804, 579, -2020, -2135, -1853, 625, 764, -1100, -2355, 85, 702, 501, -2828, 453, 880, 63, -2034, 1842, 213, -2184, 724, -156, 716, 156, 1248, -1087, 1613, -860, -1870, 401, 1108, -839, -2040, -1378, 1102, -2518, -901, -1409, 430, 1455, -807, 1128, 1327, -1210, -911, 302, 1140, -1781, -1037, -2877, -1901, -347, -190, 693, 180, -190, 435, -1210, -721, -1416, 1486, -336, 1473, -1210, -2313, 1026, -106, 366, 1406, -1478, -1804, -293, -1777, 438, 1459, -1235, 877, -2009, -261, -1010, -308, -786, 1225, -1041, -705, -482, -1831, 1210, -303, -2074, -1230, 151, 1661, -857, -2525, -2475, 1466, 508, 812, 624, 368, 581, 490, -2255, 867, 564, -683, 574, -665, 416, 249, 281, -1599, 804, 1147, 529, 1429, 1455, -833, -1458, -1629, -719, 333, -2002, 403, 1092, 1842, -1984, 884, -1682, -720, 364, -1285, 5, -55, 983, 295, -461, 1627, 360, 878, 9, -1881, -1571, 1489, 102, -347, -2425, 1205, -1225, 1020, 326, -246, -1291, -1687, 1834, 833, -1111, -1085, 651, -151, -1379, -2832, -845, -1876, -1074, -1014, 110, 122, 1545, -915, -195, -439, -1878, 450, -1275, 983, -1795, 607, -1006, -1748, 166, -520, -66, -2083, 866, -501, -1265, -1545, -2044, 1091, 500, 436, -47, 1036, 1174, 1582, 1464, -984, 1684, -48, -2039, -836, 617, -2002, -4, 1372, -2359, -1206, 229, -639, -2359, -532, 1320, 1514, -2870, 781, -1705, 1215, 992, -1912, 1776, -2213, 455, 927, -2044, 709, -781, 1569, -295, -2744, 580, -41, 928, -2550, 412, -1686, -3363, -2000, 33, -175, 306, -3836, -2137, -1997, 617, -1157, 2250, -1920, -2007, -1314, 825, -352, 854, 1684, -2016, 1878, 794, 809, 1394, -173, -3109, 1467, 1160, -151, 895, -2690, -813, -2913, 411, 489, 1626, -597, -1014, 955, 933, -2508, -554, 1624, -370, -198, -927, -2155, -295, 880, -3191, 232, -577, 1771, -1771, -284, -1654, 561, 793, 49, -679, 408, -557, -1467, -1603, -355, -112, 1187, -922, 1257, -1093, 850, -480, 362, 1616, -169, 16, -228, -1424, 1256, 1313, -927, -227, -1838, 812, 1359, -2761, -801, -1859, -387, -1618, -1777, 254, -3185, -586, -2502, -686, -704, -394, 1381, 427, 915, -188, -2474, -1278, 1074, -431, 1238, -1079, 231, 440, -1069, -752, -254, -1584, 1125, 44, 673, -1960, 557, 1416, -926, 1676, -1781, 1997, 857, -1394, -1024, 1483, -2091, -2918, 1329, -1631, 535, -1001, 1262, 1012, -317, -1228, -192, -1243, -718, 1569, -642, 2140, 827, 586, -654, -1842, -603, -3176, -304, -579, 2143, -2661, -2249, 127, -1172, 581, -1511, -172, 1450, -472, -2771, 1157, 1647, 957, -3184, -1307, 1536, -737, -1261, -46, -246, -1896, -1644, -174, -158, 1701, 1346, -635, 1036, -2634, -1150, 129, -1008, -326, 676, 1194, -1261, -245, -747, -1279, 1678, -83, -1651, -1432, -930, -2212, -183, 1583, -1427, 875, -1119, -531, -3568, 962, -1533, 325, -1665, -879, -735, -1405, -2535, -1232, 408, 1628, 1125, -2398, 1581, -2480, 1495, -1207, -651, 288, 1105, 419, 145, 197, 1081, -1731, 600, 450, -1989, 486, 1296, -514, -894, 261, -1066, 1133, -54, 850, 152, -457, -2291, 1405, -2543, 983, -2458, 35, -1881, 567, 1167, -1219, -2644, -1889, -1900, -434, -2024, -321, 1179, 146, -2473, -666, -2243, -923, -1699, -714, 1739, -143, 19, -1084, -1958, 787, 1881, 1377, 1193, 423, 1242, 1000, -1847, 356, 2042, 1780, -1381, 1565, 4, -2072, 1079, 496, -837, 58, -2418, 206, 399, -1129, -423, 1125, -160, -882, 2372, -1838, 744, -152, -13, 1323, -449, -1554, 876, 1089, 923, -2749, 1517, -1201, 2051, -853, 60, -733, 341, -831, 1649, -111, 986, 1492, -404, 3351, 669, 1565, -715, -345, 1742, 758, -2301, -1102, 1912, -52, 1454, -1598, 1562, -1282, 921, 2129, -1360, 1378, -1097, 304, -1546, -1207, 2759, -346, -433, -1284, -2599, -2283, 374, -2679, -548, -949, -1142, -527, -1910, -590, -1232, 2073, 812, -2515, 369, 1874, 1094, -379, -175, -2235, 348, 38, -222, 1410, -1589, -184, 974, -76, 655, -1491, 1347, 1303, -1130, 1658, -1682, -1468, 35, -530, 44, -1021, 209, 1213, 1279, -160, -547, -8, 2175, 1336, 1984, -1004, -1826, 295, -1900, -272, 1167, -1307, -208, -1225, -30, -247, -107, -2025, 1012, -1933, 1129, 3637, -2046, -821, -390, -478, -8, -1649, 123, 1872, 1011, 773, -43, -1597, 332, -37, -1485, 482, 1334, -1051, -2063, -715, 1255, 673, -1176, -844, 1471, 941, -579, -1314, 435, -1572, 1577, 2564, -1707, -725, 1425, 1417, -978, -424, 370, -159, 1403, 1360, 1667, 1880, -2220, -72, 1764, -2147, -1478, -1439, 1411, -714, 1096, 328, 1622, -2240, -1599, -1433, -1041, 1892, -962, -1807, 916, 1451, -58, -1463, -1430, -1515, -667, -903, -1823, 1092, -150, -1794, -2089, 594, -209, 809, 1800, 197, -2940, -146, -1145, -839, -2387, -1480, 546, -2301, 654, 81, 1083, -2525, 1128, -1989, -2803, -1804, -162, -1815, -196, -748, -2022, 811, 881, 13, -1638, -702, -1316, -1020, 178, -980, 748, -1499, 230, -115, 782, 879, 660, -1523, -979, -677, -761, -1926, -104, -1617, 191, -666, -1760, -258, 1112, -1215, -313, 1075, -1282, 1248, -2291, -1487, 924, -1502, 1261, -758, -673, 1675, 1580, 778, -32, 327, -2712, 105, -433, -442, -703, -1558, 1352, -605, 2172, 393, -2073, -1025, -111, 1103, -2417, 845, 799, -2338, -1089, 858, -406, -711, -1739, 1066, -737, 867, 875, 1568, -822, -42, 227, -1292, -20, 67, -418, -571, -1930, -541, -434, -1375, -2208, -1322, -2773, -349, -2111, -1193, -502, -1896, 376, -2462, -2160, 1793, -434, 1333, -1836, -1490, -593, 972, -1281, -1117, 1398, -1035, 1990, 1233, 912, -648, -1039, 115, 198, 1159, -1062, 1485, 2146, 1764, -299, 1877, -790, -2542, -453, 710, 432, 759, 1300, 40, 1822, -1754, -171, -1734, -343, -2290, -1042, 476, 1989, -1337, -610, -2215, -1602, -2447, -1847, -1760, -1653, 31, -1116, 274, -1717, 33, -198, -3190, 1307, -1645, -687, 1537, -961, 739, -247, -1998, -1092, -684, 412, -1583, -125, -289, 586, -52, 681, 1367, 597, 674, -1443, -646, -931, -1654, -1528, 21, -1420, -705, -1452, -1870, -2177, -211, -1128, 1872, 1424, -2077, 794, 1656, -25, 1298, -558, 68, 154, 1341, -630, 1528, -770, -669, -1659, -1041, 145, 2008, -238, -1734, 718, -1568, -1635, 978, -343, 1365, -571, -1730, -2582, 1161, -1051, -1625, 1738, 1431, 1013, -238, -2512, -232, -1539, 1563, -414, -1253, -1514, 1039, -584, 1391, 429, -231, -769, -627, -687, -648, -1494, -242, -1304, -1655, -447, 1837, 305, -545, 289, 551, -1449, -355, -1560, -1208, -434, -1527, 1975, -2000, -2156, -425, -1434, 562, 749, -574, 408, 1357, 1337, 797, -65, 329, 3, 1339, -143, -2514, -159, 1488, 1070, -1070, -2238, 148, -1197, 254, 372, 405, 891, -1020, -1779, -1436, -1357, 179, 223, -1382, 1477, 626, -1673, -1330, -2696, 1641, 134, -903, -227, -383, -1807, -385, -358, -1822, -858, 1081, 1234, 847, 1284, -366, 1498, -1510, 1071, 116, 1261, -751, -136, 2052, -404, -818, -2184, 1091, 1021, -656, -237, 800, -1759, -362, 175, -1618, -465, 359, -1185, -263, -1625, -551, 545, 1515, -1616, 699, -550, -2419, 1976, 404, -173, 2294, -1373, -1949, 271, -812, -2758, 988, 1809, -1759, -604, 868, 1241, 147, 282, 1294, 79, -4062, -1747, -177, -2573, 1592, 793, 496, 1603, -2008, 750, -1277, -589, -74, 531, 1206, -2475, 718, -2655, 723, -1917, -1440, -1291, 1241, 270, -985, -2638, 928, -1736, -2003, 1786, -62, -2808, 1436, -1156, 1627, 787, -817, 80, 1296, 1117, 463, -1304, 637, -911, 1027, -2820, -908, 539, -215, -823, -699, -1053, 291, 999, -1912, -563, 1258, 236, -1749, -353, -1158, -1002, 115, 369, 582, -926, -1494, 1675, -2223, 398, 961, -276, -2724, -2351, -2581, -112, -1262, -263, 1833, -940, -318, -904, -1871, 1567, -723, -2509, -2018, 955, 688, 376, -91, -3280, -1268, 886, 472, 616, 1813, 500, -734, 52, 1403, 366, -643, -1142, 1827, -1878, -635, -2903, -167, 1484, -475, 221, 839, -1106, 61, -1441, -359, -2787, -1729, -2102, 330, 1334, 810, -1870, 649, 1668, -180, -1336, -2311, 810, 1266, -1379, 1171, -1367, -1033, 465, 1175, 1451, 1377, 1313, 492, 484, 539, 1585, 644, -1, 980, -732, -1636, 1210, -787, -2473, 351, 340, -1931, -2138, 141, -1098, -502, 1069, 390, 525, 297, -947, 313, -1647, -965, -888, -477, -650, -460, -82, -417, 577, -3819, 1554, 486, -161, 647, -1278, 1288, 1310, -396, -1707, -1176, -1430, 38, 344, 523, -1148, 357, 96, 925, -277, 667, -1656, -342, 1572, -1425, -2344, -2822, -692, -990, -2191, 967, -2071, -790, -230, 1450, -2491, 1411, -2191, -1887, -1469, -2125, -2275, 177, 1628, 2147, -2408, -495, 404, -49, -1279, 970, 1908, -974, -2283, -1542, -2686, 1112, -1975, 1779, -2601, 373, 332, -2218, -1857, -2484, 629, -140, -1220, 1288, 1787, -464, -1016, 1535, 1411, -1333, 1060, -856, -1889, 2021, -238, 889, -1522, 1442, -2192, -978, 484, 1249, 1287, 738, -1892, 456, 1180, 1096, -1894, -771, 1831, -2156, -850, -396, -1006, -915, -927, 1238, -2515, -681, -1319, -833, 20, 1026, 205, 1298, 876, 1478, -1016, -1431, 1038, 344, -1931, -1025, -951, -461, -2430, -2232, 415, 1426, -1476, 1601, 1009, 1025, -1162, 492, -1007, 155, -2576, -441, 67, 1049, -1305, -857, -292, 1319, 1012, -1658, 1263, 1338, 1192, 1406, 1791, 283, -2838, -982, 2183, -560, 109, -1382, -1699, 2221, -1233, -885, 760, -2157, -454, 625, -229, -458, 67, 1007, 499, -1592, -414, 1113, 808, -1486, -1306, 1037, -2228, 1330, -172, 2473, 799, -2590, -1158, 7, 1500, -80, -1760, -557, -714, 124, 958, -1629, -638, -1516, -2175, 473, -2049, 990, -581, 314, -1629, -40, 678, 1093, 199, 1104, 1559, 378, -2249, -859, -1686, 773, 371, 1413, 38, -1184, -369, -1526, -358, 303, -1498, -2132, -1313, 229, -1114, 1809, -33, 642, 2244, 194, -445, -93, -880, 43, -1264, 1382, -1004, 738, -518, 578, 841, 605, 241, 545, -390, -2348, 572, 701, -1459, -1263, -2054, -787, -1757, 1020, -388, 351, 1065, 224, -728, 2175, 1198, 178, 1247, -544, 968, -150, -260, -563, -361, 1226, 1831, -1035, -2335, 320, -3889, 1594, -1297, -2301, 752, 1594, 1335, -749, -978, -1482, -785, -1821, 722, -1303, 1325, 1110, 71, -504, 594, 559, -2086, 2751, 1704, 714, -1770, 881, -1169, -1769, -3, -1872, -383, -1418, 1004, -176, 1270, 1307, -981, 693, 214, -1357, 1521, -1761, 1409, -938, 2243, 340, 580, 1353, -1092, 3473, -570, -822, -708, -710, -238, -1950, -1559, -304, 1865, 561, 1611, -2720, 1729, 1740, -1934, -597, -43, 355, -2075, 1494, 1974, -1844, 2199, 961, 1667, -631, 1625, -939, 1370, -561, -2025, 1898, -1853, -265, 1729, 1572, 800, 1054, -380, 346, -625, -1875, -406, -729, -146, -681, 834, 1225, 1872, 228, 1178, 1647, -1122, -1359, -1646, -2002, -240, -3457, 2703, -693, -502, -396, 1348, 1789, -682, 879, -992, 1809, -795, -1874, 95, 1588, 771, 1304, -270, 960, -221, -1608, -201, 1333, 563, 1846, 411, 71, -1493, -1560, 1358, 1991, -1314, -1606, -753, -819, -554, -1060, -592, -2086, -839, 1396, -943, -47, -1971, -25, -204, -399, -949, 1311, -1875, -1594, -1450, -1335, -890, -765, 216, 418, 1477, -2069, 999, -1857, 1944, 697, 1616, 422, 1814, -1129, -631, -1281, 186, -132, 774, -2350, 327, 1321, 1528, -279, -1078, -968, -1079, -766, 507, -598, 1145, 144, 314, 1991, -1122, -2374, -2328, -353, 1595, 2004, -1108, 514, -1170, -1234, -513, -2069, -144, -523, 1119, -2206, 958, -1644, 934, -1086, 1691, 1757, 772, -1575, -291, 478, 238, -686, -1583, 1302, -1013, 1328, -1084, 763, 2044, 1542, 48, 679, 1023, -1796, -1923, 1, 59, -2156, 1143, 1138, -654, 1943, 498, 720, -910, 2157, 1444, 33, -293, 1740, 1687, -1628, 745, 1695, 15, 1587, 2228, 1852, -1247, -2808, -840, 190, 344, -2138, -1967, 1682, 1584, 2802, -564, 433, 641, -508, -355, -402, -450, -1498, 818, -1012, -556, -1752, 1127, -1590, -1613, -183, 851, 1792, -1010, 1431, -827, -577, 721, 1529, -998, 592, 189, -16, 1730, -1857, -393, -1693, 2797, -224, -2838, -736, 1039, -671, 1207, -630, 1558, -1980, -2234, 496, 1340, -714, 230, 2358, -2909, 1694, 589, 402, 1425, -1687, 1788, -1190, -2128, -2112, 1527, -1631, -1833, -499, -556, 1287, -1290, 138, -1875, 1940, -431, -783, -307, -2044, -1658, -2642, 4, -431, -1374, 1578, -493, 1399, 1767, -417, 1246, -864, -1564, 1747, -512, 1548, -189, 109, -1637, 1524, -1765, -1932, -605, -2829, 559, 1586, -2600, -2410, 2124, -1489, -997, 1900, -353, 1102, -2536, -915, -92, -1638, 1228, -1059, 188, 486, -103, -1262, 1148, 2245, 49, 1154, -874, -715, -284, -1456, -1362, 1052, 329, 1249, 492, -1315, 1334, -2866, -543, 370, -898, -2247, -668, 1873, 1076, -1411, -2437, 1584, 221, -419, 1427, 1200, 72, 253, -1083, 83, 520, -1676, -2505, -763, -1273, 1062, 1394, 252, -3469, -187, 1872, -2431, -1763, 1107, 606, 73, -1441, -1521, -197, -1793, -1695, 818, -2081, -386, -1547, -220, -1295, -1071, 1134, -43, -338, 634, -594, -825, -1150, 1619, 20, 960, -1650, -2159, 1165, 357, 1526, 323, -2150, 1635, -1371, -1012, -29, -249, -1156, -2147, -1986, -41, -881, 692, -1052, -1795, 176, -2357, -574, -1397, -1485, -1005, 912, -1286, -562, 122, 763, -2449, 182, -1009, -1751, -366, 218, -2411, 1093, -355, 1189, 797, 1714, 1650, -1020, 1117, -2138, 1477, -1941, -654, -1585, -655, 1377, 251, -2061, -220, -2538, -1836, 1038, 85, -418, -1412, 1035, 411, -683, 1299, -161, 1266, -77, -958, 1240, -79, -2345, 2179, -1494, -60, -1020, -261, 107, -1816, 569, 638, 1512, -2663, -947, 2022, 1357, 1893, 1291, -2136, -1407, 1393, -1360, 842, -476, -1966, -886, 967, -1692, 2020, 1416, -1192, 222, -1660, 1394, -2477, 1303, 1186, -1483, 283, 1573, -1281, -614, -671, 38, 2554, -1107, 1915, -261, -521, -758, -1036, 1399, 1398, -2514, -233, -1802, 1404, -2906, 640, -382, 362, -1302, -1200, -1116, -796, -992, -459, 1079, 733, -1464, -1816, -1043, -229, -1176, 89, 1196, 1018, -509, 1158, -1299, 1743, -2594, -516, 2249, -1226, 74, -2339, -897, -407, 169, 739, -2033, -1917, 738, 1885, 260, 1454, -1351, -2274, -2009, -438, -2179, -1051, 1038, -1746, 1296, 1318, -2930, 681, 1822, -1842, -633, -1654, 2128, 1794, -1212, -2150, -163, -1355, 1533, -1865, 1178, 609, 1508, 1303, 354, -1839, -1802, -650, 607, -553, -686, -810, -720, -1015, -1386, 1115, 1664, 1299, -2142, -2590, 883, 531, -1293, 1082, -456, 1205, -1702, -1568, 1360, -2842, 1967, -1439, 1338, 1070, 417, 275, 268, -375, -88, -1825, -2239, -44, 1422, -1618, 1942, -104, -1921, 773, 1398, 827, 382, -3300, 1597, 1869, 979, -1095, -1014, 1748, 31, 1136, -774, 1310, 1081, -176, 592, -173, 1153, -1940, 203, -1181, 1902, -1679, 836, 1732, -1774, -484, -1187, -2174, -978, -1057, -435, -1326, -1305, 1284, -875, -19, 188, 2022, 176, -2038, 658, 1461, -1869, 1639, 1493, -815, 1635, 1758, 1506, -881, 1327, 1238, -1032, -1931, -1004, 1451, 457, -843, -1192, -1275, 1116, 921, 1201, 1667, 1494, -832, 1449, 1414, 1273, 457, 370, -614, 183, -1827, 1955, -39, -2271, -479, -467, -1782, 592, -1366, 63, -1686, 2125, 1643, -832, 509, -491, -314, 1727, 984, -1145, 415, -997, 1964, -824, -684, -2337, -982, -1667, -295, 1238, 263, -1320, 1059, 904, 2887, -2407, 1581, -311, 79, -1981, -993, 77, -2013, 1439, 1130, 1458, 1273, 976, -1596, 1127, -1977, -560, 419, 899, -745, -1719, 1201, 419, -901, -1689, 899, -574, -169, -1066, 448, 612, -1053, -2129, 388, 268, -869, 66, -305, -368, -1581, 1644, -883, 696, 306, -1489, 215, -317, 3470, -937, 1837, 667, 1880, 740, -441, 298, -2173, -1560, -1879, 845, 1138, -713, 1396, 943, -2420, -2099, -1932, 1383, 128, -1289, 1723, 1182, -1339, 1750, -2345, -1539, -408, -96, 1117, -1979, -1782, 246, 13, 510, -2016, -886, -965, -361, 619, -38, 746, -1110, -1366, 1077, -2316, 1302, 1098, -424, -1536, -458, 485, -1912, 1409, -827, -417, -1840, -1919, -235, 1384, -132, -884, 429, -934, -395, -879, -2196, -993, -1650, 1937, -824, 1480, -1087, 230, 1600, 553, -982, -2059, -1899, -120, 329, 416, -1136, 822, -347, -409, -1810, -1364, -1402, 1760, 1204, 59, -1815, -2612, -1218, -925, -306, 121, 1100, 1783, -1491, 531, 1154, -58, -949, -1201, -426, 1554, -361, -2526, -929, 1472, -975, 969, 1041, 1901, 2245, 461, -1514, -84, -2496, -1333, -28, -1547, -218, -870, -1560, 702, 1645, -1152, -1973, -1440, -1718, 638, 487, 784, 592, -282, -282, 213, 219, -3, -1822, 1012, -2359, -377, 578, -1020, -1008, 1001, 208, 449, -1026, 695, 1338, 901, -218, -1980, 362, -552, 1128, -40, -2460, 1598, -1124, 575, 41, -1613, -2233, -1270, 536, 1375, -1806, 1009, -880, -868, -2439, -1342, -2564, 1699, 245, -2410, -578, -225, 837, 49, -1081, -721, -366, -1999, 676, -332, 1762, -193, -337, -707, -1429, -2990, -2099, -1044, 1035, 536, 583, 231, 1071, -178, -751, -2089, -1948, -163, 1353, -1011, -131, -128, 1789, -873, 726, -1933, -2549, -2002, -607, -528, 631, 864, -513, 846, 1, -778, -1801, 341, -972, 770, 1666, 621, -1182, -831, 752, -364, 1562, -2854, -842, -1073, -2216, -2097, 1368, -1697, -2134, -1362, 670, -542, 186, 329, 2047, 1000, -991, 1214, -1181, 787, 896, 552, 458, 1366, 862, 1230, 1618, -1365, -822, 411, 707, -1250, 1541, 1600, -1447, 1313, -813, -1657, -4, 1428, 1284, -1443, 1290, 154, 560, 2612, -1404, 1640, -1469, 1290, -462, -1750, 1444, 1102, 475, 1565, 994, 666, 2252, -1896, -757, 644, -98, -1225, -1836, 1254, 1987, 672, 456, -1572, 2170, 805, 1630, -1611, 563, -1417, 1622, 434, 1622, 417, -1672, -1877, 1511, -1700, -1387, 963, 773, -2790, 571, -1965, 848, -252, 439, -2598, -2252, -236, -2376, -1242, -2045, 312, -2525, 1294, 1145, 1131, 458, -631, -648, 1697, 433, 264, 1081, -430, -1789, 1436, -121, 49, 96, 2100, -2519, -514, 548, 1624, 119, -1471, -1845, 1104, -1851, -1791, -708, -1648, 669, -1205, 2225, 287, -1378, 1130, -112, 824, -483, 83, 603, -1548, 998, -1783, -2183, -832, 114, 1387, 733, -1278, -1591, 1357, -3205, 1429, 880, 965, 1507, -1217, 848, 1633, 411, 3176, 261, -1653, -1788, -1535, 851, -1250, -525, -1219, 1312, 1646, -1873, -999, -2104, 140, 1017, 1196, -2867, 92, 603, -1118, -1491, -854, -3064, 680, 1693, 1596, -1920, 1617, 307, -656, 394, -333, -139, 888, -379, 600, 511, -998, -1559, -1043, 1269, 580, -970, -1547, 222, 1182, -565, 205, -1110, -57, 506, -363, -2043, 894, -638, -1451, -2288, -269, 1440, 801, -1125, -866, -167, -1618, -430, 1734, -573, 1095, -608, -2826, -2115, 1015, -915, -722, -749, 3230, 1460, -1872, 437, 2942, -1516, -88, 1056, 1030, 781, 355, 1717, -992, -1034, -2059, -1982, -284, 63, 1586, -554, 449, -2032, -467, -955, -109, -896, -1543, 1909, -458, -555, 756, 501, 348, -215, -163, -912, -307, -1541, -1463, -97, -501, -2397, -1797, -672};
const q15_t aq15_conv1d_3_bias[32] = {-481, 94, 636, -275, 100, -347, 136, -1290, -792, 39, 303, 595, -193, -232, 264, 771, -1093, -922, -1780, 603, -553, 74, 329, -521, -304, 548, 389, 135, -357, -991, -214, 163};
const q15_t tanh_lut[3544] = {0, 7, 15, 23, 31, 39, 47, 55, 63, 71, 79, 87, 95, 103, 111, 119, 127, 135, 143, 151, 159, 167, 175, 183, 191, 199, 207, 215, 223, 231, 239, 247, 255, 263, 271, 279, 287, 295, 303, 311, 319, 327, 335, 343, 351, 359, 367, 374, 382, 390, 398, 406, 414, 422, 430, 438, 446, 454, 462, 469, 477, 485, 493, 501, 509, 517, 525, 532, 540, 548, 556, 564, 572, 580, 587, 595, 603, 611, 619, 627, 634, 642, 650, 658, 666, 673, 681, 689, 697, 704, 712, 720, 728, 735, 743, 751, 759, 766, 774, 782, 789, 797, 805, 813, 820, 828, 836, 843, 851, 859, 866, 874, 881, 889, 897, 904, 912, 920, 927, 935, 942, 950, 957, 965, 973, 980, 988, 995, 1003, 1010, 1018, 1025, 1033, 1040, 1048, 1055, 1063, 1070, 1078, 1085, 1092, 1100, 1107, 1115, 1122, 1129, 1137, 1144, 1152, 1159, 1166, 1174, 1181, 1188, 1196, 1203, 1210, 1218, 1225, 1232, 1239, 1247, 1254, 1261, 1268, 1276, 1283, 1290, 1297, 1304, 1312, 1319, 1326, 1333, 1340, 1347, 1355, 1362, 1369, 1376, 1383, 1390, 1397, 1404, 1411, 1418, 1425, 1432, 1439, 1446, 1453, 1460, 1467, 1474, 1481, 1488, 1495, 1502, 1509, 1516, 1523, 1530, 1537, 1543, 1550, 1557, 1564, 1571, 1578, 1584, 1591, 1598, 1605, 1612, 1618, 1625, 1632, 1639, 1645, 1652, 1659, 1665, 1672, 1679, 1685, 1692, 1699, 1705, 1712, 1718, 1725, 1732, 1738, 1745, 1751, 1758, 1764, 1771, 1777, 1784, 1790, 1797, 1803, 1810, 1816, 1822, 1829, 1835, 1842, 1848, 1854, 1861, 1867, 1873, 1880, 1886, 1892, 1899, 1905, 1911, 1917, 1924, 1930, 1936, 1942, 1948, 1955, 1961, 1967, 1973, 1979, 1985, 1992, 1998, 2004, 2010, 2016, 2022, 2028, 2034, 2040, 2046, 2052, 2058, 2064, 2070, 2076, 2082, 2088, 2094, 2100, 2105, 2111, 2117, 2123, 2129, 2135, 2141, 2146, 2152, 2158, 2164, 2169, 2175, 2181, 2187, 2192, 2198, 2204, 2209, 2215, 2221, 2226, 2232, 2238, 2243, 2249, 2254, 2260, 2266, 2271, 2277, 2282, 2288, 2293, 2299, 2304, 2310, 2315, 2321, 2326, 2331, 2337, 2342, 2348, 2353, 2358, 2364, 2369, 2374, 2380, 2385, 2390, 2395, 2401, 2406, 2411, 2416, 2422, 2427, 2432, 2437, 2442, 2447, 2453, 2458, 2463, 2468, 2473, 2478, 2483, 2488, 2493, 2498, 2503, 2508, 2513, 2518, 2523, 2528, 2533, 2538, 2543, 2548, 2553, 2558, 2563, 2567, 2572, 2577, 2582, 2587, 2592, 2596, 2601, 2606, 2611, 2615, 2620, 2625, 2629, 2634, 2639, 2644, 2648, 2653, 2657, 2662, 2667, 2671, 2676, 2681, 2685, 2690, 2694, 2699, 2703, 2708, 2712, 2717, 2721, 2726, 2730, 2735, 2739, 2743, 2748, 2752, 2757, 2761, 2765, 2770, 2774, 2778, 2783, 2787, 2791, 2795, 2800, 2804, 2808, 2812, 2817, 2821, 2825, 2829, 2833, 2838, 2842, 2846, 2850, 2854, 2858, 2862, 2866, 2871, 2875, 2879, 2883, 2887, 2891, 2895, 2899, 2903, 2907, 2911, 2915, 2919, 2923, 2926, 2930, 2934, 2938, 2942, 2946, 2950, 2954, 2957, 2961, 2965, 2969, 2973, 2976, 2980, 2984, 2988, 2991, 2995, 2999, 3003, 3006, 3010, 3014, 3017, 3021, 3025, 3028, 3032, 3035, 3039, 3043, 3046, 3050, 3053, 3057, 3060, 3064, 3067, 3071, 3074, 3078, 3081, 3085, 3088, 3092, 3095, 3099, 3102, 3105, 3109, 3112, 3116, 3119, 3122, 3126, 3129, 3132, 3136, 3139, 3142, 3146, 3149, 3152, 3155, 3159, 3162, 3165, 3168, 3171, 3175, 3178, 3181, 3184, 3187, 3191, 3194, 3197, 3200, 3203, 3206, 3209, 3212, 3215, 3218, 3221, 3225, 3228, 3231, 3234, 3237, 3240, 3243, 3246, 3249, 3252, 3254, 3257, 3260, 3263, 3266, 3269, 3272, 3275, 3278, 3281, 3284, 3286, 3289, 3292, 3295, 3298, 3300, 3303, 3306, 3309, 3312, 3314, 3317, 3320, 3323, 3325, 3328, 3331, 3334, 3336, 3339, 3342, 3344, 3347, 3350, 3352, 3355, 3357, 3360, 3363, 3365, 3368, 3370, 3373, 3376, 3378, 3381, 3383, 3386, 3388, 3391, 3393, 3396, 3398, 3401, 3403, 3406, 3408, 3411, 3413, 3416, 3418, 3420, 3423, 3425, 3428, 3430, 3432, 3435, 3437, 3440, 3442, 3444, 3447, 3449, 3451, 3454, 3456, 3458, 3460, 3463, 3465, 3467, 3470, 3472, 3474, 3476, 3479, 3481, 3483, 3485, 3487, 3490, 3492, 3494, 3496, 3498, 3500, 3503, 3505, 3507, 3509, 3511, 3513, 3515, 3517, 3520, 3522, 3524, 3526, 3528, 3530, 3532, 3534, 3536, 3538, 3540, 3542, 3544, 3546, 3548, 3550, 3552, 3554, 3556, 3558, 3560, 3562, 3564, 3566, 3568, 3570, 3572, 3574, 3575, 3577, 3579, 3581, 3583, 3585, 3587, 3589, 3590, 3592, 3594, 3596, 3598, 3600, 3601, 3603, 3605, 3607, 3609, 3610, 3612, 3614, 3616, 3618, 3619, 3621, 3623, 3625, 3626, 3628, 3630, 3631, 3633, 3635, 3637, 3638, 3640, 3642, 3643, 3645, 3647, 3648, 3650, 3652, 3653, 3655, 3656, 3658, 3660, 3661, 3663, 3664, 3666, 3668, 3669, 3671, 3672, 3674, 3675, 3677, 3679, 3680, 3682, 3683, 3685, 3686, 3688, 3689, 3691, 3692, 3694, 3695, 3697, 3698, 3700, 3701, 3703, 3704, 3706, 3707, 3708, 3710, 3711, 3713, 3714, 3716, 3717, 3718, 3720, 3721, 3723, 3724, 3725, 3727, 3728, 3729, 3731, 3732, 3734, 3735, 3736, 3738, 3739, 3740, 3742, 3743, 3744, 3746, 3747, 3748, 3749, 3751, 3752, 3753, 3755, 3756, 3757, 3758, 3760, 3761, 3762, 3763, 3765, 3766, 3767, 3768, 3770, 3771, 3772, 3773, 3774, 3776, 3777, 3778, 3779, 3780, 3782, 3783, 3784, 3785, 3786, 3787, 3789, 3790, 3791, 3792, 3793, 3794, 3795, 3797, 3798, 3799, 3800, 3801, 3802, 3803, 3804, 3805, 3807, 3808, 3809, 3810, 3811, 3812, 3813, 3814, 3815, 3816, 3817, 3818, 3819, 3820, 3821, 3822, 3823, 3824, 3825, 3826, 3828, 3829, 3830, 3831, 3832, 3833, 3834, 3835, 3835, 3836, 3837, 3838, 3839, 3840, 3841, 3842, 3843, 3844, 3845, 3846, 3847, 3848, 3849, 3850, 3851, 3852, 3853, 3854, 3854, 3855, 3856, 3857, 3858, 3859, 3860, 3861, 3862, 3863, 3863, 3864, 3865, 3866, 3867, 3868, 3869, 3870, 3870, 3871, 3872, 3873, 3874, 3875, 3875, 3876, 3877, 3878, 3879, 3880, 3880, 3881, 3882, 3883, 3884, 3884, 3885, 3886, 3887, 3888, 3888, 3889, 3890, 3891, 3892, 3892, 3893, 3894, 3895, 3895, 3896, 3897, 3898, 3898, 3899, 3900, 3901, 3901, 3902, 3903, 3904, 3904, 3905, 3906, 3907, 3907, 3908, 3909, 3909, 3910, 3911, 3912, 3912, 3913, 3914, 3914, 3915, 3916, 3916, 3917, 3918, 3918, 3919, 3920, 3920, 3921, 3922, 3922, 3923, 3924, 3924, 3925, 3926, 3926, 3927, 3928, 3928, 3929, 3930, 3930, 3931, 3931, 3932, 3933, 3933, 3934, 3935, 3935, 3936, 3936, 3937, 3938, 3938, 3939, 3939, 3940, 3941, 3941, 3942, 3942, 3943, 3944, 3944, 3945, 3945, 3946, 3946, 3947, 3948, 3948, 3949, 3949, 3950, 3950, 3951, 3952, 3952, 3953, 3953, 3954, 3954, 3955, 3955, 3956, 3956, 3957, 3957, 3958, 3959, 3959, 3960, 3960, 3961, 3961, 3962, 3962, 3963, 3963, 3964, 3964, 3965, 3965, 3966, 3966, 3967, 3967, 3968, 3968, 3969, 3969, 3970, 3970, 3971, 3971, 3972, 3972, 3972, 3973, 3973, 3974, 3974, 3975, 3975, 3976, 3976, 3977, 3977, 3978, 3978, 3979, 3979, 3979, 3980, 3980, 3981, 3981, 3982, 3982, 3982, 3983, 3983, 3984, 3984, 3985, 3985, 3985, 3986, 3986, 3987, 3987, 3988, 3988, 3988, 3989, 3989, 3990, 3990, 3990, 3991, 3991, 3992, 3992, 3992, 3993, 3993, 3994, 3994, 3994, 3995, 3995, 3996, 3996, 3996, 3997, 3997, 3998, 3998, 3998, 3999, 3999, 3999, 4000, 4000, 4000, 4001, 4001, 4002, 4002, 4002, 4003, 4003, 4003, 4004, 4004, 4004, 4005, 4005, 4005, 4006, 4006, 4007, 4007, 4007, 4008, 4008, 4008, 4009, 4009, 4009, 4010, 4010, 4010, 4011, 4011, 4011, 4012, 4012, 4012, 4013, 4013, 4013, 4013, 4014, 4014, 4014, 4015, 4015, 4015, 4016, 4016, 4016, 4017, 4017, 4017, 4017, 4018, 4018, 4018, 4019, 4019, 4019, 4020, 4020, 4020, 4020, 4021, 4021, 4021, 4022, 4022, 4022, 4022, 4023, 4023, 4023, 4024, 4024, 4024, 4024, 4025, 4025, 4025, 4026, 4026, 4026, 4026, 4027, 4027, 4027, 4027, 4028, 4028, 4028, 4028, 4029, 4029, 4029, 4029, 4030, 4030, 4030, 4030, 4031, 4031, 4031, 4031, 4032, 4032, 4032, 4032, 4033, 4033, 4033, 4033, 4034, 4034, 4034, 4034, 4035, 4035, 4035, 4035, 4036, 4036, 4036, 4036, 4036, 4037, 4037, 4037, 4037, 4038, 4038, 4038, 4038, 4039, 4039, 4039, 4039, 4039, 4040, 4040, 4040, 4040, 4040, 4041, 4041, 4041, 4041, 4042, 4042, 4042, 4042, 4042, 4043, 4043, 4043, 4043, 4043, 4044, 4044, 4044, 4044, 4044, 4045, 4045, 4045, 4045, 4045, 4046, 4046, 4046, 4046, 4046, 4047, 4047, 4047, 4047, 4047, 4047, 4048, 4048, 4048, 4048, 4048, 4049, 4049, 4049, 4049, 4049, 4049, 4050, 4050, 4050, 4050, 4050, 4051, 4051, 4051, 4051, 4051, 4051, 4052, 4052, 4052, 4052, 4052, 4052, 4053, 4053, 4053, 4053, 4053, 4053, 4054, 4054, 4054, 4054, 4054, 4054, 4055, 4055, 4055, 4055, 4055, 4055, 4055, 4056, 4056, 4056, 4056, 4056, 4056, 4057, 4057, 4057, 4057, 4057, 4057, 4057, 4058, 4058, 4058, 4058, 4058, 4058, 4058, 4059, 4059, 4059, 4059, 4059, 4059, 4059, 4060, 4060, 4060, 4060, 4060, 4060, 4060, 4061, 4061, 4061, 4061, 4061, 4061, 4061, 4062, 4062, 4062, 4062, 4062, 4062, 4062, 4062, 4063, 4063, 4063, 4063, 4063, 4063, 4063, 4063, 4064, 4064, 4064, 4064, 4064, 4064, 4064, 4064, 4065, 4065, 4065, 4065, 4065, 4065, 4065, 4065, 4065, 4066, 4066, 4066, 4066, 4066, 4066, 4066, 4066, 4067, 4067, 4067, 4067, 4067, 4067, 4067, 4067, 4067, 4068, 4068, 4068, 4068, 4068, 4068, 4068, 4068, 4068, 4068, 4069, 4069, 4069, 4069, 4069, 4069, 4069, 4069, 4069, 4070, 4070, 4070, 4070, 4070, 4070, 4070, 4070, 4070, 4070, 4071, 4071, 4071, 4071, 4071, 4071, 4071, 4071, 4071, 4071, 4071, 4072, 4072, 4072, 4072, 4072, 4072, 4072, 4072, 4072, 4072, 4072, 4073, 4073, 4073, 4073, 4073, 4073, 4073, 4073, 4073, 4073, 4073, 4074, 4074, 4074, 4074, 4074, 4074, 4074, 4074, 4074, 4074, 4074, 4074, 4075, 4075, 4075, 4075, 4075, 4075, 4075, 4075, 4075, 4075, 4075, 4075, 4075, 4076, 4076, 4076, 4076, 4076, 4076, 4076, 4076, 4076, 4076, 4076, 4076, 4076, 4077, 4077, 4077, 4077, 4077, 4077, 4077, 4077, 4077, 4077, 4077, 4077, 4077, 4077, 4078, 4078, 4078, 4078, 4078, 4078, 4078, 4078, 4078, 4078, 4078, 4078, 4078, 4078, 4079, 4079, 4079, 4079, 4079, 4079, 4079, 4079, 4079, 4079, 4079, 4079, 4079, 4079, 4079, 4079, 4080, 4080, 4080, 4080, 4080, 4080, 4080, 4080, 4080, 4080, 4080, 4080, 4080, 4080, 4080, 4080, 4080, 4081, 4081, 4081, 4081, 4081, 4081, 4081, 4081, 4081, 4081, 4081, 4081, 4081, 4081, 4081, 4081, 4081, 4082, 4082, 4082, 4082, 4082, 4082, 4082, 4082, 4082, 4082, 4082, 4082, 4082, 4082, 4082, 4082, 4082, 4082, 4082, 4083, 4083, 4083, 4083, 4083, 4083, 4083, 4083, 4083, 4083, 4083, 4083, 4083, 4083, 4083, 4083, 4083, 4083, 4083, 4083, 4083, 4084, 4084, 4084, 4084, 4084, 4084, 4084, 4084, 4084, 4084, 4084, 4084, 4084, 4084, 4084, 4084, 4084, 4084, 4084, 4084, 4084, 4084, 4085, 4085, 4085, 4085, 4085, 4085, 4085, 4085, 4085, 4085, 4085, 4085, 4085, 4085, 4085, 4085, 4085, 4085, 4085, 4085, 4085, 4085, 4085, 4085, 4085, 4086, 4086, 4086, 4086, 4086, 4086, 4086, 4086, 4086, 4086, 4086, 4086, 4086, 4086, 4086, 4086, 4086, 4086, 4086, 4086, 4086, 4086, 4086, 4086, 4086, 4086, 4086, 4087, 4087, 4087, 4087, 4087, 4087, 4087, 4087, 4087, 4087, 4087, 4087, 4087, 4087, 4087, 4087, 4087, 4087, 4087, 4087, 4087, 4087, 4087, 4087, 4087, 4087, 4087, 4087, 4087, 4087, 4088, 4088, 4088, 4088, 4088, 4088, 4088, 4088, 4088, 4088, 4088, 4088, 4088, 4088, 4088, 4088, 4088, 4088, 4088, 4088, 4088, 4088, 4088, 4088, 4088, 4088, 4088, 4088, 4088, 4088, 4088, 4088, 4088, 4088, 4089, 4089, 4089, 4089, 4089, 4089, 4089, 4089, 4089, 4089, 4089, 4089, 4089, 4089, 4089, 4089, 4089, 4089, 4089, 4089, 4089, 4089, 4089, 4089, 4089, 4089, 4089, 4089, 4089, 4089, 4089, 4089, 4089, 4089, 4089, 4089, 4089, 4089, 4089, 4090, 4090, 4090, 4090, 4090, 4090, 4090, 4090, 4090, 4090, 4090, 4090, 4090, 4090, 4090, 4090, 4090, 4090, 4090, 4090, 4090, 4090, 4090, 4090, 4090, 4090, 4090, 4090, 4090, 4090, 4090, 4090, 4090, 4090, 4090, 4090, 4090, 4090, 4090, 4090, 4090, 4090, 4090, 4090, 4090, 4090, 4090, 4091, 4091, 4091, 4091, 4091, 4091, 4091, 4091, 4091, 4091, 4091, 4091, 4091, 4091, 4091, 4091, 4091, 4091, 4091, 4091, 4091, 4091, 4091, 4091, 4091, 4091, 4091, 4091, 4091, 4091, 4091, 4091, 4091, 4091, 4091, 4091, 4091, 4091, 4091, 4091, 4091, 4091, 4091, 4091, 4091, 4091, 4091, 4091, 4091, 4091, 4091, 4091, 4091, 4091, 4091, 4091, 4091, 4092, 4092, 4092, 4092, 4092, 4092, 4092, 4092, 4092, 4092, 4092, 4092, 4092, 4092, 4092, 4092, 4092, 4092, 4092, 4092, 4092, 4092, 4092, 4092, 4092, 4092, 4092, 4092, 4092, 4092, 4092, 4092, 4092, 4092, 4092, 4092, 4092, 4092, 4092, 4092, 4092, 4092, 4092, 4092, 4092, 4092, 4092, 4092, 4092, 4092, 4092, 4092, 4092, 4092, 4092, 4092, 4092, 4092, 4092, 4092, 4092, 4092, 4092, 4092, 4092, 4092, 4092, 4092, 4092, 4092, 4092, 4092, 4092, 4092, 4093, 4093, 4093, 4093, 4093, 4093, 4093, 4093, 4093, 4093, 4093, 4093, 4093, 4093, 4093, 4093, 4093, 4093, 4093, 4093, 4093, 4093, 4093, 4093, 4093, 4093, 4093, 4093, 4093, 4093, 4093, 4093, 4093, 4093, 4093, 4093, 4093, 4093, 4093, 4093, 4093, 4093, 4093, 4093, 4093, 4093, 4093, 4093, 4093, 4093, 4093, 4093, 4093, 4093, 4093, 4093, 4093, 4093, 4093, 4093, 4093, 4093, 4093, 4093, 4093, 4093, 4093, 4093, 4093, 4093, 4093, 4093, 4093, 4093, 4093, 4093, 4093, 4093, 4093, 4093, 4093, 4093, 4093, 4093, 4093, 4093, 4093, 4093, 4093, 4093, 4093, 4093, 4093, 4093, 4093, 4093, 4093, 4093, 4093, 4093, 4093, 4093, 4093, 4093, 4094, 4094, 4094, 4094, 4094, 4094, 4094, 4094, 4094, 4094, 4094, 4094, 4094, 4094, 4094, 4094, 4094, 4094, 4094, 4094, 4094, 4094, 4094, 4094, 4094, 4094, 4094, 4094, 4094, 4094, 4094, 4094, 4094, 4094, 4094, 4094, 4094, 4094, 4094, 4094, 4094, 4094, 4094, 4094, 4094, 4094, 4094, 4094, 4094, 4094, 4094, 4094, 4094, 4094, 4094, 4094, 4094, 4094, 4094, 4094, 4094, 4094, 4094, 4094, 4094, 4094, 4094, 4094, 4094, 4094, 4094, 4094, 4094, 4094, 4094, 4094, 4094, 4094, 4094, 4094, 4094, 4094, 4094, 4094, 4094, 4094, 4094, 4094, 4094, 4094, 4094, 4094, 4094, 4094, 4094, 4094, 4094, 4094, 4094, 4094, 4094, 4094, 4094, 4094, 4094, 4094, 4094, 4094, 4094, 4094, 4094, 4094, 4094, 4094, 4094, 4094, 4094, 4094, 4094, 4094, 4094, 4094, 4094, 4094, 4094, 4094, 4094, 4094, 4094, 4094, 4094, 4094, 4094, 4094, 4094, 4094, 4094, 4094, 4094, 4094, 4094, 4094, 4094, 4094, 4094, 4094, 4094, 4094, 4094, 4094, 4094, 4094, 4094, 4094, 4094, 4094, 4094, 4094, 4094, 4094, 4094, 4094, 4094, 4094, 4094, 4094, 4094, 4094, 4094, 4094, 4094, 4094, 4094, 4094, 4094, 4094, 4094, 4095, 4095, 4095, 4095, 4095, 4095, 4095, 4095, 4095, 4095, 4095, 4095, 4095, 4095, 4095, 4095, 4095, 4095, 4095, 4095, 4095, 4095, 4095, 4095, 4095, 4095, 4095, 4095, 4095, 4095, 4095, 4095, 4095, 4095, 4095, 4095, 4095, 4095, 4095, 4095, 4095, 4095, 4095, 4095, 4095, 4095, 4095, 4095, 4095, 4095, 4095, 4095, 4095, 4095, 4095, 4095, 4095, 4095, 4095, 4095, 4095, 4095, 4095, 4095, 4095, 4095, 4095, 4095, 4095, 4095, 4095, 4095, 4095, 4095, 4095, 4095, 4095, 4095, 4095, 4095, 4095, 4095, 4095, 4095, 4095, 4095, 4095, 4095, 4095, 4095, 4095, 4095, 4095, 4095, 4095, 4095, 4095, 4095, 4095, 4095, 4095, 4095, 4095, 4095, 4095, 4095, 4095, 4095, 4095, 4095, 4095, 4095, 4095, 4095, 4095, 4095, 4095, 4095, 4095, 4095, 4095, 4095, 4095, 4095, 4095, 4095, 4095, 4095, 4095, 4095, 4095, 4095, 4095, 4095, 4095, 4095, 4095, 4095, 4095, 4095, 4095, 4095, 4095, 4095, 4095, 4095, 4095, 4095, 4095, 4095, 4095, 4095, 4095, 4095, 4095, 4095, 4095, 4095, 4095, 4095, 4095, 4095, 4095, 4095, 4095, 4095, 4095, 4095, 4095, 4095, 4095, 4095, 4095, 4095, 4095, 4095, 4095, 4095, 4095, 4095, 4095, 4095, 4095, 4095, 4095, 4095, 4095, 4095, 4095, 4095, 4095, 4095, 4095, 4095, 4095, 4095, 4095, 4095, 4095, 4095, 4095, 4095, 4095, 4095, 4095, 4095, 4095, 4095, 4095, 4095, 4095, 4095, 4095, 4095, 4095, 4095, 4095, 4095, 4095, 4095, 4095, 4095, 4095, 4095, 4095, 4095, 4095, 4095, 4095, 4095, 4095, 4095, 4095, 4095, 4095, 4095, 4095, 4095, 4095, 4095, 4095, 4095, 4095, 4095, 4095, 4095, 4095, 4095, 4095, 4095, 4095, 4095, 4095, 4095, 4095, 4095, 4095, 4095, 4095, 4095, 4095, 4095, 4095, 4095, 4095, 4095, 4095, 4095, 4095, 4095, 4095, 4095, 4095, 4095, 4095, 4095, 4095, 4095, 4095, 4095, 4095, 4095, 4095, 4095, 4095, 4095, 4095, 4095, 4095, 4095, 4095, 4095, 4095, 4095, 4095, 4095, 4095, 4095, 4095, 4095, 4095, 4095, 4095, 4095, 4095, 4095, 4095, 4095, 4095, 4095, 4095, 4095, 4095, 4095, 4095, 4095, 4095, 4095, 4095, 4095, 4095, 4095, 4095, 4095, 4095, 4095, 4095, 4095, 4095, 4095, 4095, 4095, 4095, 4095, 4095, 4095, 4095, 4095, 4095, 4095, 4095, 4095, 4095, 4095, 4095, 4095, 4095, 4095, 4095, 4095, 4095, 4095, 4095, 4095, 4095, 4095, 4095, 4095, 4095, 4095, 4095, 4095, 4095, 4095, 4095, 4095, 4095, 4095, 4095, 4095, 4095, 4095, 4095, 4095, 4095, 4095, 4095, 4095, 4095, 4095, 4095, 4095, 4095, 4095, 4095, 4095, 4095, 4095, 4095, 4095, 4095, 4095, 4095, 4095, 4095, 4095, 4095, 4095, 4095, 4095, 4095, 4095, 4095, 4095, 4095, 4095, 4095, 4095, 4095, 4095, 4095, 4095, 4095, 4095, 4095, 4095, 4095, 4095, 4095, 4095, 4095, 4095, 4095, 4095, 4095, 4095, 4095, 4095, 4095, 4095, 4095, 4095, 4095, 4095, 4095, 4095, 4095, 4095, 4095, 4095, 4095, 4095, 4095, 4095, 4095, 4095, 4095, 4095, 4095, 4095, 4095, 4095, 4095, 4095, 4095, 4095, 4095, 4095, 4095, 4095, 4095, 4095, 4095, 4095, 4095, 4095, 4095, 4095, 4095, 4095, 4095, 4095, 4095, 4095, 4095, 4095, 4095, 4095, 4095, 4095, 4095, 4095, 4095, 4095, 4095, 4095, 4095, 4095, 4095, 4095, 4095, 4095, 4095, 4095, 4095, 4095, 4095, 4095, 4095, 4095, 4095, 4095, 4095, 4095, 4095, 4095, 4095, 4095, 4095, 4095, 4095, 4095, 4095, 4095, 4095, 4095, 4095, 4095, 4095, 4095, 4095, 4095, 4095, 4095, 4095, 4095, 4095, 4095, 4095, 4095, 4095, 4095, 4095, 4095, 4095, 4095, 4095, 4095, 4095, 4095, 4095, 4095, 4095, 4095, 4095, 4095, 4095, 4095, 4095, 4095, 4095, 4095, 4095, 4095, 4095, 4095, 4095, 4095, 4095, 4095, 4095, 4095, 4095, 4095, 4095, 4095, 4095, 4095, 4095, 4095, 4095, 4095, 4095, 4095, 4095, 4095, 4095, 4095, 4095, 4095, 4095, 4095, 4095, 4095, 4095, 4095, 4095, 4095, 4095, 4095, 4095, 4095, 4095, 4095, 4095, 4095, 4095, 4095, 4095, 4095, 4095, 4095, 4095, 4095, 4095, 4095, 4095, 4095, 4095, 4095, 4095, 4095, 4095, 4095, 4095, 4095, 4095, 4095, 4095, 4095, 4095, 4095, 4095, 4095, 4095, 4095, 4095, 4095, 4095, 4095, 4095, 4095, 4095, 4095, 4095, 4095, 4095, 4095, 4095, 4095, 4095, 4095, 4095, 4095, 4095, 4095, 4095, 4095, 4095, 4095, 4095, 4095, 4095, 4095, 4095, 4095, 4095, 4095, 4095, 4095, 4095, 4095, 4095, 4095, 4095, 4095, 4095, 4095, 4095, 4095, 4095, 4095, 4095, 4095, 4095, 4095, 4095, 4095, 4095, 4095, 4095, 4095, 4095, 4095, 4095, 4095, 4095, 4095, 4095, 4095, 4095, 4095, 4095, 4095, 4095, 4095, 4095, 4095, 4095, 4095, 4095, 4095, 4095, 4095, 4095, 4095, 4095, 4095, 4095, 4095, 4095, 4095, 4095, 4095, 4095, 4095, 4095, 4095, 4095, 4095, 4095, 4095, 4095, 4095, 4095, 4095, 4095, 4095, 4095, 4095, 4095, 4095, 4095, 4095, 4095, 4095, 4095, 4095, 4095, 4095, 4095, 4095, 4095, 4095, 4095, 4095, 4095, 4095, 4095, 4095, 4095, 4095, 4095, 4095, 4095, 4095, 4095, 4095, 4095, 4095, 4095, 4095, 4095, 4095, 4095, 4095, 4095, 4095, 4095, 4095, 4095, 4095, 4095, 4095, 4095, 4095, 4095, 4095, 4095, 4095, 4095, 4095, 4095, 4095, 4095, 4095, 4095, 4095, 4095, 4095, 4095, 4095, 4095, 4095, 4095, 4095, 4095, 4095, 4095, 4095, 4095, 4095, 4095, 4095, 4095, 4095, 4095, 4095, 4095, 4095, 4095, 4095, 4095, 4095, 4095, 4095, 4095, 4095, 4095, 4095, 4095, 4095, 4095, 4095, 4095, 4095, 4095, 4095, 4095, 4095, 4095, 4095, 4095, 4095, 4095, 4095, 4095, 4095, 4095, 4095, 4095, 4095, 4095, 4095, 4095, 4095, 4095, 4095, 4095, 4095, 4095, 4095, 4095, 4095, 4095, 4095, 4095, 4095, 4095, 4095, 4095, 4095, 4095, 4095, 4095, 4095, 4095, 4095, 4095, 4095, 4095, 4095, 4095, 4095, 4095, 4095, 4095, 4095, 4095, 4095, 4095, 4095, 4095, 4095, 4095, 4095, 4095, 4095, 4095, 4095, 4095, 4095, 4095, 4095, 4095, 4095, 4095, 4095, 4095, 4095, 4095, 4095, 4095, 4095, 4095, 4095, 4095, 4095, 4095, 4095, 4095, 4095, 4095, 4095, 4095, 4095, 4095, 4095, 4095, 4095, 4095, 4095, 4095, 4095, 4095, 4095, 4095, 4095, 4095, 4095, 4095, 4095, 4095, 4095, 4095, 4095, 4095, 4095, 4095, 4095, 4095, 4095, 4095, 4095, 4095, 4095, 4095, 4095, 4095, 4095, 4095, 4095, 4095, 4095, 4095, 4095, 4095, 4095, 4095, 4095, 4095, 4095, 4095, 4095, 4095, 4095, 4095, 4095, 4095, 4095, 4095, 4095, 4095, 4095, 4095, 4095, 4095, 4095, 4095, 4095, 4095, 4095, 4095, 4095, 4095, 4095, 4095, 4095, 4095, 4095, 4095, 4095, 4095, 4095, 4095, 4095, 4095, 4095, 4095, 4095, 4095, 4095, 4095, 4095, 4095, 4095, 4095, 4095, 4095, 4095, 4095, 4095, 4095, 4095, 4095, 4095, 4095, 4095, 4095, 4095, 4095, 4095, 4095, 4095, 4095, 4095, 4095, 4095, 4095, 4095, 4095, 4095, 4095, 4095, 4095, 4095, 4095, 4095, 4095, 4095, 4095, 4095, 4095, 4095, 4095, 4095, 4095, 4095, 4095, 4095, 4095, 4095, 4095, 4095, 4095, 4095, 4095, 4095, 4095, 4095, 4095, 4095, 4095, 4095, 4095, 4095, 4095, 4095, 4095, 4095, 4095, 4095, 4095, 4095, 4095, 4095, 4095, 4095, 4095, 4095, 4095, 4095, 4095, 4095, 4095, 4095, 4095, 4095, 4095, 4095, 4095, 4095, 4095, 4095, 4095, 4095, 4095, 4095, 4095, 4095, 4095, 4095, 4095, 4095, 4095, 4095, 4095, 4095, 4095, 4095, 4095, 4095, 4095, 4095, 4095, 4095, 4095, 4095, 4095, 4095, 4095, 4095, 4095, 4095, 4095, 4095, 4095, 4095, 4095, 4095, 4095, 4095, 4095, 4095, 4095, 4095, 4095, 4095, 4095, 4095, 4095, 4095, 4095, 4095, 4095, 4095, 4095, 4095, 4095, 4095, 4095, 4095, 4095, 4095, 4095, 4095, 4095, 4095, 4095, 4095, 4095, 4095, 4095, 4095, 4095, 4095, 4095, 4095, 4095, 4095, 4095, 4095, 4095, 4095, 4095, 4095, 4095, 4095, 4095, 4095, 4095, 4095, 4095, 4095, 4095, 4095, 4095, 4095, 4095, 4095, 4095, 4095, 4095, 4095, 4095, 4095, 4095, 4095, 4095, 4095, 4095, 4095, 4095, 4095, 4095, 4095, 4095, 4095, 4095, 4095, 4095, 4095, 4095, 4095, 4095, 4095, 4095, 4095, 4095, 4095, 4095, 4095, 4095, 4095, 4095, 4095, 4095, 4095, 4095, 4095, 4095, 4095, 4095, 4095, 4095, 4095, 4095};
#define DENSE_1_IN_DIM 32
#define DENSE_1_OU_DIM 64
#define DENSE_2_IN_DIM 64
#define DENSE_2_OU_DIM 64
#define DENSE_3_IN_DIM 64
#define DENSE_3_OU_DIM 1
#define CONV1D_1_IN_DIM 106
#define CONV1D_1_OU_DIM 106
#define CONV1D_2_IN_DIM 106
#define CONV1D_2_OU_DIM 106
#define CONV1D_3_IN_DIM 106
#define CONV1D_3_OU_DIM 106
#define CONV1D_1_IN_CH 1
#define CONV1D_1_OU_CH 32
#define CONV1D_1_KER_DIM 9
#define CONV1D_1_PADDING 0
#define CONV1D_1_STRIDE 1
#define CONV1D_2_IN_CH 32
#define CONV1D_2_OU_CH 32
#define CONV1D_2_KER_DIM 6
#define CONV1D_2_PADDING 0
#define CONV1D_2_STRIDE 1
#define CONV1D_3_IN_CH 32
#define CONV1D_3_OU_CH 32
#define CONV1D_3_KER_DIM 3
#define CONV1D_3_PADDING 0
#define CONV1D_3_STRIDE 1
#define POOL_1_IN_DIM 106
#define POOL_1_IN_CH 32
#define POOL_1_OU_DIM 32
#define POOL_1_KER_DIM 3
#define POOL_1_PADDING 0
#define POOL_1_STRIDE 1
#define CONV1D_1_IN_SHIFT 0
#define CONV1D_1_OU_SHIFT 10
#define CONV1D_2_IN_SHIFT 1
#define CONV1D_2_OU_SHIFT 11
#define CONV1D_3_IN_SHIFT 3
#define CONV1D_3_OU_SHIFT 12
#define DENSE_1_IN_SHIFT 4
#define DENSE_1_OU_SHIFT 7
#define DENSE_2_IN_SHIFT 10
#define DENSE_2_OU_SHIFT 12
#define DENSE_3_IN_SHIFT 11
#define DENSE_3_OU_SHIFT 12
#define OUTPUT_SHIFT 12
#define TANH_SHIFT 3
