{
  "request": {
    "method": "GET",
    "urlPattern": "/recipe.*"
  },
  "response": {
    "status": 200,
    "jsonBody": [
      {
        "id": "9185f668-6ffd-11ed-a1eb-0242ac120002",
        "title": "title"
      },
      {
        "id": "9185f668-6ffd-11ed-a1eb-0242ac120003",
        "title": "title2"
      }
    ],
    "headers": {
      "Content-Type": "application/json"
    }
  }
}
