{
  "/api-java/*": {
    "target": "http://localhost:10000",
    "pathRewrite": {
      "^/api-java": ""
    }
  },
  "/api-python/*": {
    "target": "http://localhost:10010",
    "pathRewrite": {
      "^/api-python": ""
    }
  }
}
