# Blender MTL File: 'volcan.blend'
# Material Count: 3

newmtl Material.001
Ns 21.910373
Ka 1.000000 1.000000 1.000000
Kd 0.283149 0.111932 0.043735
Ks 0.372340 0.372340 0.372340
Ke 0.000000 0.001333 0.037401
Ni 1.450000
d 1.000000
illum 2

newmtl Material.002
Ns 323.999994
Ka 1.000000 1.000000 1.000000
Kd 0.800000 0.800000 0.800000
Ks 0.500000 0.500000 0.500000
Ke 0.000000 0.000000 0.000000
Ni 1.000000
d 1.000000
illum 2

newmtl None
Ns 500
Ka 0.8 0.8 0.8
Kd 0.8 0.8 0.8
Ks 0.8 0.8 0.8
d 1
illum 2
