{
  "type": "service_account",
  "project_id": "gms-lab",
  "private_key_id": "4cbfcfb8963dc3f40dbe37f5a86d57ff430448d3",
  "private_key": "-----BEGIN PRIVATE KEY-----\nMIIEvAIBADANBgkqhkiG9w0BAQEFAASCBKYwggSiAgEAAoIBAQCYlf6NOV8TP9QV\n03J8TMIP7Qk5QXRFhzmHI/G8XEPsTGUjm4QU03rPl5YB6NblH8NrNtGkpTuMzi+y\nQXDq3ggCBWe+tgWxohQ4esnlpR60ZzRu1X+GJbr2axQnphJQ0/Jq9SALgaMSHcNe\nGJ4QIJDW85vTdt6K1YZ4JeT3EPdZZRi05DAUtE5VjEyE5w5YQ6QBPgGW1ADfQJtS\n9LMkdvbn2Jnq/Bnggy++Z1Gji0qar9LFYzghbtu/VPAYxCFIvIBcEqBDLZDUSFYB\nVOS0pa0jAhXvAgTFMr3smCyd6WTcNRft/loHLVB59kCpj2dS01iFUl/FRZgFyKDJ\nsgAwRUPnAgMBAAECggEAGL8y8qqcXd3bQtLxXXGBg924wj14YxJkZSOSQC9ioL9f\nI+BEErCd2W9HV/XwbGazZf8VDzPxLYv/NlTgwGbUO6euxMJ2t/GGgAaCGimmijG2\n0kb0EMirwu1o7mlDzTIivfAVi2gyD20eU3OApzLw6rvFyQ0dWLz6ux/CO8PXqfq4\nYqxsBqqb5cK96entTt4anqOAEZO6Fql7B6j4CyqVwEChehFY08zfOLwwmhUbClWy\nwnIms91BBN3XIAPtW0gZFJ22lYQJDnfena0+l5zykpJJcA9ur+TFJt7FvaOGGbxZ\nTEu8jIKYz49I3N2Xxbg6/nVnLSzyTXGxzi/r6bo3kQKBgQDIUPpILABmoEkPXi8F\nBcPT99bKxpc/awL18Xf7O23ca9pIl3nhMCURSrVnHh3mrRm8ZavqGKZb2asXFcVP\nDLfhr6OXzZXXsVQsR9CITKU0grgqrt7rBZTIpWgIWkiy3yJIeloK9mi0wG/AbiS0\nuy7U4RHIlMKxPiZpd636Qi9bvwKBgQDDAGYepvWYdZcothndUuYXEdqpKtmnXE+G\nSJt7bfIg2MKFYZpI8Vs6bJR53m25fdytrDZZkhfWrDMuTOMXIwG+tqzCGfVNzSoi\ns+iYsc88pFB4SMM/h7RhVRAYBOE5s5putexNhKM+JogzZazR3w4DfheO9mpMk/J8\nTYS1CWtB2QKBgCX4q6jYpm7NvWurV9Bk6l0Y4t9nS65a06HZVvwJpOaejy8pf5H/\nNVeUyNQ2MkbS00kSIMdsSsSoezUSDGfSqlyela0l7FyJocIPDul3Ve2hRdXZdioo\n0a5DJHhI3PUDNRV2E/F2Ch0RSV25wz17KgJyc5OJF2rPtCpT5GfG+gEzAoGAeHRv\noHGb9hB1TlWmhnvl28xQmPz6NBKmoRmKyeTxk26yQjg3WOWWZ/GYietnNhTUU4e0\njwHareXzO5+NC8a5Fji7YK8uQ1//ri4Z+PClRh1uA89WpJDMUO99oIirI7yZIdhI\n3t2XBRZCPhWJep7hhjDGlq4KncEqIbS0zCvEUIkCgYA0riyjah7+bDjCg79EAJF1\nNjfez6SFexxEOZ2Bk18SC/S7R0MPbyr0kv98HfUe9OwXP7YtOQjlEl1hX8CoQaDh\nVNxe2Q7L75tq04xkHwpTxnVz/81KAYRU5KaenYR2uARyypTPcPvEsJfY0xouToTQ\nkbSGBcnQ1ikFDakCBZ/kBQ==\n-----END PRIVATE KEY-----\n",
  "client_email": "ssi-anthos@gms-lab.iam.gserviceaccount.com",
  "client_id": "100517299832929251827",
  "auth_uri": "https://accounts.google.com/o/oauth2/auth",
  "token_uri": "https://oauth2.googleapis.com/token",
  "auth_provider_x509_cert_url": "https://www.googleapis.com/oauth2/v1/certs",
  "client_x509_cert_url": "https://www.googleapis.com/robot/v1/metadata/x509/ssi-anthos%40gms-lab.iam.gserviceaccount.com"
}
