<svg xmlns="http://www.w3.org/2000/svg" width="40" height="43" viewBox="0 0 40 43">
  <metadata><?xpacket begin="﻿" id="W5M0MpCehiHzreSzNTczkc9d"?>
<x:xmpmeta xmlns:x="adobe:ns:meta/" x:xmptk="Adobe XMP Core 5.6-c140 79.160451, 2017/05/06-01:08:21        ">
   <rdf:RDF xmlns:rdf="http://www.w3.org/1999/02/22-rdf-syntax-ns#">
      <rdf:Description rdf:about=""/>
   </rdf:RDF>
</x:xmpmeta>
                                                                                                    
                                                                                                    
                                                                                                    
                                                                                                    
                                                                                                    
                                                                                                    
                                                                                                    
                                                                                                    
                                                                                                    
                                                                                                    
                                                                                                    
                                                                                                    
                                                                                                    
                                                                                                    
                                                                                                    
                                                                                                    
                                                                                                    
                                                                                                    
                                                                                                    
                                                                                                    
                           
<?xpacket end="w"?></metadata>
<defs>
    <style>
      .cls-1 {
        fill: #797979;
        fill-rule: evenodd;
      }
    </style>
  </defs>
  <path class="cls-1" d="M10285.7,1104.38h-2.6v-6.07a11.1,11.1,0,1,0-22.2,0v5.71h-2.6a6.462,6.462,0,0,0,0,12.92h6.2v-18.63a7.5,7.5,0,1,1,15,0v22.14a3.135,3.135,0,0,1-3.1,3.16h-0.3a4.545,4.545,0,1,0,0,3.69h0.3a6.778,6.778,0,0,0,6.7-6.85v-3.16h2.6A6.457,6.457,0,0,0,10285.7,1104.38Zm-24.8,8.87h-2.6a2.771,2.771,0,0,1,0-5.54h2.6v5.54Zm24.8,0.36h-2.6v-5.55h2.6A2.776,2.776,0,0,1,10285.7,1113.61Z" transform="translate(-10252 -1087)"/>
</svg>
