<svg xmlns="http://www.w3.org/2000/svg" width="34.03" height="35" viewBox="0 0 34.03 35">
  <metadata><?xpacket begin="﻿" id="W5M0MpCehiHzreSzNTczkc9d"?>
<x:xmpmeta xmlns:x="adobe:ns:meta/" x:xmptk="Adobe XMP Core 5.6-c138 79.159824, 2016/09/14-01:09:01        ">
   <rdf:RDF xmlns:rdf="http://www.w3.org/1999/02/22-rdf-syntax-ns#">
      <rdf:Description rdf:about=""/>
   </rdf:RDF>
</x:xmpmeta>
                                                                                                    
                                                                                                    
                                                                                                    
                                                                                                    
                                                                                                    
                                                                                                    
                                                                                                    
                                                                                                    
                                                                                                    
                                                                                                    
                                                                                                    
                                                                                                    
                                                                                                    
                                                                                                    
                                                                                                    
                                                                                                    
                                                                                                    
                                                                                                    
                                                                                                    
                                                                                                    
                           
<?xpacket end="w"?></metadata>
<defs>
    <style>
      .cls-1 {
        fill: #fff;
        fill-rule: evenodd;
      }
    </style>
  </defs>
  <path id="Location_icon" data-name="Location icon" class="cls-1" d="M2402.99,71a12.285,12.285,0,0,0-12.24,12.3c0,7.794,4.77,22.7,12.24,22.7s12.24-14.9,12.24-22.7A12.285,12.285,0,0,0,2402.99,71Zm0,32c-4.38,0-9.26-11.741-9.26-19.7a9.255,9.255,0,1,1,18.51,0C2412.24,91.259,2407.37,103,2402.99,103Zm15.51,0h-7.08a1.5,1.5,0,0,0,0,3h7.08A1.5,1.5,0,0,0,2418.5,103Zm-23.94,0h-7.09a1.5,1.5,0,0,0,0,3h7.09A1.5,1.5,0,0,0,2394.56,103Zm8.43-24.366a4.911,4.911,0,1,0,4.88,4.912A4.9,4.9,0,0,0,2402.99,78.634Zm0,6.823a1.912,1.912,0,1,1,1.9-1.911A1.906,1.906,0,0,1,2402.99,85.457Z" transform="translate(-2385.97 -71)"/>
</svg>
