<?xml version="1.0" encoding="utf-8" ?>
<kml xmlns="http://earth.google.com/kml/2.2">
  <Document>
      
        <name>Greater Sydney Landcare Network</name>
        <description>The Greater Sydney Landcare Network is made up of Landcare, Local Councils (Bushcare), National Parks and Wildlife Service, private landholders, Streamwatch groups, businesses and other individuals. GSLN members are offered support and assistance in all voluntary operations and additional large-scale collaborative projects.</description>
        <open>1</open>

        
        
        <Style id="marker_43331d6026b742f48e06eef80eaf1e96">
            <IconStyle>
                <scale>0.8</scale>
                <Icon>
                    <href>http://maps.google.com/mapfiles/kml/pushpin/ylw-pushpin.png</href>
                </Icon>
                <hotSpot x="0" y="0" xunits="pixels" yunits="pixels"/>
            </IconStyle>
            <LabelStyle>
                <color>ff0000ff</color>
            </LabelStyle>
        </Style>

        

        
        
        <Style id="poly_43331d6026b742f48e06eef80eaf1e96">
            <LineStyle>
                <width>1</width>
                <color>7f9333c2</color>            
            </LineStyle>
            <PolyStyle>
                <color>7f9333c2</color>
            </PolyStyle>
        </Style>

        <Folder>

        <name>Area of Greater Sydney Landcare Network</name>

        
        
        <Placemark>
            <name>Greater Sydney Landcare Network</name>
            <!--Snippet maxLines="0">empty</Snippet-->
            <description>
               The Greater Sydney Landcare Network is made up of Landcare, Local Councils (Bushcare), National Parks and Wildlife Service, private landholders, Streamwatch groups, businesses and other individuals. GSLN members are offered support and assistance in all voluntary operations and additional large-scale collaborative projects.
               https://landcare.nsw.gov.au/groups/greater-sydney-landcare-network-inc
            </description>
            <styleUrl>#marker_43331d6026b742f48e06eef80eaf1e96</styleUrl>
            <Point>
                <tessellate>1</tessellate>
                <coordinates>150.805126,-33.827759,0</coordinates>
            </Point>
        </Placemark>
        
        
        
        <Placemark>
            <description>The Greater Sydney Landcare Network is made up of Landcare, Local Councils (Bushcare), National Parks and Wildlife Service, private landholders, Streamwatch groups, businesses and other individuals. GSLN members are offered support and assistance in all voluntary operations and additional large-scale collaborative projects.</description>            
            <!--Snippet maxLines="0">empty</Snippet-->
            <styleUrl>#poly_43331d6026b742f48e06eef80eaf1e96</styleUrl>
            <Polygon>
                <extrude>0</extrude>
                <tessellate>1</tessellate>
               <altitudeMode>clampToGround</altitudeMode>
                <outerBoundaryIs>
                    <LinearRing>
                        <coordinates>151.20787,-33.96127,0 150.92806,-34.36723,0 150.7438,-34.3227,0 150.05941,-34.25426,0 150.03171,-34.14865,0 150.25616,-33.49772,0 150.62751,-33.07011,0 151.61437,-33.1636,0 151.3745,-33.53078,0 151.20787,-33.96127,0</coordinates>
                    </LinearRing>
                </outerBoundaryIs>
            </Polygon>
        </Placemark>
        </Folder>

        
    </Document>
</kml>
