{
    "/js/core/app.js": "/js/core/app.js?id=b59feaebab46b972522b",
    "/js/core/app-menu.js": "/js/core/app-menu.js?id=8c2d66f42aeac565ea50",
    "/css/base/plugins/charts/chart-apex.css": "/css/base/plugins/charts/chart-apex.css?id=ca18d9aac6c26afb125b",
    "/css/base/plugins/extensions/ext-component-context-menu.css": "/css/base/plugins/extensions/ext-component-context-menu.css?id=35fc0aee275401d30f9c",
    "/css/base/plugins/extensions/ext-component-drag-drop.css": "/css/base/plugins/extensions/ext-component-drag-drop.css?id=e08a6caf011d1af0afe7",
    "/css/base/plugins/extensions/ext-component-media-player.css": "/css/base/plugins/extensions/ext-component-media-player.css?id=ecb404fde703be965aa6",
    "/css/base/plugins/extensions/ext-component-ratings.css": "/css/base/plugins/extensions/ext-component-ratings.css?id=4b8c8cad3a1e7e401bbd",
    "/css/base/plugins/extensions/ext-component-sliders.css": "/css/base/plugins/extensions/ext-component-sliders.css?id=3c9a033660de5a399a9e",
    "/css/base/plugins/extensions/ext-component-sweet-alerts.css": "/css/base/plugins/extensions/ext-component-sweet-alerts.css?id=8eebde508ccf8f7c6ad7",
    "/css/base/plugins/extensions/ext-component-swiper.css": "/css/base/plugins/extensions/ext-component-swiper.css?id=417cb3f29ad80df8af31",
    "/css/base/plugins/extensions/ext-component-toastr.css": "/css/base/plugins/extensions/ext-component-toastr.css?id=2f476d3442f748288830",
    "/css/base/plugins/extensions/ext-component-tour.css": "/css/base/plugins/extensions/ext-component-tour.css?id=fc8a061252c0f2d4966e",
    "/css/base/plugins/extensions/ext-component-tree.css": "/css/base/plugins/extensions/ext-component-tree.css?id=b3b0bbf2c7003a25d8d4",
    "/css/base/plugins/forms/form-file-uploader.css": "/css/base/plugins/forms/form-file-uploader.css?id=f183e05db703e360bc96",
    "/css/base/plugins/forms/form-number-input.css": "/css/base/plugins/forms/form-number-input.css?id=94a4e9e3a66d551ba86f",
    "/css/base/plugins/forms/form-quill-editor.css": "/css/base/plugins/forms/form-quill-editor.css?id=4041d2fe9b06a3fabeac",
    "/css/base/plugins/forms/form-validation.css": "/css/base/plugins/forms/form-validation.css?id=07cf2a8facc67e2ff179",
    "/css/base/plugins/forms/form-wizard.css": "/css/base/plugins/forms/form-wizard.css?id=d1c8bc61ace763e4fc75",
    "/css/base/plugins/forms/pickers/form-flat-pickr.css": "/css/base/plugins/forms/pickers/form-flat-pickr.css?id=9f34e4c2c92ffa9029ec",
    "/css/base/plugins/forms/pickers/form-pickadate.css": "/css/base/plugins/forms/pickers/form-pickadate.css?id=f750bd2541609dcb690b",
    "/css/base/plugins/maps/map-leaflet.css": "/css/base/plugins/maps/map-leaflet.css?id=9cd8806c343898b4d58f",
    "/css/base/plugins/tables/table-ag-grid.css": "/css/base/plugins/tables/table-ag-grid.css?id=e042af04ae18987394c3",
    "/css/base/plugins/ui/coming-soon.css": "/css/base/plugins/ui/coming-soon.css?id=9dc486466419698339c3",
    "/css/base/pages/app-calendar.css": "/css/base/pages/app-calendar.css?id=a2ddd55c40aac708d6f7",
    "/css/base/pages/app-chat-list.css": "/css/base/pages/app-chat-list.css?id=bd97be3aef05cfb5dc9d",
    "/css/base/pages/app-chat.css": "/css/base/pages/app-chat.css?id=b8744d1e3e714dd718c3",
    "/css/base/pages/app-ecommerce-details.css": "/css/base/pages/app-ecommerce-details.css?id=2952b519a1af52ef1f42",
    "/css/base/pages/app-ecommerce.css": "/css/base/pages/app-ecommerce.css?id=8ae6e36eb2b2e530a007",
    "/css/base/pages/app-email.css": "/css/base/pages/app-email.css?id=8787b86ad4222e791109",
    "/css/base/pages/app-file-manager.css": "/css/base/pages/app-file-manager.css?id=1038bf8cf1c7dd9cfbb4",
    "/css/base/pages/app-invoice-list.css": "/css/base/pages/app-invoice-list.css?id=acc65f246e6bd1a9512e",
    "/css/base/pages/app-invoice-print.css": "/css/base/pages/app-invoice-print.css?id=a2d177958366cc645f92",
    "/css/base/pages/app-invoice.css": "/css/base/pages/app-invoice.css?id=b9b0554f9ebae0db722e",
    "/css/base/pages/app-kanban.css": "/css/base/pages/app-kanban.css?id=bb15669536a6172b3868",
    "/css/base/pages/app-todo.css": "/css/base/pages/app-todo.css?id=ff6c578b414837e55666",
    "/css/base/pages/app-user.css": "/css/base/pages/app-user.css?id=4e037402ac1addee7c1d",
    "/css/base/pages/dashboard-ecommerce.css": "/css/base/pages/dashboard-ecommerce.css?id=cd032c6750701c8ca97f",
    "/css/base/pages/page-auth.css": "/css/base/pages/page-auth.css?id=c50a160054d94ff05e09",
    "/css/base/pages/page-blog.css": "/css/base/pages/page-blog.css?id=d8cf592f117532738423",
    "/css/base/pages/page-coming-soon.css": "/css/base/pages/page-coming-soon.css?id=503f5a39d91fe237a771",
    "/css/base/pages/page-faq.css": "/css/base/pages/page-faq.css?id=2540fb3d6b3a369b6e0d",
    "/css/base/pages/page-knowledge-base.css": "/css/base/pages/page-knowledge-base.css?id=489bc7c70fb0fe9af65c",
    "/css/base/pages/page-misc.css": "/css/base/pages/page-misc.css?id=5fe3d793d6a49f49fa22",
    "/css/base/pages/page-pricing.css": "/css/base/pages/page-pricing.css?id=716ea163c7825467fecc",
    "/css/base/pages/page-profile.css": "/css/base/pages/page-profile.css?id=c1b428f69f3a4124db13",
    "/css/base/pages/ui-colors.css": "/css/base/pages/ui-colors.css?id=6f6d7b3b41e5f699e0e2",
    "/css/base/pages/ui-feather.css": "/css/base/pages/ui-feather.css?id=fc84d80ade0abdc44fac",
    "/css/base/core/colors/palette-gradient.css": "/css/base/core/colors/palette-gradient.css?id=e28a108d4dc031202872",
    "/css/base/core/colors/palette-noui.css": "/css/base/core/colors/palette-noui.css?id=e8afed9f71ddb3e57b52",
    "/css/base/core/colors/palette-variables.css": "/css/base/core/colors/palette-variables.css?id=d41d8cd98f00b204e980",
    "/css/base/core/menu/menu-types/horizontal-menu.css": "/css/base/core/menu/menu-types/horizontal-menu.css?id=70608ff56a94e0bee2d0",
    "/css/base/core/menu/menu-types/vertical-menu.css": "/css/base/core/menu/menu-types/vertical-menu.css?id=b00e8da9b1484aab2036",
    "/css/base/core/menu/menu-types/vertical-overlay-menu.css": "/css/base/core/menu/menu-types/vertical-overlay-menu.css?id=370c0ef73dbbe2925242",
    "/css/base/core/mixins/alert.css": "/css/base/core/mixins/alert.css?id=d41d8cd98f00b204e980",
    "/css/base/core/mixins/hex2rgb.css": "/css/base/core/mixins/hex2rgb.css?id=d41d8cd98f00b204e980",
    "/css/base/core/mixins/main-menu-mixin.css": "/css/base/core/mixins/main-menu-mixin.css?id=d41d8cd98f00b204e980",
    "/css/base/core/mixins/transitions.css": "/css/base/core/mixins/transitions.css?id=d41d8cd98f00b204e980",
    "/css/core.css": "/css/core.css?id=6100ec8c2fc345506f3c",
    "/css/overrides.css": "/css/overrides.css?id=f796e995f1ed0a769668",
    "/css/custom-rtl.css": "/css/custom-rtl.css?id=23881fec0479360bee56",
    "/css/style-rtl.css": "/css/style-rtl.css?id=d41d8cd98f00b204e980",
    "/css/style.css": "/css/style.css?id=d41d8cd98f00b204e980",
    "/js/scripts/cards/card-advance.js": "/js/scripts/cards/card-advance.js?id=ca2818050fae246f41f2",
    "/js/scripts/cards/card-analytics.js": "/js/scripts/cards/card-analytics.js?id=ead6f2040d41b5dbf6af",
    "/js/scripts/cards/card-statistics.js": "/js/scripts/cards/card-statistics.js?id=708374c5401cbb19cc28",
    "/js/scripts/charts/chart-apex.js": "/js/scripts/charts/chart-apex.js?id=d748da376afb7bf40238",
    "/js/scripts/charts/chart-chartjs.js": "/js/scripts/charts/chart-chartjs.js?id=807e4706a818cf29169c",
    "/js/scripts/components/components-alerts.js": "/js/scripts/components/components-alerts.js?id=2916cdc035d969a6d826",
    "/js/scripts/components/components-bs-toast.js": "/js/scripts/components/components-bs-toast.js?id=cce9f138f5cdd521f26f",
    "/js/scripts/components/components-collapse.js": "/js/scripts/components/components-collapse.js?id=0d37eb519a13d0a94121",
    "/js/scripts/components/components-dropdowns.js": "/js/scripts/components/components-dropdowns.js?id=5a762c3c5c63a85a54bf",
    "/js/scripts/components/components-modals.js": "/js/scripts/components/components-modals.js?id=27b94f2f9ef68852fe1b",
    "/js/scripts/components/components-navs.js": "/js/scripts/components/components-navs.js?id=c1b79692c4149fb4efe3",
    "/js/scripts/components/components-popovers.js": "/js/scripts/components/components-popovers.js?id=33e87d256ecff71a3e12",
    "/js/scripts/components/components-tooltips.js": "/js/scripts/components/components-tooltips.js?id=99188389bb0a0ca2588d",
    "/js/scripts/customizer.js": "/js/scripts/customizer.js?id=741987f0d2ab9f7b39bf",
    "/js/scripts/documentation.js": "/js/scripts/documentation.js?id=9cf6f8f369a3b1e97537",
    "/js/scripts/extensions/ext-component-blockui.js": "/js/scripts/extensions/ext-component-blockui.js?id=0430545d612daadc8df8",
    "/js/scripts/extensions/ext-component-clipboard.js": "/js/scripts/extensions/ext-component-clipboard.js?id=c4c859fab70eb0637dec",
    "/js/scripts/extensions/ext-component-context-menu.js": "/js/scripts/extensions/ext-component-context-menu.js?id=af8a9ef862a53044cbc7",
    "/js/scripts/extensions/ext-component-drag-drop.js": "/js/scripts/extensions/ext-component-drag-drop.js?id=d879375b45184543eade",
    "/js/scripts/extensions/ext-component-i18n.js": "/js/scripts/extensions/ext-component-i18n.js?id=f5a832f7df9fa9e01b16",
    "/js/scripts/extensions/ext-component-media-player.js": "/js/scripts/extensions/ext-component-media-player.js?id=3a00e8d3f0a2be893723",
    "/js/scripts/extensions/ext-component-ratings.js": "/js/scripts/extensions/ext-component-ratings.js?id=dc26f93b2b884eeb649b",
    "/js/scripts/extensions/ext-component-sliders.js": "/js/scripts/extensions/ext-component-sliders.js?id=fa37f971efc9bd8be2a1",
    "/js/scripts/extensions/ext-component-sweet-alerts.js": "/js/scripts/extensions/ext-component-sweet-alerts.js?id=497d5f6f2dbb1a9ff4e0",
    "/js/scripts/extensions/ext-component-sweet-alerts.min.js": "/js/scripts/extensions/ext-component-sweet-alerts.min.js?id=03b6c04659e1c382cb9a",
    "/js/scripts/extensions/ext-component-swiper.js": "/js/scripts/extensions/ext-component-swiper.js?id=15c0c6e4dcd7454d109c",
    "/js/scripts/extensions/ext-component-toastr.js": "/js/scripts/extensions/ext-component-toastr.js?id=d530ca208913c0293bd6",
    "/js/scripts/extensions/ext-component-tour.js": "/js/scripts/extensions/ext-component-tour.js?id=9a0c616504cd10e10b9a",
    "/js/scripts/extensions/ext-component-tree.js": "/js/scripts/extensions/ext-component-tree.js?id=1a76bd36d96af93676df",
    "/js/scripts/forms/form-file-uploader.js": "/js/scripts/forms/form-file-uploader.js?id=49f1b796e8b13302440f",
    "/js/scripts/forms/form-input-mask.js": "/js/scripts/forms/form-input-mask.js?id=252cc827ff318c2487bd",
    "/js/scripts/forms/form-number-input.js": "/js/scripts/forms/form-number-input.js?id=58d4f29b85d74d79c35f",
    "/js/scripts/forms/form-quill-editor.js": "/js/scripts/forms/form-quill-editor.js?id=e8b2a6f1b7a817b2bb6e",
    "/js/scripts/forms/form-repeater.js": "/js/scripts/forms/form-repeater.js?id=0096e49afc7ced71346d",
    "/js/scripts/forms/form-select2.js": "/js/scripts/forms/form-select2.js?id=a325bf5d9d5075dfab2d",
    "/js/scripts/forms/form-tooltip-valid.js": "/js/scripts/forms/form-tooltip-valid.js?id=672dd64dbcb229957302",
    "/js/scripts/forms/form-validation.js": "/js/scripts/forms/form-validation.js?id=d5a5d592bcf377f3e1bd",
    "/js/scripts/forms/form-wizard.js": "/js/scripts/forms/form-wizard.js?id=f6d6682df6137d5cc77f",
    "/js/scripts/forms/pickers/form-pickers.js": "/js/scripts/forms/pickers/form-pickers.js?id=3511d2e1da949eb41be0",
    "/js/scripts/maps/map-leaflet.js": "/js/scripts/maps/map-leaflet.js?id=c9850265265de3a44fbc",
    "/js/scripts/pages/app-calendar-events.js": "/js/scripts/pages/app-calendar-events.js?id=7cf2858a28d8afeb79ca",
    "/js/scripts/pages/app-calendar.js": "/js/scripts/pages/app-calendar.js?id=23846aeb2598d78af103",
    "/js/scripts/pages/app-chat.js": "/js/scripts/pages/app-chat.js?id=7f0fd554792fcc0d01de",
    "/js/scripts/pages/app-ecommerce-checkout.js": "/js/scripts/pages/app-ecommerce-checkout.js?id=65c3aeaa4b61fb74fe25",
    "/js/scripts/pages/app-ecommerce-details.js": "/js/scripts/pages/app-ecommerce-details.js?id=6c19c5aa806ee349e962",
    "/js/scripts/pages/app-ecommerce-wishlist.js": "/js/scripts/pages/app-ecommerce-wishlist.js?id=d06f9730b7b03c5e9d82",
    "/js/scripts/pages/app-ecommerce.js": "/js/scripts/pages/app-ecommerce.js?id=d22435dc2801402f4335",
    "/js/scripts/pages/app-email.js": "/js/scripts/pages/app-email.js?id=f7a1afb1bdb3b424b103",
    "/js/scripts/pages/app-file-manager.js": "/js/scripts/pages/app-file-manager.js?id=81c5df96e40626faeaf1",
    "/js/scripts/pages/app-invoice-list.js": "/js/scripts/pages/app-invoice-list.js?id=43dfcab5b2dfaee1bdf1",
    "/js/scripts/pages/app-invoice-print.js": "/js/scripts/pages/app-invoice-print.js?id=9e86010a341467557f6f",
    "/js/scripts/pages/app-invoice.js": "/js/scripts/pages/app-invoice.js?id=fde236a529a38350e7f2",
    "/js/scripts/pages/app-kanban.js": "/js/scripts/pages/app-kanban.js?id=d0422afc9fba86cf7b7a",
    "/js/scripts/pages/app-todo.js": "/js/scripts/pages/app-todo.js?id=b3165539fd340ffa1cab",
    "/js/scripts/pages/app-user-edit.js": "/js/scripts/pages/app-user-edit.js?id=b18f5a2dda16e818c390",
    "/js/scripts/pages/app-user-list.js": "/js/scripts/pages/app-user-list.js?id=3363adaf8e4664230447",
    "/js/scripts/pages/app-user-view.js": "/js/scripts/pages/app-user-view.js?id=6b3a5ab0ef0bc14e9a45",
    "/js/scripts/pages/dashboard-analytics.js": "/js/scripts/pages/dashboard-analytics.js?id=73e87a4ce1397f91cb2e",
    "/js/scripts/pages/dashboard-ecommerce.js": "/js/scripts/pages/dashboard-ecommerce.js?id=a50eb1ac9ae77add1336",
    "/js/scripts/pages/page-account-settings.js": "/js/scripts/pages/page-account-settings.js?id=b783523fb2c5a3530d99",
    "/js/scripts/pages/page-auth-forgot-password.js": "/js/scripts/pages/page-auth-forgot-password.js?id=202bd01e59d67c0e9234",
    "/js/scripts/pages/page-auth-login.js": "/js/scripts/pages/page-auth-login.js?id=57816a7d22a42a0ae442",
    "/js/scripts/pages/page-auth-register.js": "/js/scripts/pages/page-auth-register.js?id=1406d0646bfd171d83b6",
    "/js/scripts/pages/page-auth-reset-password.js": "/js/scripts/pages/page-auth-reset-password.js?id=e003a953b899f5b0c675",
    "/js/scripts/pages/page-blog-edit.js": "/js/scripts/pages/page-blog-edit.js?id=848df0b690aca99906e9",
    "/js/scripts/pages/page-knowledge-base.js": "/js/scripts/pages/page-knowledge-base.js?id=b098be87f57b1390dbd8",
    "/js/scripts/pages/page-pricing.js": "/js/scripts/pages/page-pricing.js?id=9822801dcf16a0b583da",
    "/js/scripts/pages/page-profile.js": "/js/scripts/pages/page-profile.js?id=4d4bd815b071e56983cd",
    "/js/scripts/pagination/components-pagination.js": "/js/scripts/pagination/components-pagination.js?id=859e2fb5ec9a56623972",
    "/js/scripts/tables/table-ag-grid.js": "/js/scripts/tables/table-ag-grid.js?id=3100a08cfdd0c42e5f94",
    "/js/scripts/tables/table-datatables-advanced.js": "/js/scripts/tables/table-datatables-advanced.js?id=71ca2786abac5242818a",
    "/js/scripts/tables/table-datatables-basic.js": "/js/scripts/tables/table-datatables-basic.js?id=aea5cad59137a26feac4",
    "/js/scripts/ui/ui-feather.js": "/js/scripts/ui/ui-feather.js?id=bedab3cb720c9285e826",
    "/vendors/js/blockui/blockui.min.js": "/vendors/js/blockui/blockui.min.js?id=25f78ac4c43d94411850",
    "/vendors/js/bootstrap/bootstrap.min.js": "/vendors/js/bootstrap/bootstrap.min.js?id=f20fa8b102f205141295",
    "/vendors/js/calendar/fullcalendar.min.js": "/vendors/js/calendar/fullcalendar.min.js?id=7457ee2e65aaa9af4053",
    "/vendors/js/charts/apexcharts.js": "/vendors/js/charts/apexcharts.js?id=3df6ec86fc996137c434",
    "/vendors/js/charts/apexcharts.min.js": "/vendors/js/charts/apexcharts.min.js?id=9c65c6ee3bb59eebe802",
    "/vendors/js/charts/chart.min.js": "/vendors/js/charts/chart.min.js?id=b5c2301eb15826bf38c9",
    "/vendors/js/editors/quill/highlight.min.js": "/vendors/js/editors/quill/highlight.min.js?id=f9ae462e6502faa24c81",
    "/vendors/js/editors/quill/katex.min.js": "/vendors/js/editors/quill/katex.min.js?id=2aaed3c2692536aac671",
    "/vendors/js/editors/quill/quill.js": "/vendors/js/editors/quill/quill.js?id=ef409f71e95b86ab8898",
    "/vendors/js/editors/quill/quill.min.js": "/vendors/js/editors/quill/quill.min.js?id=929349222da793a2128c",
    "/vendors/js/editors/quill/themes/base.js": "/vendors/js/editors/quill/themes/base.js?id=5749ffc9d019e4662bed",
    "/vendors/js/editors/quill/themes/bubble.js": "/vendors/js/editors/quill/themes/bubble.js?id=d2e6f70979129747de57",
    "/vendors/js/editors/quill/themes/snow.js": "/vendors/js/editors/quill/themes/snow.js?id=0b6ff52f966e612a6fbf",
    "/vendors/js/editors/quill/ui/color-picker.js": "/vendors/js/editors/quill/ui/color-picker.js?id=7a93c27a2800a480c97e",
    "/vendors/js/editors/quill/ui/icon-picker.js": "/vendors/js/editors/quill/ui/icon-picker.js?id=39a31ff7ca023fce75b1",
    "/vendors/js/editors/quill/ui/icons.js": "/vendors/js/editors/quill/ui/icons.js?id=b2cda2c9dd117bab915d",
    "/vendors/js/editors/quill/ui/picker.js": "/vendors/js/editors/quill/ui/picker.js?id=a9cf453a1ed4a90498d5",
    "/vendors/js/editors/quill/ui/tooltip.js": "/vendors/js/editors/quill/ui/tooltip.js?id=5fded70615a9871d6a08",
    "/vendors/js/extensions/dataTables.checkboxes.min.js": "/vendors/js/extensions/dataTables.checkboxes.min.js?id=fbefb5342e6319df72b7",
    "/vendors/js/extensions/dragula.min.js": "/vendors/js/extensions/dragula.min.js?id=58efe373a6a34d95f436",
    "/vendors/js/extensions/dropzone.min.js": "/vendors/js/extensions/dropzone.min.js?id=0458e88a68fea122160f",
    "/vendors/js/extensions/i18next.min.js": "/vendors/js/extensions/i18next.min.js?id=1b1676ed060792a29a8f",
    "/vendors/js/extensions/i18nextBrowserLanguageDetector.min.js": "/vendors/js/extensions/i18nextBrowserLanguageDetector.min.js?id=30b5eb0c07075213f3dc",
    "/vendors/js/extensions/i18nextXHRBackend.min.js": "/vendors/js/extensions/i18nextXHRBackend.min.js?id=dac8cc1d87660065c65e",
    "/vendors/js/extensions/jquery-i18next.min.js": "/vendors/js/extensions/jquery-i18next.min.js?id=f1fcc9d4eb99cc1414d0",
    "/vendors/js/extensions/jquery.contextMenu.min.js": "/vendors/js/extensions/jquery.contextMenu.min.js?id=b8dfb69666306f826ac7",
    "/vendors/js/extensions/jquery.mousewheel.min.js": "/vendors/js/extensions/jquery.mousewheel.min.js?id=b6bddcf63d04135bab37",
    "/vendors/js/extensions/jquery.rateyo.min.js": "/vendors/js/extensions/jquery.rateyo.min.js?id=f48942369810ca3ecdf7",
    "/vendors/js/extensions/jquery.ui.position.min.js": "/vendors/js/extensions/jquery.ui.position.min.js?id=b18116ea0fb224b69af5",
    "/vendors/js/extensions/jstree.min.js": "/vendors/js/extensions/jstree.min.js?id=d543cbb2ea3f4b3234e1",
    "/vendors/js/extensions/lang-all.js": "/vendors/js/extensions/lang-all.js?id=ac6faef018c845f0493d",
    "/vendors/js/extensions/locale-all.js": "/vendors/js/extensions/locale-all.js?id=c61d63888b913a98ea1c",
    "/vendors/js/extensions/moment.min.js": "/vendors/js/extensions/moment.min.js?id=e9b400a35be784331a51",
    "/vendors/js/extensions/nouislider.min.js": "/vendors/js/extensions/nouislider.min.js?id=66720a98c750e52c5bd0",
    "/vendors/js/extensions/pace.min.js": "/vendors/js/extensions/pace.min.js?id=24d2d5e3e331c4efa3cd",
    "/vendors/js/extensions/plyr.min.js": "/vendors/js/extensions/plyr.min.js?id=5e5c9e2fa67102bd70d0",
    "/vendors/js/extensions/plyr.polyfilled.min.js": "/vendors/js/extensions/plyr.polyfilled.min.js?id=c651777b4334902e77fd",
    "/vendors/js/extensions/polyfill.min.js": "/vendors/js/extensions/polyfill.min.js?id=d05a380d50b74e629738",
    "/vendors/js/extensions/shepherd.min.js": "/vendors/js/extensions/shepherd.min.js?id=572bc8f6d4674b1ff71f",
    "/vendors/js/extensions/sweetalert2.all.min.js": "/vendors/js/extensions/sweetalert2.all.min.js?id=b1b9214d91b48265f3c8",
    "/vendors/js/extensions/swiper.min.js": "/vendors/js/extensions/swiper.min.js?id=8b82d52f1a4bc20b5f10",
    "/vendors/js/extensions/tether.min.js": "/vendors/js/extensions/tether.min.js?id=1c4a5999a2b43cdd3aaa",
    "/vendors/js/extensions/toastr.min.js": "/vendors/js/extensions/toastr.min.js?id=4822c7d98e89e261b45d",
    "/vendors/js/extensions/transition.js": "/vendors/js/extensions/transition.js?id=9299a9022d8bef625922",
    "/vendors/js/extensions/wNumb.min.js": "/vendors/js/extensions/wNumb.min.js?id=d1b1e327a517dd0dba33",
    "/vendors/js/feather-icons/feather-icons.min.js": "/vendors/js/feather-icons/feather-icons.min.js?id=0f56c5f9236de73b0209",
    "/vendors/js/forms/cleave/addons/cleave-phone.ac.js": "/vendors/js/forms/cleave/addons/cleave-phone.ac.js?id=a3392d7c103ff7f2cd22",
    "/vendors/js/forms/cleave/addons/cleave-phone.ad.js": "/vendors/js/forms/cleave/addons/cleave-phone.ad.js?id=c416665d9dd7fc101e31",
    "/vendors/js/forms/cleave/addons/cleave-phone.ae.js": "/vendors/js/forms/cleave/addons/cleave-phone.ae.js?id=7879b8a117ebc50624e2",
    "/vendors/js/forms/cleave/addons/cleave-phone.af.js": "/vendors/js/forms/cleave/addons/cleave-phone.af.js?id=f40fb05110ce95967c27",
    "/vendors/js/forms/cleave/addons/cleave-phone.ag.js": "/vendors/js/forms/cleave/addons/cleave-phone.ag.js?id=c5016eec3b9237ab81e7",
    "/vendors/js/forms/cleave/addons/cleave-phone.ai.js": "/vendors/js/forms/cleave/addons/cleave-phone.ai.js?id=c5016eec3b9237ab81e7",
    "/vendors/js/forms/cleave/addons/cleave-phone.al.js": "/vendors/js/forms/cleave/addons/cleave-phone.al.js?id=c7c95db322f3cd0ac750",
    "/vendors/js/forms/cleave/addons/cleave-phone.am.js": "/vendors/js/forms/cleave/addons/cleave-phone.am.js?id=33449c6d0307d2da0670",
    "/vendors/js/forms/cleave/addons/cleave-phone.ao.js": "/vendors/js/forms/cleave/addons/cleave-phone.ao.js?id=a465746e3c7f8384ec7e",
    "/vendors/js/forms/cleave/addons/cleave-phone.ar.js": "/vendors/js/forms/cleave/addons/cleave-phone.ar.js?id=8ff7545b20541ef136ab",
    "/vendors/js/forms/cleave/addons/cleave-phone.as.js": "/vendors/js/forms/cleave/addons/cleave-phone.as.js?id=c5016eec3b9237ab81e7",
    "/vendors/js/forms/cleave/addons/cleave-phone.at.js": "/vendors/js/forms/cleave/addons/cleave-phone.at.js?id=a6fa50974587b6b495e3",
    "/vendors/js/forms/cleave/addons/cleave-phone.au-cn.js": "/vendors/js/forms/cleave/addons/cleave-phone.au-cn.js?id=ae71a7f0b167bb7968f5",
    "/vendors/js/forms/cleave/addons/cleave-phone.au.js": "/vendors/js/forms/cleave/addons/cleave-phone.au.js?id=2290f5a9ba1f9a63d21a",
    "/vendors/js/forms/cleave/addons/cleave-phone.aw.js": "/vendors/js/forms/cleave/addons/cleave-phone.aw.js?id=5db93698fff0d87d1052",
    "/vendors/js/forms/cleave/addons/cleave-phone.ax.js": "/vendors/js/forms/cleave/addons/cleave-phone.ax.js?id=a93bb3eb63121722e11c",
    "/vendors/js/forms/cleave/addons/cleave-phone.az.js": "/vendors/js/forms/cleave/addons/cleave-phone.az.js?id=a0cc3abb66bab70ba6eb",
    "/vendors/js/forms/cleave/addons/cleave-phone.ba.js": "/vendors/js/forms/cleave/addons/cleave-phone.ba.js?id=68d0bfcf4c605fbdb514",
    "/vendors/js/forms/cleave/addons/cleave-phone.bb.js": "/vendors/js/forms/cleave/addons/cleave-phone.bb.js?id=c5016eec3b9237ab81e7",
    "/vendors/js/forms/cleave/addons/cleave-phone.bd.js": "/vendors/js/forms/cleave/addons/cleave-phone.bd.js?id=679884df52e9c138415c",
    "/vendors/js/forms/cleave/addons/cleave-phone.be.js": "/vendors/js/forms/cleave/addons/cleave-phone.be.js?id=dae5211d9b91142fa677",
    "/vendors/js/forms/cleave/addons/cleave-phone.bf.js": "/vendors/js/forms/cleave/addons/cleave-phone.bf.js?id=44a2f96d6c8b34bdff24",
    "/vendors/js/forms/cleave/addons/cleave-phone.bg.js": "/vendors/js/forms/cleave/addons/cleave-phone.bg.js?id=74588f8f489d7b3eba1f",
    "/vendors/js/forms/cleave/addons/cleave-phone.bh.js": "/vendors/js/forms/cleave/addons/cleave-phone.bh.js?id=46d0bd8a8dc8a361d2ce",
    "/vendors/js/forms/cleave/addons/cleave-phone.bi.js": "/vendors/js/forms/cleave/addons/cleave-phone.bi.js?id=b3c255eb4ceaa8c7098b",
    "/vendors/js/forms/cleave/addons/cleave-phone.bj.js": "/vendors/js/forms/cleave/addons/cleave-phone.bj.js?id=cc6e158ac14b8e0ecf7a",
    "/vendors/js/forms/cleave/addons/cleave-phone.bl.js": "/vendors/js/forms/cleave/addons/cleave-phone.bl.js?id=62e0cca91d13f3ae4186",
    "/vendors/js/forms/cleave/addons/cleave-phone.bm.js": "/vendors/js/forms/cleave/addons/cleave-phone.bm.js?id=c5016eec3b9237ab81e7",
    "/vendors/js/forms/cleave/addons/cleave-phone.bn.js": "/vendors/js/forms/cleave/addons/cleave-phone.bn.js?id=2f4d7e5147b8c09269bb",
    "/vendors/js/forms/cleave/addons/cleave-phone.bo.js": "/vendors/js/forms/cleave/addons/cleave-phone.bo.js?id=74deb54a6f71d04717cb",
    "/vendors/js/forms/cleave/addons/cleave-phone.bq.js": "/vendors/js/forms/cleave/addons/cleave-phone.bq.js?id=93fc9bb7e589f5f207dd",
    "/vendors/js/forms/cleave/addons/cleave-phone.br.js": "/vendors/js/forms/cleave/addons/cleave-phone.br.js?id=c39bd8c61c684447d79d",
    "/vendors/js/forms/cleave/addons/cleave-phone.bs.js": "/vendors/js/forms/cleave/addons/cleave-phone.bs.js?id=c5016eec3b9237ab81e7",
    "/vendors/js/forms/cleave/addons/cleave-phone.bt.js": "/vendors/js/forms/cleave/addons/cleave-phone.bt.js?id=40fde859b32e88072912",
    "/vendors/js/forms/cleave/addons/cleave-phone.bw.js": "/vendors/js/forms/cleave/addons/cleave-phone.bw.js?id=6f139c151160012c6a30",
    "/vendors/js/forms/cleave/addons/cleave-phone.by.js": "/vendors/js/forms/cleave/addons/cleave-phone.by.js?id=c6fc2f01cafe8006476e",
    "/vendors/js/forms/cleave/addons/cleave-phone.bz.js": "/vendors/js/forms/cleave/addons/cleave-phone.bz.js?id=bd9ae6a0ef3b485251de",
    "/vendors/js/forms/cleave/addons/cleave-phone.ca.js": "/vendors/js/forms/cleave/addons/cleave-phone.ca.js?id=c5016eec3b9237ab81e7",
    "/vendors/js/forms/cleave/addons/cleave-phone.cc.js": "/vendors/js/forms/cleave/addons/cleave-phone.cc.js?id=2290f5a9ba1f9a63d21a",
    "/vendors/js/forms/cleave/addons/cleave-phone.cd.js": "/vendors/js/forms/cleave/addons/cleave-phone.cd.js?id=58b601b079377f362b83",
    "/vendors/js/forms/cleave/addons/cleave-phone.cf.js": "/vendors/js/forms/cleave/addons/cleave-phone.cf.js?id=4ddff31375effa56101a",
    "/vendors/js/forms/cleave/addons/cleave-phone.cg.js": "/vendors/js/forms/cleave/addons/cleave-phone.cg.js?id=25bf56c81d5849c0cb1f",
    "/vendors/js/forms/cleave/addons/cleave-phone.ch.js": "/vendors/js/forms/cleave/addons/cleave-phone.ch.js?id=4aa53adfefbd1aabaeab",
    "/vendors/js/forms/cleave/addons/cleave-phone.ci.js": "/vendors/js/forms/cleave/addons/cleave-phone.ci.js?id=5259c50c5797247ac7f7",
    "/vendors/js/forms/cleave/addons/cleave-phone.ck.js": "/vendors/js/forms/cleave/addons/cleave-phone.ck.js?id=2f0053ef2d82cf87bd98",
    "/vendors/js/forms/cleave/addons/cleave-phone.cl.js": "/vendors/js/forms/cleave/addons/cleave-phone.cl.js?id=5aca7fcd0f748fb0e71c",
    "/vendors/js/forms/cleave/addons/cleave-phone.cm.js": "/vendors/js/forms/cleave/addons/cleave-phone.cm.js?id=c37300861861875e62d9",
    "/vendors/js/forms/cleave/addons/cleave-phone.cn.js": "/vendors/js/forms/cleave/addons/cleave-phone.cn.js?id=311fe9dc86e640bc80ff",
    "/vendors/js/forms/cleave/addons/cleave-phone.co.js": "/vendors/js/forms/cleave/addons/cleave-phone.co.js?id=64809ac33e5370c51f4e",
    "/vendors/js/forms/cleave/addons/cleave-phone.cr.js": "/vendors/js/forms/cleave/addons/cleave-phone.cr.js?id=44b86ef628a6c7f8b81c",
    "/vendors/js/forms/cleave/addons/cleave-phone.cu.js": "/vendors/js/forms/cleave/addons/cleave-phone.cu.js?id=78dbb88d2fc9e5a342eb",
    "/vendors/js/forms/cleave/addons/cleave-phone.cv.js": "/vendors/js/forms/cleave/addons/cleave-phone.cv.js?id=7eea63add161be95e3dd",
    "/vendors/js/forms/cleave/addons/cleave-phone.cw.js": "/vendors/js/forms/cleave/addons/cleave-phone.cw.js?id=93fc9bb7e589f5f207dd",
    "/vendors/js/forms/cleave/addons/cleave-phone.cx.js": "/vendors/js/forms/cleave/addons/cleave-phone.cx.js?id=2290f5a9ba1f9a63d21a",
    "/vendors/js/forms/cleave/addons/cleave-phone.cy.js": "/vendors/js/forms/cleave/addons/cleave-phone.cy.js?id=ed8a142953f1405721f9",
    "/vendors/js/forms/cleave/addons/cleave-phone.cz.js": "/vendors/js/forms/cleave/addons/cleave-phone.cz.js?id=70aa519933de3535292b",
    "/vendors/js/forms/cleave/addons/cleave-phone.de.js": "/vendors/js/forms/cleave/addons/cleave-phone.de.js?id=18984a2a26bd9579522e",
    "/vendors/js/forms/cleave/addons/cleave-phone.dj.js": "/vendors/js/forms/cleave/addons/cleave-phone.dj.js?id=3b87b4fb8c596a16b0d5",
    "/vendors/js/forms/cleave/addons/cleave-phone.dk.js": "/vendors/js/forms/cleave/addons/cleave-phone.dk.js?id=b03f243429665f8299af",
    "/vendors/js/forms/cleave/addons/cleave-phone.dm.js": "/vendors/js/forms/cleave/addons/cleave-phone.dm.js?id=c5016eec3b9237ab81e7",
    "/vendors/js/forms/cleave/addons/cleave-phone.do.js": "/vendors/js/forms/cleave/addons/cleave-phone.do.js?id=c5016eec3b9237ab81e7",
    "/vendors/js/forms/cleave/addons/cleave-phone.dz.js": "/vendors/js/forms/cleave/addons/cleave-phone.dz.js?id=ffa7a74e432163bbc72a",
    "/vendors/js/forms/cleave/addons/cleave-phone.ec.js": "/vendors/js/forms/cleave/addons/cleave-phone.ec.js?id=a8bb93e8872509d11984",
    "/vendors/js/forms/cleave/addons/cleave-phone.ee.js": "/vendors/js/forms/cleave/addons/cleave-phone.ee.js?id=41e6b1f125377a0dc84b",
    "/vendors/js/forms/cleave/addons/cleave-phone.eg.js": "/vendors/js/forms/cleave/addons/cleave-phone.eg.js?id=ba29468d95671a95b13f",
    "/vendors/js/forms/cleave/addons/cleave-phone.eh.js": "/vendors/js/forms/cleave/addons/cleave-phone.eh.js?id=848f9339849fd412c2af",
    "/vendors/js/forms/cleave/addons/cleave-phone.er.js": "/vendors/js/forms/cleave/addons/cleave-phone.er.js?id=664aee5df90cc152ee38",
    "/vendors/js/forms/cleave/addons/cleave-phone.es.js": "/vendors/js/forms/cleave/addons/cleave-phone.es.js?id=554e5631aae89e40f8c1",
    "/vendors/js/forms/cleave/addons/cleave-phone.et.js": "/vendors/js/forms/cleave/addons/cleave-phone.et.js?id=35dba9588c90bef90965",
    "/vendors/js/forms/cleave/addons/cleave-phone.fi.js": "/vendors/js/forms/cleave/addons/cleave-phone.fi.js?id=a93bb3eb63121722e11c",
    "/vendors/js/forms/cleave/addons/cleave-phone.fj.js": "/vendors/js/forms/cleave/addons/cleave-phone.fj.js?id=685c5d406ad59799a7ed",
    "/vendors/js/forms/cleave/addons/cleave-phone.fk.js": "/vendors/js/forms/cleave/addons/cleave-phone.fk.js?id=4ec8b825dd0c034daee0",
    "/vendors/js/forms/cleave/addons/cleave-phone.fm.js": "/vendors/js/forms/cleave/addons/cleave-phone.fm.js?id=7078d5f098da6f88ce8e",
    "/vendors/js/forms/cleave/addons/cleave-phone.fo.js": "/vendors/js/forms/cleave/addons/cleave-phone.fo.js?id=915f2d5942f5b2a3a668",
    "/vendors/js/forms/cleave/addons/cleave-phone.fr.js": "/vendors/js/forms/cleave/addons/cleave-phone.fr.js?id=03ad71a0411b2b53f3a0",
    "/vendors/js/forms/cleave/addons/cleave-phone.ga.js": "/vendors/js/forms/cleave/addons/cleave-phone.ga.js?id=daa51aec657d6e97ea4a",
    "/vendors/js/forms/cleave/addons/cleave-phone.gb.js": "/vendors/js/forms/cleave/addons/cleave-phone.gb.js?id=3820a822391b07e2c764",
    "/vendors/js/forms/cleave/addons/cleave-phone.gd.js": "/vendors/js/forms/cleave/addons/cleave-phone.gd.js?id=c5016eec3b9237ab81e7",
    "/vendors/js/forms/cleave/addons/cleave-phone.ge.js": "/vendors/js/forms/cleave/addons/cleave-phone.ge.js?id=2999e0fe8291150f561a",
    "/vendors/js/forms/cleave/addons/cleave-phone.gf.js": "/vendors/js/forms/cleave/addons/cleave-phone.gf.js?id=2e63d170c73096832853",
    "/vendors/js/forms/cleave/addons/cleave-phone.gg.js": "/vendors/js/forms/cleave/addons/cleave-phone.gg.js?id=3820a822391b07e2c764",
    "/vendors/js/forms/cleave/addons/cleave-phone.gh.js": "/vendors/js/forms/cleave/addons/cleave-phone.gh.js?id=327ff14a371f302a300c",
    "/vendors/js/forms/cleave/addons/cleave-phone.gi.js": "/vendors/js/forms/cleave/addons/cleave-phone.gi.js?id=6a39e55bc0d7483c2131",
    "/vendors/js/forms/cleave/addons/cleave-phone.gl.js": "/vendors/js/forms/cleave/addons/cleave-phone.gl.js?id=6d566c6e31abba0de1b1",
    "/vendors/js/forms/cleave/addons/cleave-phone.gm.js": "/vendors/js/forms/cleave/addons/cleave-phone.gm.js?id=5e341789eeb65d9eaa23",
    "/vendors/js/forms/cleave/addons/cleave-phone.gn.js": "/vendors/js/forms/cleave/addons/cleave-phone.gn.js?id=96eef8293d58eb88d7e1",
    "/vendors/js/forms/cleave/addons/cleave-phone.gp.js": "/vendors/js/forms/cleave/addons/cleave-phone.gp.js?id=62e0cca91d13f3ae4186",
    "/vendors/js/forms/cleave/addons/cleave-phone.gq.js": "/vendors/js/forms/cleave/addons/cleave-phone.gq.js?id=ce7111be272dbc3d62e1",
    "/vendors/js/forms/cleave/addons/cleave-phone.gr.js": "/vendors/js/forms/cleave/addons/cleave-phone.gr.js?id=48775fa1b7eba91f391d",
    "/vendors/js/forms/cleave/addons/cleave-phone.gt.js": "/vendors/js/forms/cleave/addons/cleave-phone.gt.js?id=6391c727d048f2e4cb37",
    "/vendors/js/forms/cleave/addons/cleave-phone.gu.js": "/vendors/js/forms/cleave/addons/cleave-phone.gu.js?id=c5016eec3b9237ab81e7",
    "/vendors/js/forms/cleave/addons/cleave-phone.gw.js": "/vendors/js/forms/cleave/addons/cleave-phone.gw.js?id=6ecfdc09c593cb728a3d",
    "/vendors/js/forms/cleave/addons/cleave-phone.gy.js": "/vendors/js/forms/cleave/addons/cleave-phone.gy.js?id=a0e1fce13dd521e20dcd",
    "/vendors/js/forms/cleave/addons/cleave-phone.hk.js": "/vendors/js/forms/cleave/addons/cleave-phone.hk.js?id=29f97d8e492c0d827ba7",
    "/vendors/js/forms/cleave/addons/cleave-phone.hn.js": "/vendors/js/forms/cleave/addons/cleave-phone.hn.js?id=9d0b6c053851c586751e",
    "/vendors/js/forms/cleave/addons/cleave-phone.hr.js": "/vendors/js/forms/cleave/addons/cleave-phone.hr.js?id=f8774d600eb75e8e438c",
    "/vendors/js/forms/cleave/addons/cleave-phone.ht.js": "/vendors/js/forms/cleave/addons/cleave-phone.ht.js?id=be9d768fed30c4981d27",
    "/vendors/js/forms/cleave/addons/cleave-phone.hu.js": "/vendors/js/forms/cleave/addons/cleave-phone.hu.js?id=1f35cc5c75bd1e156c4c",
    "/vendors/js/forms/cleave/addons/cleave-phone.i18n.js": "/vendors/js/forms/cleave/addons/cleave-phone.i18n.js?id=ff06601b4237ea9e1e4d",
    "/vendors/js/forms/cleave/addons/cleave-phone.id.js": "/vendors/js/forms/cleave/addons/cleave-phone.id.js?id=ec3b4aa1c860ab2ac9fc",
    "/vendors/js/forms/cleave/addons/cleave-phone.ie.js": "/vendors/js/forms/cleave/addons/cleave-phone.ie.js?id=f4b593100487907ae841",
    "/vendors/js/forms/cleave/addons/cleave-phone.il.js": "/vendors/js/forms/cleave/addons/cleave-phone.il.js?id=e82c4da52d4bddb6dfd1",
    "/vendors/js/forms/cleave/addons/cleave-phone.im.js": "/vendors/js/forms/cleave/addons/cleave-phone.im.js?id=3820a822391b07e2c764",
    "/vendors/js/forms/cleave/addons/cleave-phone.in.js": "/vendors/js/forms/cleave/addons/cleave-phone.in.js?id=da699151ee0d1639605e",
    "/vendors/js/forms/cleave/addons/cleave-phone.io.js": "/vendors/js/forms/cleave/addons/cleave-phone.io.js?id=cd2f69ce187930e7358d",
    "/vendors/js/forms/cleave/addons/cleave-phone.iq.js": "/vendors/js/forms/cleave/addons/cleave-phone.iq.js?id=41be079dfaf9fe8accc1",
    "/vendors/js/forms/cleave/addons/cleave-phone.ir.js": "/vendors/js/forms/cleave/addons/cleave-phone.ir.js?id=d5118b5a646ee7b2bf38",
    "/vendors/js/forms/cleave/addons/cleave-phone.is.js": "/vendors/js/forms/cleave/addons/cleave-phone.is.js?id=1ff290492cda889f5717",
    "/vendors/js/forms/cleave/addons/cleave-phone.it.js": "/vendors/js/forms/cleave/addons/cleave-phone.it.js?id=57e58b29d7eed06c83c6",
    "/vendors/js/forms/cleave/addons/cleave-phone.je.js": "/vendors/js/forms/cleave/addons/cleave-phone.je.js?id=3820a822391b07e2c764",
    "/vendors/js/forms/cleave/addons/cleave-phone.jm.js": "/vendors/js/forms/cleave/addons/cleave-phone.jm.js?id=c5016eec3b9237ab81e7",
    "/vendors/js/forms/cleave/addons/cleave-phone.jo.js": "/vendors/js/forms/cleave/addons/cleave-phone.jo.js?id=38c605e6bd94c3944fa8",
    "/vendors/js/forms/cleave/addons/cleave-phone.jp.js": "/vendors/js/forms/cleave/addons/cleave-phone.jp.js?id=26b47b4012ee44d6e4ab",
    "/vendors/js/forms/cleave/addons/cleave-phone.ke.js": "/vendors/js/forms/cleave/addons/cleave-phone.ke.js?id=6e1d0c47dc44a60fd9f1",
    "/vendors/js/forms/cleave/addons/cleave-phone.kg.js": "/vendors/js/forms/cleave/addons/cleave-phone.kg.js?id=63779ca66253e908a6e6",
    "/vendors/js/forms/cleave/addons/cleave-phone.kh.js": "/vendors/js/forms/cleave/addons/cleave-phone.kh.js?id=74c5ac9ae4d8081520d2",
    "/vendors/js/forms/cleave/addons/cleave-phone.ki.js": "/vendors/js/forms/cleave/addons/cleave-phone.ki.js?id=bc2e997206ed245c91dc",
    "/vendors/js/forms/cleave/addons/cleave-phone.km.js": "/vendors/js/forms/cleave/addons/cleave-phone.km.js?id=8e20d7d45535d5aad8b7",
    "/vendors/js/forms/cleave/addons/cleave-phone.kn.js": "/vendors/js/forms/cleave/addons/cleave-phone.kn.js?id=c5016eec3b9237ab81e7",
    "/vendors/js/forms/cleave/addons/cleave-phone.kp.js": "/vendors/js/forms/cleave/addons/cleave-phone.kp.js?id=ddff2885c16ebafdd8f2",
    "/vendors/js/forms/cleave/addons/cleave-phone.kr.js": "/vendors/js/forms/cleave/addons/cleave-phone.kr.js?id=6c73d54b3021b4c0a119",
    "/vendors/js/forms/cleave/addons/cleave-phone.kw.js": "/vendors/js/forms/cleave/addons/cleave-phone.kw.js?id=4667a0a891b581644f8c",
    "/vendors/js/forms/cleave/addons/cleave-phone.ky.js": "/vendors/js/forms/cleave/addons/cleave-phone.ky.js?id=c5016eec3b9237ab81e7",
    "/vendors/js/forms/cleave/addons/cleave-phone.kz.js": "/vendors/js/forms/cleave/addons/cleave-phone.kz.js?id=fa497534b11c8057c6b0",
    "/vendors/js/forms/cleave/addons/cleave-phone.la.js": "/vendors/js/forms/cleave/addons/cleave-phone.la.js?id=ffe759e57002b6d7e4b6",
    "/vendors/js/forms/cleave/addons/cleave-phone.lb.js": "/vendors/js/forms/cleave/addons/cleave-phone.lb.js?id=89d43a5ddb10e6660341",
    "/vendors/js/forms/cleave/addons/cleave-phone.lc.js": "/vendors/js/forms/cleave/addons/cleave-phone.lc.js?id=c5016eec3b9237ab81e7",
    "/vendors/js/forms/cleave/addons/cleave-phone.li.js": "/vendors/js/forms/cleave/addons/cleave-phone.li.js?id=67fee755751adc132155",
    "/vendors/js/forms/cleave/addons/cleave-phone.lk.js": "/vendors/js/forms/cleave/addons/cleave-phone.lk.js?id=d9b3031f80ad1e9f20a5",
    "/vendors/js/forms/cleave/addons/cleave-phone.lr.js": "/vendors/js/forms/cleave/addons/cleave-phone.lr.js?id=02f68d1bc97bfcb1099a",
    "/vendors/js/forms/cleave/addons/cleave-phone.ls.js": "/vendors/js/forms/cleave/addons/cleave-phone.ls.js?id=bfcff513face72819450",
    "/vendors/js/forms/cleave/addons/cleave-phone.lt.js": "/vendors/js/forms/cleave/addons/cleave-phone.lt.js?id=e02d407e4fbefe1b58c8",
    "/vendors/js/forms/cleave/addons/cleave-phone.lu.js": "/vendors/js/forms/cleave/addons/cleave-phone.lu.js?id=0fd99082907ca8dacccf",
    "/vendors/js/forms/cleave/addons/cleave-phone.lv.js": "/vendors/js/forms/cleave/addons/cleave-phone.lv.js?id=42b7cd3bda04b355b3ed",
    "/vendors/js/forms/cleave/addons/cleave-phone.ly.js": "/vendors/js/forms/cleave/addons/cleave-phone.ly.js?id=e2723dff3768b0c22d8c",
    "/vendors/js/forms/cleave/addons/cleave-phone.ma.js": "/vendors/js/forms/cleave/addons/cleave-phone.ma.js?id=848f9339849fd412c2af",
    "/vendors/js/forms/cleave/addons/cleave-phone.mc.js": "/vendors/js/forms/cleave/addons/cleave-phone.mc.js?id=4c9aac226359053e77b5",
    "/vendors/js/forms/cleave/addons/cleave-phone.md.js": "/vendors/js/forms/cleave/addons/cleave-phone.md.js?id=6ca89dbf16036785c4b6",
    "/vendors/js/forms/cleave/addons/cleave-phone.me.js": "/vendors/js/forms/cleave/addons/cleave-phone.me.js?id=e2d25654dbd645fe0f4c",
    "/vendors/js/forms/cleave/addons/cleave-phone.mf.js": "/vendors/js/forms/cleave/addons/cleave-phone.mf.js?id=62e0cca91d13f3ae4186",
    "/vendors/js/forms/cleave/addons/cleave-phone.mg.js": "/vendors/js/forms/cleave/addons/cleave-phone.mg.js?id=56e7845ffc92706f934a",
    "/vendors/js/forms/cleave/addons/cleave-phone.mh.js": "/vendors/js/forms/cleave/addons/cleave-phone.mh.js?id=755a36ae569595200d18",
    "/vendors/js/forms/cleave/addons/cleave-phone.mk.js": "/vendors/js/forms/cleave/addons/cleave-phone.mk.js?id=6e0638fe772436b2e931",
    "/vendors/js/forms/cleave/addons/cleave-phone.ml.js": "/vendors/js/forms/cleave/addons/cleave-phone.ml.js?id=a0cd61d0698846da85b5",
    "/vendors/js/forms/cleave/addons/cleave-phone.mm.js": "/vendors/js/forms/cleave/addons/cleave-phone.mm.js?id=55f36b6453cb66c8daf7",
    "/vendors/js/forms/cleave/addons/cleave-phone.mn.js": "/vendors/js/forms/cleave/addons/cleave-phone.mn.js?id=472eb276e606065eadf0",
    "/vendors/js/forms/cleave/addons/cleave-phone.mo.js": "/vendors/js/forms/cleave/addons/cleave-phone.mo.js?id=b87bad43b9b196f98313",
    "/vendors/js/forms/cleave/addons/cleave-phone.mp.js": "/vendors/js/forms/cleave/addons/cleave-phone.mp.js?id=c5016eec3b9237ab81e7",
    "/vendors/js/forms/cleave/addons/cleave-phone.mq.js": "/vendors/js/forms/cleave/addons/cleave-phone.mq.js?id=6d9f1fc1d8199b71980b",
    "/vendors/js/forms/cleave/addons/cleave-phone.mr.js": "/vendors/js/forms/cleave/addons/cleave-phone.mr.js?id=99445cb44482e99b8e50",
    "/vendors/js/forms/cleave/addons/cleave-phone.ms.js": "/vendors/js/forms/cleave/addons/cleave-phone.ms.js?id=c5016eec3b9237ab81e7",
    "/vendors/js/forms/cleave/addons/cleave-phone.mt.js": "/vendors/js/forms/cleave/addons/cleave-phone.mt.js?id=945884a0ded7027f8f21",
    "/vendors/js/forms/cleave/addons/cleave-phone.mu.js": "/vendors/js/forms/cleave/addons/cleave-phone.mu.js?id=4c2317397f1ca0fc89eb",
    "/vendors/js/forms/cleave/addons/cleave-phone.mv.js": "/vendors/js/forms/cleave/addons/cleave-phone.mv.js?id=56ae2229ec9844522967",
    "/vendors/js/forms/cleave/addons/cleave-phone.mw.js": "/vendors/js/forms/cleave/addons/cleave-phone.mw.js?id=f34934e7f8fda0085601",
    "/vendors/js/forms/cleave/addons/cleave-phone.mx.js": "/vendors/js/forms/cleave/addons/cleave-phone.mx.js?id=73c9d3e0e1c4121c0ab5",
    "/vendors/js/forms/cleave/addons/cleave-phone.my.js": "/vendors/js/forms/cleave/addons/cleave-phone.my.js?id=95ce1cf9aae0c08861b9",
    "/vendors/js/forms/cleave/addons/cleave-phone.mz.js": "/vendors/js/forms/cleave/addons/cleave-phone.mz.js?id=fac6e6c5818981805dc4",
    "/vendors/js/forms/cleave/addons/cleave-phone.na.js": "/vendors/js/forms/cleave/addons/cleave-phone.na.js?id=3360c821b22ba61c582d",
    "/vendors/js/forms/cleave/addons/cleave-phone.nc.js": "/vendors/js/forms/cleave/addons/cleave-phone.nc.js?id=07184986b1a21c929d16",
    "/vendors/js/forms/cleave/addons/cleave-phone.ne.js": "/vendors/js/forms/cleave/addons/cleave-phone.ne.js?id=916117ae4f93cc14c70d",
    "/vendors/js/forms/cleave/addons/cleave-phone.nf.js": "/vendors/js/forms/cleave/addons/cleave-phone.nf.js?id=6f3f76a711dd8b7e7fee",
    "/vendors/js/forms/cleave/addons/cleave-phone.ng.js": "/vendors/js/forms/cleave/addons/cleave-phone.ng.js?id=52dde6301847277d0463",
    "/vendors/js/forms/cleave/addons/cleave-phone.ni.js": "/vendors/js/forms/cleave/addons/cleave-phone.ni.js?id=b72b10440be6b510a7d7",
    "/vendors/js/forms/cleave/addons/cleave-phone.nl.js": "/vendors/js/forms/cleave/addons/cleave-phone.nl.js?id=2aaf86cd1c61384dd3b3",
    "/vendors/js/forms/cleave/addons/cleave-phone.no.js": "/vendors/js/forms/cleave/addons/cleave-phone.no.js?id=15a457e1ec75a7b809dd",
    "/vendors/js/forms/cleave/addons/cleave-phone.np.js": "/vendors/js/forms/cleave/addons/cleave-phone.np.js?id=0a153ec97eff822444d2",
    "/vendors/js/forms/cleave/addons/cleave-phone.nr.js": "/vendors/js/forms/cleave/addons/cleave-phone.nr.js?id=268d28cebefc7bc7b18d",
    "/vendors/js/forms/cleave/addons/cleave-phone.nu.js": "/vendors/js/forms/cleave/addons/cleave-phone.nu.js?id=a69708547c836699c30d",
    "/vendors/js/forms/cleave/addons/cleave-phone.nz.js": "/vendors/js/forms/cleave/addons/cleave-phone.nz.js?id=ce8f7e5bcc9ff59400eb",
    "/vendors/js/forms/cleave/addons/cleave-phone.om.js": "/vendors/js/forms/cleave/addons/cleave-phone.om.js?id=a24bf2f41208ba6fbdf6",
    "/vendors/js/forms/cleave/addons/cleave-phone.pa.js": "/vendors/js/forms/cleave/addons/cleave-phone.pa.js?id=bf06bb2763e9c4ef18f6",
    "/vendors/js/forms/cleave/addons/cleave-phone.pe.js": "/vendors/js/forms/cleave/addons/cleave-phone.pe.js?id=fe29d56831919a5e3e31",
    "/vendors/js/forms/cleave/addons/cleave-phone.pf.js": "/vendors/js/forms/cleave/addons/cleave-phone.pf.js?id=2b6c8de0f81f587cde80",
    "/vendors/js/forms/cleave/addons/cleave-phone.pg.js": "/vendors/js/forms/cleave/addons/cleave-phone.pg.js?id=193c2645ecb31b854236",
    "/vendors/js/forms/cleave/addons/cleave-phone.ph.js": "/vendors/js/forms/cleave/addons/cleave-phone.ph.js?id=dda2386d9d58bcdde91c",
    "/vendors/js/forms/cleave/addons/cleave-phone.pk.js": "/vendors/js/forms/cleave/addons/cleave-phone.pk.js?id=15a9216123a8f928af63",
    "/vendors/js/forms/cleave/addons/cleave-phone.pl.js": "/vendors/js/forms/cleave/addons/cleave-phone.pl.js?id=e3cd37fbd5e7854fbfa5",
    "/vendors/js/forms/cleave/addons/cleave-phone.pm.js": "/vendors/js/forms/cleave/addons/cleave-phone.pm.js?id=ee7879b320e0d59790aa",
    "/vendors/js/forms/cleave/addons/cleave-phone.pr.js": "/vendors/js/forms/cleave/addons/cleave-phone.pr.js?id=c5016eec3b9237ab81e7",
    "/vendors/js/forms/cleave/addons/cleave-phone.ps.js": "/vendors/js/forms/cleave/addons/cleave-phone.ps.js?id=8154db4562cf4ae7c120",
    "/vendors/js/forms/cleave/addons/cleave-phone.pt.js": "/vendors/js/forms/cleave/addons/cleave-phone.pt.js?id=f9b54027ce736a41f76b",
    "/vendors/js/forms/cleave/addons/cleave-phone.pw.js": "/vendors/js/forms/cleave/addons/cleave-phone.pw.js?id=47103e508c1608faa71d",
    "/vendors/js/forms/cleave/addons/cleave-phone.py.js": "/vendors/js/forms/cleave/addons/cleave-phone.py.js?id=e200d2e95fad2655484e",
    "/vendors/js/forms/cleave/addons/cleave-phone.qa.js": "/vendors/js/forms/cleave/addons/cleave-phone.qa.js?id=848170d33d4ee2fe93a0",
    "/vendors/js/forms/cleave/addons/cleave-phone.re.js": "/vendors/js/forms/cleave/addons/cleave-phone.re.js?id=e9084d8b1d8df2275ef8",
    "/vendors/js/forms/cleave/addons/cleave-phone.ro.js": "/vendors/js/forms/cleave/addons/cleave-phone.ro.js?id=101ec1abf315fb76997d",
    "/vendors/js/forms/cleave/addons/cleave-phone.rs.js": "/vendors/js/forms/cleave/addons/cleave-phone.rs.js?id=394c6c9a928f06b3f44f",
    "/vendors/js/forms/cleave/addons/cleave-phone.ru.js": "/vendors/js/forms/cleave/addons/cleave-phone.ru.js?id=fa497534b11c8057c6b0",
    "/vendors/js/forms/cleave/addons/cleave-phone.rw.js": "/vendors/js/forms/cleave/addons/cleave-phone.rw.js?id=61959fb8b02c0830055b",
    "/vendors/js/forms/cleave/addons/cleave-phone.sa.js": "/vendors/js/forms/cleave/addons/cleave-phone.sa.js?id=1fc9cef0eb1a8894ca13",
    "/vendors/js/forms/cleave/addons/cleave-phone.sb.js": "/vendors/js/forms/cleave/addons/cleave-phone.sb.js?id=77fd42bae194ae05fcf5",
    "/vendors/js/forms/cleave/addons/cleave-phone.sc.js": "/vendors/js/forms/cleave/addons/cleave-phone.sc.js?id=eba05889d1fc664e3b61",
    "/vendors/js/forms/cleave/addons/cleave-phone.sd.js": "/vendors/js/forms/cleave/addons/cleave-phone.sd.js?id=4ab0f90ba6c15d048f3b",
    "/vendors/js/forms/cleave/addons/cleave-phone.se.js": "/vendors/js/forms/cleave/addons/cleave-phone.se.js?id=c0ed51173496c8951161",
    "/vendors/js/forms/cleave/addons/cleave-phone.sg.js": "/vendors/js/forms/cleave/addons/cleave-phone.sg.js?id=3b1a7216f31cff8b2966",
    "/vendors/js/forms/cleave/addons/cleave-phone.sh.js": "/vendors/js/forms/cleave/addons/cleave-phone.sh.js?id=356ba8fdc9c171964a2b",
    "/vendors/js/forms/cleave/addons/cleave-phone.si.js": "/vendors/js/forms/cleave/addons/cleave-phone.si.js?id=ffeebfe4b3d574fa75be",
    "/vendors/js/forms/cleave/addons/cleave-phone.sj.js": "/vendors/js/forms/cleave/addons/cleave-phone.sj.js?id=15a457e1ec75a7b809dd",
    "/vendors/js/forms/cleave/addons/cleave-phone.sk.js": "/vendors/js/forms/cleave/addons/cleave-phone.sk.js?id=8e4e50b59762b7940136",
    "/vendors/js/forms/cleave/addons/cleave-phone.sl.js": "/vendors/js/forms/cleave/addons/cleave-phone.sl.js?id=534943be2f9d35f6b3d5",
    "/vendors/js/forms/cleave/addons/cleave-phone.sm.js": "/vendors/js/forms/cleave/addons/cleave-phone.sm.js?id=2b43558aa6505e6db624",
    "/vendors/js/forms/cleave/addons/cleave-phone.sn.js": "/vendors/js/forms/cleave/addons/cleave-phone.sn.js?id=f8f3bfb763b187dba866",
    "/vendors/js/forms/cleave/addons/cleave-phone.so.js": "/vendors/js/forms/cleave/addons/cleave-phone.so.js?id=3c305b9b925a0d06d1f3",
    "/vendors/js/forms/cleave/addons/cleave-phone.sr.js": "/vendors/js/forms/cleave/addons/cleave-phone.sr.js?id=f3f609fe307c5fc116c6",
    "/vendors/js/forms/cleave/addons/cleave-phone.ss.js": "/vendors/js/forms/cleave/addons/cleave-phone.ss.js?id=bda00682df733cdd9f4a",
    "/vendors/js/forms/cleave/addons/cleave-phone.st.js": "/vendors/js/forms/cleave/addons/cleave-phone.st.js?id=66f002831b8217e96302",
    "/vendors/js/forms/cleave/addons/cleave-phone.sv.js": "/vendors/js/forms/cleave/addons/cleave-phone.sv.js?id=9059148efb295922161a",
    "/vendors/js/forms/cleave/addons/cleave-phone.sx.js": "/vendors/js/forms/cleave/addons/cleave-phone.sx.js?id=c5016eec3b9237ab81e7",
    "/vendors/js/forms/cleave/addons/cleave-phone.sy.js": "/vendors/js/forms/cleave/addons/cleave-phone.sy.js?id=161bf181d1ec18a089c9",
    "/vendors/js/forms/cleave/addons/cleave-phone.sz.js": "/vendors/js/forms/cleave/addons/cleave-phone.sz.js?id=ddbd508dea625d1c3194",
    "/vendors/js/forms/cleave/addons/cleave-phone.ta.js": "/vendors/js/forms/cleave/addons/cleave-phone.ta.js?id=356ba8fdc9c171964a2b",
    "/vendors/js/forms/cleave/addons/cleave-phone.tc.js": "/vendors/js/forms/cleave/addons/cleave-phone.tc.js?id=c5016eec3b9237ab81e7",
    "/vendors/js/forms/cleave/addons/cleave-phone.td.js": "/vendors/js/forms/cleave/addons/cleave-phone.td.js?id=21f8fcc7022eb440eb67",
    "/vendors/js/forms/cleave/addons/cleave-phone.tg.js": "/vendors/js/forms/cleave/addons/cleave-phone.tg.js?id=a5e24ff026b1f473390f",
    "/vendors/js/forms/cleave/addons/cleave-phone.th.js": "/vendors/js/forms/cleave/addons/cleave-phone.th.js?id=5b8501fc2b163c2d8cad",
    "/vendors/js/forms/cleave/addons/cleave-phone.tj.js": "/vendors/js/forms/cleave/addons/cleave-phone.tj.js?id=306062c673418c23db16",
    "/vendors/js/forms/cleave/addons/cleave-phone.tk.js": "/vendors/js/forms/cleave/addons/cleave-phone.tk.js?id=9c637208ee491f408bd4",
    "/vendors/js/forms/cleave/addons/cleave-phone.tl.js": "/vendors/js/forms/cleave/addons/cleave-phone.tl.js?id=e2383d3f3fa1cae69186",
    "/vendors/js/forms/cleave/addons/cleave-phone.tm.js": "/vendors/js/forms/cleave/addons/cleave-phone.tm.js?id=16e1323ccca9fba43a52",
    "/vendors/js/forms/cleave/addons/cleave-phone.tn.js": "/vendors/js/forms/cleave/addons/cleave-phone.tn.js?id=ab4876317379032b712d",
    "/vendors/js/forms/cleave/addons/cleave-phone.to.js": "/vendors/js/forms/cleave/addons/cleave-phone.to.js?id=5f13b9f3d6f6265f16bd",
    "/vendors/js/forms/cleave/addons/cleave-phone.tr.js": "/vendors/js/forms/cleave/addons/cleave-phone.tr.js?id=a38f164eff34278b3126",
    "/vendors/js/forms/cleave/addons/cleave-phone.tt.js": "/vendors/js/forms/cleave/addons/cleave-phone.tt.js?id=c5016eec3b9237ab81e7",
    "/vendors/js/forms/cleave/addons/cleave-phone.tv.js": "/vendors/js/forms/cleave/addons/cleave-phone.tv.js?id=b883f4bfbf7af93572e4",
    "/vendors/js/forms/cleave/addons/cleave-phone.tw.js": "/vendors/js/forms/cleave/addons/cleave-phone.tw.js?id=74b296c72896334b2436",
    "/vendors/js/forms/cleave/addons/cleave-phone.tz.js": "/vendors/js/forms/cleave/addons/cleave-phone.tz.js?id=7cf72638959c32b16dd6",
    "/vendors/js/forms/cleave/addons/cleave-phone.ua.js": "/vendors/js/forms/cleave/addons/cleave-phone.ua.js?id=bde844dd3e94ed2bffcf",
    "/vendors/js/forms/cleave/addons/cleave-phone.ug.js": "/vendors/js/forms/cleave/addons/cleave-phone.ug.js?id=bf9e3d3bdceaf20a6d9b",
    "/vendors/js/forms/cleave/addons/cleave-phone.us.js": "/vendors/js/forms/cleave/addons/cleave-phone.us.js?id=c5016eec3b9237ab81e7",
    "/vendors/js/forms/cleave/addons/cleave-phone.uy.js": "/vendors/js/forms/cleave/addons/cleave-phone.uy.js?id=b55011d9c83ea3b34b1d",
    "/vendors/js/forms/cleave/addons/cleave-phone.uz.js": "/vendors/js/forms/cleave/addons/cleave-phone.uz.js?id=e04c60fc9d1d2a41e49b",
    "/vendors/js/forms/cleave/addons/cleave-phone.va.js": "/vendors/js/forms/cleave/addons/cleave-phone.va.js?id=57e58b29d7eed06c83c6",
    "/vendors/js/forms/cleave/addons/cleave-phone.vc.js": "/vendors/js/forms/cleave/addons/cleave-phone.vc.js?id=c5016eec3b9237ab81e7",
    "/vendors/js/forms/cleave/addons/cleave-phone.ve.js": "/vendors/js/forms/cleave/addons/cleave-phone.ve.js?id=7c44f2aa02b57a95bbe9",
    "/vendors/js/forms/cleave/addons/cleave-phone.vg.js": "/vendors/js/forms/cleave/addons/cleave-phone.vg.js?id=c5016eec3b9237ab81e7",
    "/vendors/js/forms/cleave/addons/cleave-phone.vi.js": "/vendors/js/forms/cleave/addons/cleave-phone.vi.js?id=c5016eec3b9237ab81e7",
    "/vendors/js/forms/cleave/addons/cleave-phone.vn.js": "/vendors/js/forms/cleave/addons/cleave-phone.vn.js?id=29e32dace95130d856ba",
    "/vendors/js/forms/cleave/addons/cleave-phone.vu.js": "/vendors/js/forms/cleave/addons/cleave-phone.vu.js?id=d06abc874cf5d4af0bd7",
    "/vendors/js/forms/cleave/addons/cleave-phone.wf.js": "/vendors/js/forms/cleave/addons/cleave-phone.wf.js?id=404b3c236d91adf1cbe4",
    "/vendors/js/forms/cleave/addons/cleave-phone.ws.js": "/vendors/js/forms/cleave/addons/cleave-phone.ws.js?id=a2c875f13e44416d6ad7",
    "/vendors/js/forms/cleave/addons/cleave-phone.xk.js": "/vendors/js/forms/cleave/addons/cleave-phone.xk.js?id=edfb1157c33165981378",
    "/vendors/js/forms/cleave/addons/cleave-phone.ye.js": "/vendors/js/forms/cleave/addons/cleave-phone.ye.js?id=7f68887e13f95119ed85",
    "/vendors/js/forms/cleave/addons/cleave-phone.yt.js": "/vendors/js/forms/cleave/addons/cleave-phone.yt.js?id=e9084d8b1d8df2275ef8",
    "/vendors/js/forms/cleave/addons/cleave-phone.za.js": "/vendors/js/forms/cleave/addons/cleave-phone.za.js?id=6157ad1879d5d55016dc",
    "/vendors/js/forms/cleave/addons/cleave-phone.zm.js": "/vendors/js/forms/cleave/addons/cleave-phone.zm.js?id=8a99d8c96d4811f0c6f9",
    "/vendors/js/forms/cleave/addons/cleave-phone.zw.js": "/vendors/js/forms/cleave/addons/cleave-phone.zw.js?id=623e55da645af4921073",
    "/vendors/js/forms/cleave/cleave.min.js": "/vendors/js/forms/cleave/cleave.min.js?id=923e78a054c9c4d56c99",
    "/vendors/js/forms/extended/maxlength/bootstrap-maxlength.js": "/vendors/js/forms/extended/maxlength/bootstrap-maxlength.js?id=413ef9bb71f508be3a66",
    "/vendors/js/forms/extended/typeahead/bloodhound.min.js": "/vendors/js/forms/extended/typeahead/bloodhound.min.js?id=8c29d1c00a6eafd32e76",
    "/vendors/js/forms/extended/typeahead/handlebars.js": "/vendors/js/forms/extended/typeahead/handlebars.js?id=f8f6c4173d79cbcbeb7e",
    "/vendors/js/forms/extended/typeahead/typeahead.bundle.min.js": "/vendors/js/forms/extended/typeahead/typeahead.bundle.min.js?id=cc8f408384805d4c997b",
    "/vendors/js/forms/repeater/jquery.repeater.min.js": "/vendors/js/forms/repeater/jquery.repeater.min.js?id=422a9663b1a9c0ff6e34",
    "/vendors/js/forms/select/select2.full.min.js": "/vendors/js/forms/select/select2.full.min.js?id=c28f3322ee526ec1325d",
    "/vendors/js/forms/spinner/jquery.bootstrap-touchspin.js": "/vendors/js/forms/spinner/jquery.bootstrap-touchspin.js?id=1e6255e2d52469c5cc66",
    "/vendors/js/forms/toggle/switchery.js": "/vendors/js/forms/toggle/switchery.js?id=41e10932c227029c0db9",
    "/vendors/js/forms/toggle/switchery.min.js": "/vendors/js/forms/toggle/switchery.min.js?id=21a250f2616216d7fe50",
    "/vendors/js/forms/validation/jquery.validate.min.js": "/vendors/js/forms/validation/jquery.validate.min.js?id=aad785d450d475b0fd63",
    "/vendors/js/forms/wizard/bs-stepper.min.js": "/vendors/js/forms/wizard/bs-stepper.min.js?id=a814c7762645691761b3",
    "/vendors/js/hammer/hammer.min.js": "/vendors/js/hammer/hammer.min.js?id=dd16fba4974cfe81d907",
    "/vendors/js/internationalization/i18n-jquery.min.js": "/vendors/js/internationalization/i18n-jquery.min.js?id=f6a2358a39d19823ded9",
    "/vendors/js/internationalization/i18n-xhr.min.js": "/vendors/js/internationalization/i18n-xhr.min.js?id=6721395373fd223cd6df",
    "/vendors/js/internationalization/i18n.min.js": "/vendors/js/internationalization/i18n.min.js?id=f0b1b507d75753240191",
    "/vendors/js/internationalization/lang-detector.min.js": "/vendors/js/internationalization/lang-detector.min.js?id=3283c362c32dbe5be38e",
    "/vendors/js/jkanban/jkanban.min.js": "/vendors/js/jkanban/jkanban.min.js?id=27bc75953f6ccc5187f2",
    "/vendors/js/jquery/jquery.min.js": "/vendors/js/jquery/jquery.min.js?id=dc5e7f18c8d36ac1d3d4",
    "/vendors/js/maps/leaflet.min.js": "/vendors/js/maps/leaflet.min.js?id=b101c63d873631d5efe2",
    "/vendors/js/miscellaneous/countdown.min.js": "/vendors/js/miscellaneous/countdown.min.js?id=ce221c252f8a6cb8d59d",
    "/vendors/js/pace/pace.min.js": "/vendors/js/pace/pace.min.js?id=0caca8d7580e8e3281f4",
    "/vendors/js/pagination/jquery.bootpag.min.js": "/vendors/js/pagination/jquery.bootpag.min.js?id=eb37df83790d9c18e06b",
    "/vendors/js/pagination/jquery.twbsPagination.min.js": "/vendors/js/pagination/jquery.twbsPagination.min.js?id=d912bf418aa5b6909f0f",
    "/vendors/js/perfectscrollbar/perfect-scrollbar.min.js": "/vendors/js/perfectscrollbar/perfect-scrollbar.min.js?id=62eaedb5b48174ba59a7",
    "/vendors/js/pickers/flatpickr/flatpickr.min.js": "/vendors/js/pickers/flatpickr/flatpickr.min.js?id=29174394b9cedb37bede",
    "/vendors/js/pickers/pickadate/legacy.js": "/vendors/js/pickers/pickadate/legacy.js?id=74c984bbc20e720270c8",
    "/vendors/js/pickers/pickadate/picker.date.js": "/vendors/js/pickers/pickadate/picker.date.js?id=08a48f6b09c072c6219c",
    "/vendors/js/pickers/pickadate/picker.js": "/vendors/js/pickers/pickadate/picker.js?id=991c6afc7bfd9c96b947",
    "/vendors/js/pickers/pickadate/picker.time.js": "/vendors/js/pickers/pickadate/picker.time.js?id=00e9692be5f23cb13aba",
    "/vendors/js/popper/popper.min.js": "/vendors/js/popper/popper.min.js?id=48510bfc098ab4ec9e9c",
    "/vendors/js/promises/promises.min.js": "/vendors/js/promises/promises.min.js?id=236599c77be081362c37",
    "/vendors/js/screenfull/screenfull.min.js": "/vendors/js/screenfull/screenfull.min.js?id=8b5a8694c96375ced260",
    "/vendors/js/tables/ag-grid/ag-grid-community.min.noStyle.js": "/vendors/js/tables/ag-grid/ag-grid-community.min.noStyle.js?id=65906e87666f574ef1ca",
    "/vendors/js/tables/datatable/buttons.bootstrap.min.js": "/vendors/js/tables/datatable/buttons.bootstrap.min.js?id=77c8d7c4b64bceb0251c",
    "/vendors/js/tables/datatable/buttons.bootstrap4.min.js": "/vendors/js/tables/datatable/buttons.bootstrap4.min.js?id=0f3fa2c53d7defb2c9cd",
    "/vendors/js/tables/datatable/buttons.html5.min.js": "/vendors/js/tables/datatable/buttons.html5.min.js?id=42f03ed7605a95411bd8",
    "/vendors/js/tables/datatable/buttons.print.min.js": "/vendors/js/tables/datatable/buttons.print.min.js?id=6545b810f684f84e00e5",
    "/vendors/js/tables/datatable/datatables.bootstrap4.min.js": "/vendors/js/tables/datatable/datatables.bootstrap4.min.js?id=c82998f18725ec31321a",
    "/vendors/js/tables/datatable/datatables.buttons.min.js": "/vendors/js/tables/datatable/datatables.buttons.min.js?id=2ec64e016ae2c9bf4f04",
    "/vendors/js/tables/datatable/datatables.checkboxes.min.js": "/vendors/js/tables/datatable/datatables.checkboxes.min.js?id=fbefb5342e6319df72b7",
    "/vendors/js/tables/datatable/datatables.min.js": "/vendors/js/tables/datatable/datatables.min.js?id=97fd6a774fc6211e7619",
    "/vendors/js/tables/datatable/dataTables.responsive.min.js": "/vendors/js/tables/datatable/dataTables.responsive.min.js?id=f1e4da1bc50993e34609",
    "/vendors/js/tables/datatable/dataTables.rowGroup.min.js": "/vendors/js/tables/datatable/dataTables.rowGroup.min.js?id=4087ca5c07ec5fb7cf56",
    "/vendors/js/tables/datatable/dataTables.select.min.js": "/vendors/js/tables/datatable/dataTables.select.min.js?id=e06c874532cc59e272dc",
    "/vendors/js/tables/datatable/jquery.dataTables.min.js": "/vendors/js/tables/datatable/jquery.dataTables.min.js?id=d7b7a9f7b2558c3e503f",
    "/vendors/js/tables/datatable/jszip.min.js": "/vendors/js/tables/datatable/jszip.min.js?id=88731e24340ce38647f6",
    "/vendors/js/tables/datatable/pdfmake.min.js": "/vendors/js/tables/datatable/pdfmake.min.js?id=ffa9a02736fe4a19a3a0",
    "/vendors/js/tables/datatable/responsive.bootstrap.min.js": "/vendors/js/tables/datatable/responsive.bootstrap.min.js?id=e64bb08090f483a067ea",
    "/vendors/js/tables/datatable/responsive.bootstrap4.js": "/vendors/js/tables/datatable/responsive.bootstrap4.js?id=1222ca8cc5309c099acd",
    "/vendors/js/tables/datatable/responsive.bootstrap4.min.js": "/vendors/js/tables/datatable/responsive.bootstrap4.min.js?id=dcbfe362e28206488597",
    "/vendors/js/tables/datatable/vfs_fonts.js": "/vendors/js/tables/datatable/vfs_fonts.js?id=795e143b8f4eeb5089b2",
    "/vendors/js/ui/affix.js": "/vendors/js/ui/affix.js?id=76d0f746d06d24675053",
    "/vendors/js/ui/blockUI.min.js": "/vendors/js/ui/blockUI.min.js?id=b129b6324a9a466ab62d",
    "/vendors/js/ui/jquery-sliding-menu.js": "/vendors/js/ui/jquery-sliding-menu.js?id=c92c55c67be28f2f3e83",
    "/vendors/js/ui/jquery.matchHeight-min.js": "/vendors/js/ui/jquery.matchHeight-min.js?id=18c617d1d125e6347677",
    "/vendors/js/ui/jquery.sticky-kit.min.js": "/vendors/js/ui/jquery.sticky-kit.min.js?id=71d0a960da3ff3ae0cc8",
    "/vendors/js/ui/jquery.sticky.js": "/vendors/js/ui/jquery.sticky.js?id=17f0788e54b9dc4eb93d",
    "/vendors/js/ui/popper.min.js": "/vendors/js/ui/popper.min.js?id=1022eaf388cc780bcfeb",
    "/vendors/js/ui/prism-treeview.js": "/vendors/js/ui/prism-treeview.js?id=90cb70f2d3d42443f2e2",
    "/vendors/js/ui/prism.min.js": "/vendors/js/ui/prism.min.js?id=fde910813cf7141eae50",
    "/vendors/js/ui/unison.min.js": "/vendors/js/ui/unison.min.js?id=bc362b7e0103b2974ad8",
    "/vendors/js/unison-js/unison-js.min.js": "/vendors/js/unison-js/unison-js.min.js?id=dd888b40754b71c65e48",
    "/vendors/js/vendors.min.js": "/vendors/js/vendors.min.js?id=1f96596f03ad2405e9a9",
    "/vendors/js/waves/waves.min.js": "/vendors/js/waves/waves.min.js?id=2d6cf98fc5a8f41c0940",
    "/vendors/css/animate/animate.css": "/vendors/css/animate/animate.css?id=91cc40989e5e96e8d6bd",
    "/vendors/css/animate/animate.min.css": "/vendors/css/animate/animate.min.css?id=c0be8e53226ac34833fd",
    "/vendors/css/calendars/extensions/daygrid.min.css": "/vendors/css/calendars/extensions/daygrid.min.css?id=78540241463dfd1abb9d",
    "/vendors/css/calendars/extensions/timegrid.min.css": "/vendors/css/calendars/extensions/timegrid.min.css?id=342bd33ebd195a6d0077",
    "/vendors/css/calendars/fullcalendar.min.css": "/vendors/css/calendars/fullcalendar.min.css?id=9aee4a21c59e0889f96f",
    "/vendors/css/calendars/fullcalendar.print.css": "/vendors/css/calendars/fullcalendar.print.css?id=1295377087f6d4af1436",
    "/vendors/css/charts/apexcharts.css": "/vendors/css/charts/apexcharts.css?id=3414033e38b96a20778e",
    "/vendors/css/documentation.css": "/vendors/css/documentation.css?id=667e6eaef259208f4bcf",
    "/vendors/css/editors/quill/katex.min.css": "/vendors/css/editors/quill/katex.min.css?id=ce42be907ab1f189636e",
    "/vendors/css/editors/quill/monokai-sublime.min.css": "/vendors/css/editors/quill/monokai-sublime.min.css?id=b4787837acf01460e08a",
    "/vendors/css/editors/quill/quill.bubble.css": "/vendors/css/editors/quill/quill.bubble.css?id=ac02a6b281c466336c8a",
    "/vendors/css/editors/quill/quill.snow.css": "/vendors/css/editors/quill/quill.snow.css?id=6cdfa53970e8d5256922",
    "/vendors/css/extensions/dataTables.checkboxes.css": "/vendors/css/extensions/dataTables.checkboxes.css?id=d2a2b3187b52afca7838",
    "/vendors/css/extensions/dragula.min.css": "/vendors/css/extensions/dragula.min.css?id=6a523b285cef54776543",
    "/vendors/css/extensions/jquery.contextMenu.min.css": "/vendors/css/extensions/jquery.contextMenu.min.css?id=0b8e6aa2758a542731f7",
    "/vendors/css/extensions/jquery.rateyo.min.css": "/vendors/css/extensions/jquery.rateyo.min.css?id=8e803e095f3457217036",
    "/vendors/css/extensions/jstree.min.css": "/vendors/css/extensions/jstree.min.css?id=779fc4b400d1748ec2fb",
    "/vendors/css/extensions/nouislider.min.css": "/vendors/css/extensions/nouislider.min.css?id=a90e8b1038df8efa9a1a",
    "/vendors/css/extensions/pace.css": "/vendors/css/extensions/pace.css?id=8a484df21b7346425c6c",
    "/vendors/css/extensions/plyr.min.css": "/vendors/css/extensions/plyr.min.css?id=53263754d3ae064edd2a",
    "/vendors/css/extensions/shepherd.min.css": "/vendors/css/extensions/shepherd.min.css?id=70c663b58b0c9d77baba",
    "/vendors/css/extensions/sweetalert2.min.css": "/vendors/css/extensions/sweetalert2.min.css?id=b3e029276e2b6d1fd28c",
    "/vendors/css/extensions/swiper.min.css": "/vendors/css/extensions/swiper.min.css?id=b421e5f45b61a60eaa66",
    "/vendors/css/extensions/tether-theme-arrows.css": "/vendors/css/extensions/tether-theme-arrows.css?id=2399fd15ec68bd930226",
    "/vendors/css/extensions/tether.min.css": "/vendors/css/extensions/tether.min.css?id=62155a3948cbf17b1bf4",
    "/vendors/css/extensions/toastr.min.css": "/vendors/css/extensions/toastr.min.css?id=f46a48664f1939d7e483",
    "/vendors/css/extensions/unslider.css": "/vendors/css/extensions/unslider.css?id=2fdb13cbb57c9b78ea14",
    "/vendors/css/feather-icons/feather-icons.min.css": "/vendors/css/feather-icons/feather-icons.min.css?id=4b56b01608b8bfed9aca",
    "/vendors/css/file-uploaders/dropzone.min.css": "/vendors/css/file-uploaders/dropzone.min.css?id=a7b0ef1d7c2016826a3e",
    "/vendors/css/flag-icons/flag-icons.min.css": "/vendors/css/flag-icons/flag-icons.min.css?id=f02d28a9a4321c466fd0",
    "/vendors/css/forms/select/select2.min.css": "/vendors/css/forms/select/select2.min.css?id=bc523f920a653b0baf7e",
    "/vendors/css/forms/spinner/jquery.bootstrap-touchspin.css": "/vendors/css/forms/spinner/jquery.bootstrap-touchspin.css?id=91821d189bba0790f9b2",
    "/vendors/css/forms/toggle/switchery.css": "/vendors/css/forms/toggle/switchery.css?id=319ffce6fbb071c20dfb",
    "/vendors/css/forms/toggle/switchery.min.css": "/vendors/css/forms/toggle/switchery.min.css?id=3d5c5f2d195cad6c3658",
    "/vendors/css/forms/wizard/bs-stepper.min.css": "/vendors/css/forms/wizard/bs-stepper.min.css?id=fa6f6cacb0c9a385890d",
    "/vendors/css/jkanban/jkanban.min.css": "/vendors/css/jkanban/jkanban.min.css?id=082fdcf068d7a751c2e7",
    "/vendors/css/maps/leaflet.min.css": "/vendors/css/maps/leaflet.min.css?id=a963020579806ce1d83c",
    "/vendors/css/modal/facebook.css": "/vendors/css/modal/facebook.css?id=b082ed795d20f6613967",
    "/vendors/css/modal/google.css": "/vendors/css/modal/google.css?id=5f1a2780c18be29e40e7",
    "/vendors/css/modal/twitter.css": "/vendors/css/modal/twitter.css?id=053ad41fc983ecc4ba95",
    "/vendors/css/pace/pace.min.css": "/vendors/css/pace/pace.min.css?id=d53b982ed6ec2199a025",
    "/vendors/css/perfect-scrollbar/perfect-scrollbar.min.css": "/vendors/css/perfect-scrollbar/perfect-scrollbar.min.css?id=473195c2edea25b4fae7",
    "/vendors/css/pickers/flatpickr/flatpickr.min.css": "/vendors/css/pickers/flatpickr/flatpickr.min.css?id=30f64a741bc93036f312",
    "/vendors/css/pickers/pickadate/classic.css": "/vendors/css/pickers/pickadate/classic.css?id=a8a38d25a3dce01efca5",
    "/vendors/css/pickers/pickadate/classic.date.css": "/vendors/css/pickers/pickadate/classic.date.css?id=7c9133162ae2b465b797",
    "/vendors/css/pickers/pickadate/classic.time.css": "/vendors/css/pickers/pickadate/classic.time.css?id=566935a9a2e62e3e2579",
    "/vendors/css/pickers/pickadate/default.css": "/vendors/css/pickers/pickadate/default.css?id=21709a9fbf673185c8d7",
    "/vendors/css/pickers/pickadate/default.time.css": "/vendors/css/pickers/pickadate/default.time.css?id=dbc5652165c7c1a9b02a",
    "/vendors/css/pickers/pickadate/pickadate.css": "/vendors/css/pickers/pickadate/pickadate.css?id=dd3871d5d9be853160bf",
    "/vendors/css/tables/ag-grid/ag-grid.css": "/vendors/css/tables/ag-grid/ag-grid.css?id=ba916b1dd4dde0d0233e",
    "/vendors/css/tables/ag-grid/ag-theme-material.css": "/vendors/css/tables/ag-grid/ag-theme-material.css?id=87805c0706c254640d14",
    "/vendors/css/tables/datatable/buttons.bootstrap4.min.css": "/vendors/css/tables/datatable/buttons.bootstrap4.min.css?id=d8da2673c333375b9e72",
    "/vendors/css/tables/datatable/dataTables.bootstrap4.min.css": "/vendors/css/tables/datatable/dataTables.bootstrap4.min.css?id=7edd067883a811df386f",
    "/vendors/css/tables/datatable/datatables.min.css": "/vendors/css/tables/datatable/datatables.min.css?id=5a73106bc8032d95933a",
    "/vendors/css/tables/datatable/extensions/dataTables.checkboxes.css": "/vendors/css/tables/datatable/extensions/dataTables.checkboxes.css?id=d2a2b3187b52afca7838",
    "/vendors/css/tables/datatable/responsive.bootstrap.min.css": "/vendors/css/tables/datatable/responsive.bootstrap.min.css?id=d9d8e21676e0fd8c7db2",
    "/vendors/css/tables/datatable/responsive.bootstrap4.min.css": "/vendors/css/tables/datatable/responsive.bootstrap4.min.css?id=229fe175e22f8ffb5336",
    "/vendors/css/tables/datatable/rowGroup.bootstrap4.min.css": "/vendors/css/tables/datatable/rowGroup.bootstrap4.min.css?id=5eb87e0f1d2c8f5e9cb8",
    "/vendors/css/tables/datatable/select.dataTables.min.css": "/vendors/css/tables/datatable/select.dataTables.min.css?id=aebdacb509c7a9f9579a",
    "/vendors/css/ui/prism-treeview.css": "/vendors/css/ui/prism-treeview.css?id=d4a772304237b8605637",
    "/vendors/css/ui/prism.min.css": "/vendors/css/ui/prism.min.css?id=2b6ec658f3078cb5a481",
    "/vendors/css/vendors-rtl.min.css": "/vendors/css/vendors-rtl.min.css?id=422999b68c18cdc913fc",
    "/vendors/css/vendors.min.css": "/vendors/css/vendors.min.css?id=c7656434fe5572c2c30a",
    "/vendors/css/waves/waves.min.css": "/vendors/css/waves/waves.min.css?id=263e9ac89ea04599c44c",
    "/vendors/css/weather-icons/climacons.min.css": "/vendors/css/weather-icons/climacons.min.css?id=4d7dada47093ca50bbac",
    "/fonts/feather/iconfont.css": "/fonts/feather/iconfont.css?id=9326e48d3d7c3245b260",
    "/fonts/flag-icon-css/css/flag-icon.css": "/fonts/flag-icon-css/css/flag-icon.css?id=1ec38056dc5aafe9159d",
    "/fonts/flag-icon-css/css/flag-icon.min.css": "/fonts/flag-icon-css/css/flag-icon.min.css?id=f486eedf043f0a90f672",
    "/fonts/font-awesome/css/font-awesome.css": "/fonts/font-awesome/css/font-awesome.css?id=4dce5bbb129034eed4e2",
    "/fonts/font-awesome/css/font-awesome.min.css": "/fonts/font-awesome/css/font-awesome.min.css?id=e42fb0ebfd041fc73b31"
}
