<svg width="748" height="748" viewBox="0 0 748 748" fill="none" xmlns="http://www.w3.org/2000/svg">
<path d="M368.056 634.057C528.684 634.057 658.899 503.843 658.899 343.215C658.899 182.587 528.684 52.3718 368.056 52.3718C207.428 52.3718 77.2136 182.587 77.2136 343.215C77.2136 503.843 207.428 634.057 368.056 634.057Z" fill="url(#paint0_linear)"/>
<path d="M87.7104 271.762C89.7181 264.042 92.0354 256.446 94.6743 249.002C105.057 244.446 115.385 241.26 125.291 239.83C301.109 214.423 352.221 203.267 390.692 145.061C409.137 117.155 430.317 91.0894 454.233 66.8652C488.975 77.4823 520.963 94.4335 548.846 116.372C494.552 150.341 454.725 183.152 429.367 214.808C384.246 271.134 255.129 238.612 131.789 258.88C115.741 261.517 101.048 265.811 87.7104 271.762Z" fill="url(#paint1_linear)" fill-opacity="0.5"/>
<path d="M232.218 683.733C259.227 683.733 281.122 678.349 281.122 671.708C281.122 665.066 259.227 659.682 232.218 659.682C205.21 659.682 183.315 665.066 183.315 671.708C183.315 678.349 205.21 683.733 232.218 683.733Z" fill="#D0556C"/>
<path d="M268.327 246.762H296.434L302.545 256.64H296.434V320.068H302.545V337.957L314.621 354.284L338.7 337.957H370.905L405.121 246.762L439.339 337.957H453.415L475.568 362.11H491.671V287.637H497.782L511.798 295.689V319.842H525.887V237.59H533.32L540.049 223.456H554.138L560.104 237.59V287.637V331.918H580.231V231.28C581.909 217.402 587.947 211.165 598.346 212.57C608.745 213.974 614.112 220.211 614.448 231.28V295.689L632.563 277.574H651.137C655.683 297.985 658.08 319.203 658.08 340.976C658.08 501.497 527.759 631.818 367.238 631.818C223.523 631.818 104.015 527.358 80.5656 390.288H98.525V362.11H86.8921L105.175 343.995H141.451V337.957H153.528V343.995H167.618L185.731 362.11H175.668V378.211H201.834V337.957H195.795L201.834 320.068V256.64H195.795L201.834 246.762H232.098C232.098 243.431 234.803 240.724 238.136 240.724C238.542 240.724 238.938 240.765 239.314 240.861C241.224 235.602 245.39 230.661 250.213 230.661C255.035 230.661 259.201 235.602 261.112 240.861C261.487 240.765 261.884 240.724 262.289 240.724C265.622 240.724 268.327 243.431 268.327 246.762Z" fill="url(#paint2_linear)"/>
<path d="M580.231 542.013C527.174 598.521 451.803 633.831 368.248 633.831C265.046 633.831 174.326 579.962 122.733 498.805C163.728 418.88 250.742 396.552 346.671 396.552C531.234 422.719 550.241 439.267 580.231 542.013Z" fill="url(#paint3_linear)"/>
<path d="M650.573 409.086C619.881 536.795 504.833 631.818 367.763 631.818C286.237 631.818 212.501 598.201 159.671 544.086C375.83 461.252 539.464 416.252 650.573 409.086Z" fill="url(#paint4_linear)"/>
<path d="M84.9967 583.82C72.5849 571.743 62.5053 551.054 54.7581 521.751C119.201 485.022 177.309 462.307 229.082 453.607C432.763 418.303 349.757 581.024 464.113 608.386C494.957 615.766 537.383 605.032 591.391 576.183L609.506 666.757C516.392 692.297 454.521 699.677 423.892 688.896C292.372 642.602 356.216 499.284 251.309 518.404C181.372 531.152 146.248 561.146 145.938 608.386C117.722 604.084 97.4085 595.896 84.9967 583.82Z" fill="url(#paint5_linear)"/>
<path d="M676.702 448.445L563.201 445.314C561.597 445.271 560.491 444.622 561.214 441.972C561.936 439.324 586.125 420.012 586.133 418.516C586.138 417.52 586.157 416.913 586.191 416.696L588.983 330.003C589.026 328.4 590.362 327.133 591.964 327.177L710.403 330.308C712.005 330.35 713.273 331.686 713.23 333.288C711.507 390.427 710.564 419.644 710.403 420.939C710.159 422.88 686.097 444.101 684.617 445.619C683.138 447.138 678.304 448.489 676.702 448.445Z" fill="url(#paint6_linear)"/>
<path d="M592.045 414.75L705.768 418.759L707.24 334.556L593.517 330.547L592.045 414.75Z" fill="url(#paint7_linear)"/>
<path fill-rule="evenodd" clip-rule="evenodd" d="M165.984 643.836C166.861 659.082 181.122 678.337 228.921 678.337C276.718 678.337 294.63 660.687 294.989 644.359L295.125 638.188C295.587 638.228 296.052 638.253 296.516 638.273C298.946 638.351 301.383 638.029 303.712 637.3C305.898 636.596 307.929 635.508 309.706 634.086C311.437 632.684 312.912 631.041 314.133 629.206C315.33 627.367 316.341 625.406 317.142 623.349C317.945 621.242 318.605 619.061 319.103 616.831C319.625 614.528 320.03 612.204 320.319 609.849C320.923 604.978 321.242 600.098 321.303 595.19C321.345 593.231 321.224 591.27 320.889 589.351C320.662 587.859 320.199 586.457 319.498 585.12C319.046 584.236 318.497 583.398 317.828 582.674C317.16 581.928 316.395 581.32 315.533 580.806C314.694 580.315 313.758 579.939 312.796 579.728C311.808 579.494 310.799 579.377 309.784 579.402C308.954 579.431 308.151 579.505 307.344 579.679C306.42 579.845 305.519 580.083 304.639 580.394C303.998 580.592 303.353 580.838 302.734 581.108C302.021 581.398 301.305 581.712 300.612 582.076C298.705 583.024 296.863 584.091 295.091 585.255C294.965 585.34 294.838 585.424 294.714 585.515C291.023 573.747 280.154 565.09 267.151 564.798L197.266 563.228C180.94 562.86 167.393 575.818 167.033 592.145L166.885 598.846C158.585 599.58 149.416 579.963 147.977 576.874C147.568 576 140.451 555.739 139.771 554.486C138.943 552.953 111.467 552.516 116.576 553.964C124.801 556.292 134.796 586.133 135.587 605.696C136.046 617.103 146.179 629.816 165.984 643.836ZM295.334 628.739L296.054 596.105C297.454 595.079 298.875 594.084 300.322 593.113C301.761 592.154 303.241 591.291 304.794 590.525C305.317 590.275 305.842 590.028 306.39 589.804C306.794 589.624 307.199 589.469 307.605 589.336C308.125 589.182 308.625 589.051 309.145 588.947C309.431 588.881 309.714 588.864 309.998 588.848C310.235 588.851 310.445 588.857 310.658 588.911C310.703 588.935 310.727 588.933 310.775 588.96C310.775 588.96 310.799 588.983 310.821 589.007C310.936 589.126 311.027 589.271 311.12 589.415C311.345 589.867 311.5 590.368 311.582 590.866C311.811 592.238 311.9 593.634 311.867 595.025C311.814 599.579 311.5 604.151 310.977 608.692C310.718 610.718 310.342 612.762 309.896 614.76C309.504 616.542 308.97 618.277 308.318 619.963C307.768 621.391 307.078 622.743 306.249 624C305.564 625.024 304.743 625.949 303.805 626.73C302.916 627.419 301.935 627.938 300.868 628.293C299.561 628.686 298.187 628.869 296.818 628.839C296.325 628.821 295.83 628.79 295.334 628.739Z" fill="url(#paint8_linear)"/>
<path d="M330.462 145.061C343.303 145.061 353.711 134.652 353.711 121.812C353.711 108.972 343.303 98.5627 330.462 98.5627C317.622 98.5627 307.213 108.972 307.213 121.812C307.213 134.652 317.622 145.061 330.462 145.061Z" fill="white"/>
<path d="M170.706 174.731C177.687 169.343 187.73 170.635 193.119 177.617C198.506 184.599 193.778 190.191 186.797 195.58C179.815 200.967 173.207 204.125 167.82 197.143C162.431 190.161 163.724 180.12 170.706 174.731Z" fill="white"/>
<path d="M134.368 439.906H135.053C135.728 439.906 136.277 440.455 136.277 441.13V481.649C136.277 482.324 135.728 482.873 135.053 482.873H134.368C133.693 482.873 133.144 482.324 133.144 481.649V441.13C133.144 440.455 133.693 439.906 134.368 439.906Z" fill="#8D58FF"/>
<path d="M180.057 407.349H180.742C181.417 407.349 181.966 407.896 181.966 408.573V449.09C181.966 449.766 181.417 450.315 180.742 450.315H180.057C179.382 450.315 178.833 449.766 178.833 449.09V408.573C178.833 407.896 179.382 407.349 180.057 407.349Z" fill="#8D58FF"/>
<path d="M227.094 384.472H227.937C228.569 384.472 229.082 384.985 229.082 385.618V420.952C229.082 421.583 228.569 422.096 227.937 422.096H227.094C226.463 422.096 225.95 421.583 225.95 420.952V385.618C225.95 384.985 226.463 384.472 227.094 384.472Z" fill="#8D58FF"/>
<path d="M322.575 396.554C302.092 381.549 286.46 360.695 284.74 336.697C281.1 285.917 312.555 242.219 354.94 239.182C393.469 236.419 436.651 252.182 436.519 312.155C439.235 319.863 442.18 325.697 445.359 329.659C450.127 335.596 451.153 339.861 453.559 346.972C455.163 351.711 449.132 356.358 435.469 360.91C430.791 402.639 433.358 418.527 396.705 421.155C391.128 421.555 385.145 421.268 378.95 420.351L367.901 462.46C348.727 449.173 336.03 441.429 329.81 439.23C323.592 437.032 317.513 436.358 311.572 437.203L322.575 396.554Z" fill="url(#paint9_linear)"/>
<path fill-rule="evenodd" clip-rule="evenodd" d="M408.163 308.568C408.062 309.112 408.003 309.682 407.973 310.267C407.669 315.981 410.178 320.771 413.577 320.952C416.973 321.133 419.978 316.639 420.285 310.924C420.588 305.208 418.077 300.421 414.681 300.24C413.66 300.184 412.675 300.552 411.786 301.248C412.853 301.924 413.59 303.079 413.687 304.43C413.85 306.708 412.133 308.691 409.855 308.855C409.253 308.897 408.673 308.81 408.163 308.568Z" fill="white"/>
<path d="M405.587 230.999C423.726 229.699 446.873 217.625 448.086 234.564C449.301 251.5 435.559 266.309 417.418 267.609C410.612 268.097 404.147 266.614 398.677 263.658C399.827 284.376 387.112 306.981 364.631 320.415C358.519 324.067 352.154 326.761 345.769 328.507C347.461 339.386 347.247 351.813 344.747 364.678C337.643 401.292 313.351 408.58 292.221 404.475C271.095 400.369 257.147 387.901 259.225 370.809C260.612 359.414 263.598 352.41 268.188 349.802C240.898 327.597 242.95 297.375 274.35 259.134C321.446 201.776 389.968 232.118 405.587 230.999Z" fill="url(#paint10_linear)"/>
<path d="M377.875 364.119L353.01 331.487L328.118 364.107L352.983 396.739L377.875 364.119Z" fill="url(#paint11_linear)"/>
<path d="M372.944 358.265L356.527 336.72L340.093 358.256L356.51 379.802L372.944 358.265Z" fill="url(#paint12_linear)"/>
<path d="M377.875 470.724L353.01 438.092L328.118 470.712L352.983 503.346L377.875 470.724Z" fill="url(#paint13_linear)"/>
<path d="M377.875 575.302L353.01 542.67L328.118 575.29L352.983 607.922L377.875 575.302Z" fill="url(#paint14_linear)"/>
<path d="M365.613 476.244L349.198 454.699L332.764 476.235L349.18 497.781L365.613 476.244Z" fill="url(#paint15_linear)"/>
<path d="M374.766 578.535L358.349 556.991L341.915 578.527L358.332 600.073L374.766 578.535Z" fill="url(#paint16_linear)"/>
<path d="M554.138 488.722C554.138 454.606 529.024 437.248 496.18 431.657C477.326 428.451 469.395 439.686 458.494 455.01C448.203 469.472 435.852 480.722 435.852 500.467C435.852 534.584 456.507 553.079 489.805 553.079C523.1 553.079 554.138 522.839 554.138 488.722Z" fill="url(#paint17_linear)"/>
<path d="M479.338 568.48C459.107 570.851 407.567 588.209 382.976 593.113C384.918 614.806 390.741 626.981 400.446 629.638C493.701 596.813 539.24 574.676 537.064 563.228C532.109 537.158 499.01 557.354 479.338 568.48Z" fill="url(#paint18_linear)"/>
<path d="M439.339 453.607C427.368 444.174 421.07 441.875 405.121 431.657C391.108 446.092 387.833 456.6 395.296 463.181C410.26 481.818 421.145 487.018 427.953 478.78C443.458 460.022 451.309 463.039 439.339 453.607Z" fill="url(#paint19_linear)"/>
<path d="M527.403 450.8C509.12 455.689 487.971 447.174 489.855 430.281C491.74 413.388 496.917 404.602 524.209 408.113C501.019 427.623 554.009 426.219 527.403 450.8Z" fill="#AE25FD"/>
<path d="M495.822 481.135C495.622 481.316 495.36 481.396 495.077 481.356C494.815 481.336 494.575 481.194 494.413 480.994C494.253 480.772 494.172 480.511 494.192 480.249C494.232 479.987 494.353 479.746 494.575 479.565C495.601 478.739 496.689 477.975 497.815 477.27C498.66 476.727 499.526 476.284 500.431 475.881C501.559 475.399 502.767 475.097 503.995 474.935C504.96 474.835 505.926 474.916 506.873 475.177C507.759 475.418 508.604 475.842 509.328 476.404C510.193 477.068 510.938 477.873 511.562 478.78C512.106 479.585 512.569 480.41 512.971 481.296C513.495 482.503 513.918 483.751 514.28 484.999C514.361 485.261 514.32 485.543 514.199 485.765C514.059 486.006 513.837 486.187 513.595 486.246C513.333 486.327 513.052 486.287 512.83 486.167C512.589 486.025 512.407 485.804 512.347 485.563C512.005 484.375 511.602 483.227 511.119 482.101C510.778 481.337 510.375 480.611 509.912 479.927C509.409 479.182 508.785 478.538 508.1 477.994C507.557 477.592 506.973 477.29 506.329 477.109C505.645 476.908 504.919 476.868 504.216 476.949C503.189 477.068 502.183 477.33 501.217 477.733C500.412 478.095 499.627 478.499 498.882 478.961C497.836 479.625 496.808 480.349 495.822 481.135Z" fill="#AF4760"/>
<path d="M463.558 467.045C463.317 467.166 463.035 467.186 462.794 467.086C462.532 467.005 462.33 466.824 462.21 466.583C462.108 466.341 462.089 466.059 462.17 465.817C462.27 465.555 462.451 465.355 462.693 465.234C463.839 464.69 465.008 464.207 466.215 463.824C467.101 463.524 468.027 463.322 468.953 463.181C470.079 463.04 471.227 463.06 472.334 463.262C473.279 463.422 474.165 463.785 474.971 464.308C475.755 464.812 476.44 465.476 476.983 466.24C477.667 467.207 478.211 468.252 478.593 469.36C478.935 470.326 479.178 471.312 479.338 472.299C479.58 473.668 479.721 475.056 479.781 476.445C479.802 476.706 479.7 476.968 479.519 477.17C479.338 477.371 479.097 477.492 478.835 477.492C478.552 477.511 478.312 477.411 478.11 477.23C477.909 477.049 477.788 476.807 477.769 476.545C477.707 475.237 477.588 473.928 477.366 472.64C477.205 471.755 476.983 470.869 476.702 470.024C476.379 469.098 475.917 468.212 475.353 467.407C474.95 466.845 474.447 466.362 473.883 465.998C473.3 465.617 472.655 465.355 471.991 465.234C471.065 465.073 470.14 465.053 469.214 465.174C468.41 465.295 467.624 465.476 466.839 465.738C465.712 466.1 464.625 466.543 463.558 467.045Z" fill="#AF4760"/>
<path fill-rule="evenodd" clip-rule="evenodd" d="M456.693 509.577C459.758 501.235 464.854 508.285 473.195 511.351C481.537 514.416 494.262 511.669 488.116 523.266C483.956 531.119 474.596 533.309 466.254 530.244C457.912 527.178 453.629 517.918 456.693 509.577Z" fill="#CE4FD9"/>
<path d="M230.869 583.687C257.878 583.687 279.772 578.303 279.772 571.662C279.772 565.021 257.878 559.637 230.869 559.637C203.861 559.637 181.966 565.021 181.966 571.662C181.966 578.303 203.861 583.687 230.869 583.687Z" fill="#C43C89" stroke="#E7687C" stroke-miterlimit="3" stroke-linecap="square"/>
<path d="M183.315 569.559C183.315 562.922 205.229 547.509 232.218 547.509C259.209 547.509 281.121 562.922 281.121 569.559C281.121 576.196 259.209 581.585 232.218 581.585C205.229 581.585 183.315 576.196 183.315 569.559Z" fill="url(#paint20_linear)"/>
<path d="M224.363 549.885C224.363 547.077 228.511 540.556 233.621 540.556C238.73 540.556 242.879 547.077 242.879 549.885C242.879 552.693 238.73 554.973 233.621 554.973C228.511 554.973 224.363 552.693 224.363 549.885Z" fill="url(#paint21_linear)"/>
<path d="M483.521 184.43C468.285 173.656 464.664 152.541 475.436 137.306C486.21 122.071 475.501 150.77 496.714 165.772C517.929 180.772 541.417 161.112 530.643 176.345C519.87 191.581 498.754 195.203 483.521 184.43Z" fill="white"/>
<defs>
<linearGradient id="paint0_linear" x1="81.3837" y1="263.208" x2="457.517" y2="621.774" gradientUnits="userSpaceOnUse">
<stop stop-color="#705BCA"/>
<stop offset="0.973913" stop-color="#84025F"/>
</linearGradient>
<linearGradient id="paint1_linear" x1="243.159" y1="168.357" x2="304.262" y2="261.205" gradientUnits="userSpaceOnUse">
<stop stop-color="white"/>
<stop offset="0.978261" stop-color="#793198"/>
</linearGradient>
<linearGradient id="paint2_linear" x1="84.7062" y1="364.405" x2="346.497" y2="708.02" gradientUnits="userSpaceOnUse">
<stop offset="0.026087" stop-color="#352484"/>
<stop offset="0.973913" stop-color="#84025F"/>
</linearGradient>
<linearGradient id="paint3_linear" x1="126.014" y1="482.556" x2="254.98" y2="719.603" gradientUnits="userSpaceOnUse">
<stop offset="0.0130435" stop-color="#4E37B3"/>
<stop offset="0.973913" stop-color="#84025F"/>
</linearGradient>
<linearGradient id="paint4_linear" x1="163.191" y1="489.816" x2="275.095" y2="724.934" gradientUnits="userSpaceOnUse">
<stop offset="0.026087" stop-color="#352484"/>
<stop offset="0.973913" stop-color="#84025F"/>
</linearGradient>
<linearGradient id="paint5_linear" x1="54.7581" y1="571.158" x2="434.426" y2="477.316" gradientUnits="userSpaceOnUse">
<stop stop-color="#CE47B7"/>
<stop offset="0.786957" stop-color="#FF7E96"/>
<stop offset="1" stop-color="#FFA591"/>
</linearGradient>
<linearGradient id="paint6_linear" x1="597.472" y1="465.608" x2="684.467" y2="314.929" gradientUnits="userSpaceOnUse">
<stop stop-color="#A033AE"/>
<stop offset="0.986957" stop-color="#CA4949"/>
</linearGradient>
<linearGradient id="paint7_linear" x1="617.879" y1="429.666" x2="681.403" y2="319.64" gradientUnits="userSpaceOnUse">
<stop stop-color="#E694F2"/>
<stop offset="0.991304" stop-color="#FE50CF"/>
</linearGradient>
<linearGradient id="paint8_linear" x1="159.945" y1="595.371" x2="256.774" y2="677.335" gradientUnits="userSpaceOnUse">
<stop stop-color="#F47878"/>
<stop offset="0.973913" stop-color="#DE5C80"/>
</linearGradient>
<linearGradient id="paint9_linear" x1="418.4" y1="336.792" x2="273.941" y2="450.505" gradientUnits="userSpaceOnUse">
<stop stop-color="#FF86CB"/>
<stop offset="0.978261" stop-color="#C32FC3"/>
</linearGradient>
<linearGradient id="paint10_linear" x1="247.63" y1="389.872" x2="400.841" y2="229.992" gradientUnits="userSpaceOnUse">
<stop stop-color="#A64E48"/>
<stop offset="0.982609" stop-color="#DB25D5"/>
</linearGradient>
<linearGradient id="paint11_linear" x1="339.172" y1="329.821" x2="372.966" y2="375.667" gradientUnits="userSpaceOnUse">
<stop stop-color="#9983FF"/>
<stop offset="0.982609" stop-color="#851C93"/>
</linearGradient>
<linearGradient id="paint12_linear" x1="347.412" y1="350.892" x2="366.636" y2="365.574" gradientUnits="userSpaceOnUse">
<stop stop-color="#9260DA"/>
<stop offset="0.982609" stop-color="#BC55CA"/>
</linearGradient>
<linearGradient id="paint13_linear" x1="339.172" y1="436.426" x2="372.966" y2="482.272" gradientUnits="userSpaceOnUse">
<stop stop-color="#9983FF"/>
<stop offset="0.982609" stop-color="#851C93"/>
</linearGradient>
<linearGradient id="paint14_linear" x1="339.172" y1="541.004" x2="372.966" y2="586.85" gradientUnits="userSpaceOnUse">
<stop stop-color="#9983FF"/>
<stop offset="0.982609" stop-color="#851C93"/>
</linearGradient>
<linearGradient id="paint15_linear" x1="357.98" y1="469.518" x2="352.934" y2="488.272" gradientUnits="userSpaceOnUse">
<stop stop-color="#9057D1"/>
<stop offset="0.982609" stop-color="#BC55CA"/>
</linearGradient>
<linearGradient id="paint16_linear" x1="352.696" y1="569.835" x2="368.819" y2="586.951" gradientUnits="userSpaceOnUse">
<stop stop-color="#8F50CA"/>
<stop offset="0.982609" stop-color="#BC55CA"/>
</linearGradient>
<linearGradient id="paint17_linear" x1="493.689" y1="445.529" x2="519.909" y2="526.703" gradientUnits="userSpaceOnUse">
<stop offset="0.0130435" stop-color="#EE8CFF"/>
<stop offset="0.973913" stop-color="#FF4DCC"/>
</linearGradient>
<linearGradient id="paint18_linear" x1="463.205" y1="556.769" x2="447.906" y2="617.974" gradientUnits="userSpaceOnUse">
<stop offset="0.0217391" stop-color="#EE8CFF"/>
<stop offset="0.956522" stop-color="#ED50FB"/>
</linearGradient>
<linearGradient id="paint19_linear" x1="428.642" y1="446.433" x2="401.643" y2="458.691" gradientUnits="userSpaceOnUse">
<stop offset="0.0217391" stop-color="#EE8CFF"/>
<stop offset="0.956522" stop-color="#ED50FB"/>
</linearGradient>
<linearGradient id="paint20_linear" x1="207.387" y1="563.26" x2="212.704" y2="583.207" gradientUnits="userSpaceOnUse">
<stop offset="0.026087" stop-color="#E17171"/>
<stop offset="0.978261" stop-color="#E4647D"/>
</linearGradient>
<linearGradient id="paint21_linear" x1="228.92" y1="547.22" x2="232.894" y2="553.891" gradientUnits="userSpaceOnUse">
<stop offset="0.0130435" stop-color="#DB8E74"/>
<stop offset="0.978261" stop-color="#E17071"/>
</linearGradient>
</defs>
</svg>
