<svg width="232" height="232" viewBox="0 0 232 232" fill="none" xmlns="http://www.w3.org/2000/svg">
<rect width="232" height="232" fill="url(#paint0_radial)"/>
<path d="M27.648 145V112.008H33.088C34.1973 112.008 34.9333 112.52 35.296 113.544L35.808 115.688C36.384 115.091 36.9707 114.536 37.568 114.024C38.1867 113.512 38.848 113.075 39.552 112.712C40.256 112.328 41.0133 112.029 41.824 111.816C42.656 111.603 43.552 111.496 44.512 111.496C46.5387 111.496 48.2133 112.04 49.536 113.128C50.8587 114.195 51.8613 115.624 52.544 117.416C53.0773 116.371 53.728 115.475 54.496 114.728C55.2853 113.96 56.1387 113.341 57.056 112.872C57.9947 112.403 58.976 112.061 60 111.848C61.0453 111.613 62.0907 111.496 63.136 111.496C64.992 111.496 66.6347 111.773 68.064 112.328C69.4933 112.883 70.688 113.704 71.648 114.792C72.6293 115.859 73.376 117.171 73.888 118.728C74.4 120.285 74.656 122.056 74.656 124.04V145H65.824V124.04C65.824 120.179 64.1707 118.248 60.864 118.248C60.1173 118.248 59.424 118.376 58.784 118.632C58.1653 118.867 57.6107 119.229 57.12 119.72C56.6507 120.211 56.2773 120.819 56 121.544C55.744 122.269 55.616 123.101 55.616 124.04V145H46.784V124.04C46.784 121.949 46.368 120.467 45.536 119.592C44.7253 118.696 43.52 118.248 41.92 118.248C40.896 118.248 39.9253 118.493 39.008 118.984C38.112 119.453 37.2693 120.115 36.48 120.968V145H27.648ZM115.579 145H106.779V118.344H92.1545V135.56C92.1545 136.477 92.3678 137.203 92.7945 137.736C93.2425 138.269 93.8718 138.536 94.6825 138.536C95.1092 138.536 95.4718 138.493 95.7705 138.408C96.0692 138.301 96.3252 138.195 96.5385 138.088C96.7518 137.96 96.9438 137.853 97.1145 137.768C97.3065 137.661 97.4985 137.608 97.6905 137.608C97.9465 137.608 98.1598 137.672 98.3305 137.8C98.5012 137.907 98.6718 138.099 98.8425 138.376L101.499 142.6C100.283 143.56 98.9065 144.285 97.3705 144.776C95.8345 145.267 94.2452 145.512 92.6025 145.512C91.1092 145.512 89.7865 145.299 88.6345 144.872C87.4825 144.424 86.5118 143.795 85.7225 142.984C84.9332 142.173 84.3358 141.192 83.9305 140.04C83.5252 138.888 83.3225 137.587 83.3225 136.136V118.344H80.2185C79.7492 118.344 79.3438 118.195 79.0025 117.896C78.6825 117.597 78.5225 117.149 78.5225 116.552V113.096L83.8025 112.136L85.5945 103.592C85.8292 102.632 86.4798 102.152 87.5465 102.152H92.1545V112.2H115.579V145ZM116.955 102.568C116.955 103.293 116.805 103.987 116.507 104.648C116.208 105.288 115.803 105.853 115.291 106.344C114.8 106.813 114.213 107.197 113.531 107.496C112.869 107.773 112.155 107.912 111.387 107.912C110.661 107.912 109.968 107.773 109.307 107.496C108.667 107.197 108.101 106.813 107.611 106.344C107.12 105.853 106.725 105.288 106.427 104.648C106.149 103.987 106.011 103.293 106.011 102.568C106.011 101.821 106.149 101.128 106.427 100.488C106.725 99.8267 107.12 99.2507 107.611 98.76C108.101 98.2693 108.667 97.8853 109.307 97.608C109.968 97.3093 110.661 97.16 111.387 97.16C112.155 97.16 112.869 97.3093 113.531 97.608C114.213 97.8853 114.8 98.2693 115.291 98.76C115.803 99.2507 116.208 99.8267 116.507 100.488C116.805 101.128 116.955 101.821 116.955 102.568ZM123.148 145V112.008H128.588C129.697 112.008 130.433 112.52 130.796 113.544L131.308 115.688C131.884 115.091 132.471 114.536 133.068 114.024C133.687 113.512 134.348 113.075 135.052 112.712C135.756 112.328 136.513 112.029 137.324 111.816C138.156 111.603 139.052 111.496 140.012 111.496C142.039 111.496 143.713 112.04 145.036 113.128C146.359 114.195 147.361 115.624 148.044 117.416C148.577 116.371 149.228 115.475 149.996 114.728C150.785 113.96 151.639 113.341 152.556 112.872C153.495 112.403 154.476 112.061 155.5 111.848C156.545 111.613 157.591 111.496 158.636 111.496C160.492 111.496 162.135 111.773 163.564 112.328C164.993 112.883 166.188 113.704 167.148 114.792C168.129 115.859 168.876 117.171 169.388 118.728C169.9 120.285 170.156 122.056 170.156 124.04V145H161.324V124.04C161.324 120.179 159.671 118.248 156.364 118.248C155.617 118.248 154.924 118.376 154.284 118.632C153.665 118.867 153.111 119.229 152.62 119.72C152.151 120.211 151.777 120.819 151.5 121.544C151.244 122.269 151.116 123.101 151.116 124.04V145H142.284V124.04C142.284 121.949 141.868 120.467 141.036 119.592C140.225 118.696 139.02 118.248 137.42 118.248C136.396 118.248 135.425 118.493 134.508 118.984C133.612 119.453 132.769 120.115 131.98 120.968V145H123.148ZM198.076 124.616C198.076 123.699 197.948 122.824 197.692 121.992C197.457 121.16 197.073 120.424 196.54 119.784C196.007 119.144 195.335 118.643 194.524 118.28C193.713 117.896 192.743 117.704 191.612 117.704C189.5 117.704 187.847 118.301 186.652 119.496C185.457 120.691 184.679 122.397 184.316 124.616H198.076ZM184.188 129.864C184.465 132.957 185.34 135.219 186.812 136.648C188.305 138.077 190.247 138.792 192.636 138.792C193.852 138.792 194.897 138.653 195.772 138.376C196.668 138.077 197.447 137.757 198.108 137.416C198.791 137.053 199.399 136.733 199.932 136.456C200.487 136.157 201.031 136.008 201.564 136.008C202.247 136.008 202.78 136.264 203.164 136.776L205.724 139.976C204.785 141.064 203.751 141.971 202.62 142.696C201.489 143.4 200.316 143.965 199.1 144.392C197.884 144.797 196.657 145.075 195.42 145.224C194.183 145.395 192.988 145.48 191.836 145.48C189.532 145.48 187.377 145.107 185.372 144.36C183.388 143.592 181.649 142.472 180.156 141C178.684 139.507 177.521 137.661 176.668 135.464C175.815 133.267 175.388 130.717 175.388 127.816C175.388 125.576 175.751 123.464 176.476 121.48C177.223 119.496 178.289 117.768 179.676 116.296C181.063 114.824 182.748 113.661 184.732 112.808C186.716 111.933 188.956 111.496 191.452 111.496C193.564 111.496 195.505 111.837 197.276 112.52C199.068 113.181 200.604 114.152 201.884 115.432C203.185 116.712 204.188 118.291 204.892 120.168C205.617 122.024 205.98 124.147 205.98 126.536C205.98 127.197 205.948 127.741 205.884 128.168C205.82 128.595 205.713 128.936 205.564 129.192C205.415 129.448 205.212 129.629 204.956 129.736C204.7 129.821 204.369 129.864 203.964 129.864H184.188Z" fill="white"/>
<defs>
<radialGradient id="paint0_radial" cx="0" cy="0" r="1" gradientUnits="userSpaceOnUse" gradientTransform="translate(295.5 -69) rotate(132.936) scale(422.063)">
<stop stop-color="#FFA53B"/>
<stop offset="1" stop-color="#D02350"/>
</radialGradient>
</defs>
</svg>
