{
  "menu": [
    {
      "url": "/",
      "name": "Home",
      "icon": "home",
      "slug": "#"
    },
    {
      "url": "/school",
      "name": "Schools",
      "icon": "user",
      "slug": ""
    },
    {
      "url": "/location",
      "name": "Locations",
      "icon": "user",
      "slug": ""
    },
    {
      "url": "/student",
      "name": "Students",
      "icon": "user",
      "slug": ""
    },
    {
      "url": "/teacher",
      "name": "Teachers",
      "icon": "user",
      "slug": ""
    },
    {
      "url": "/roll/strikes",
      "name": "Roll Strikes",
      "icon": "user",
      "slug": ""
    },
    {
      "url": "/videos",
      "name": "Videos",
      "icon": "user",
      "slug": ""
    },
    {
      "url": "/score/list",
      "name": "Scores",
      "icon": "user",
      "slug": ""
    },
    
    {
      "url": "/feedback/list",
      "name": "Feedbacks",
      "icon": "user",
      "slug": ""
    }
    
  ]
}