  ___                 _       _  __         _
 | _ )  __ _   _ _   | |__   | |/ /  __ _  | |_   __ _
 | _ \ / _` | | ' \  | / /   | ' <  / _` | |  _| / _` |
 |___/ \__,_| |_||_| |_\_\   |_|\_\ \__,_|  \__| \__,_|


A BDD and Hexagonal Architecture Example, by Christophe THEPAUT (christophe_thepaut@hotmail.fr)