[
    {
        "time": 0.0,
        "end": 9.297,
        "phone": "REST"
    },
    {
        "time": 9.3,
        "phone": "A"
    },
    {
        "time": 9.39,
        "phone": "I"
    },
    {
        "time": 9.48,
        "phone": "N"
    },
    {
        "time": 9.57,
        "phone": "A"
    },
    {
        "time": 9.700000000000001,
        "end": 10.032,
        "phone": "REST"
    },
    {
        "time": 10.05,
        "phone": "E"
    },
    {
        "time": 10.14,
        "phone": "T"
    },
    {
        "time": 10.23,
        "phone": "B"
    },
    {
        "time": 10.26,
        "phone": "I"
    },
    {
        "time": 10.32,
        "phone": "N"
    },
    {
        "time": 10.44,
        "phone": "W"
    },
    {
        "time": 10.53,
        "phone": "O"
    },
    {
        "time": 10.65,
        "phone": "N"
    },
    {
        "time": 10.86,
        "phone": "OO"
    },
    {
        "time": 11.01,
        "phone": "N"
    },
    {
        "time": 11.04,
        "phone": "I"
    },
    {
        "time": 11.1,
        "phone": "L"
    },
    {
        "time": 11.13,
        "phone": "I"
    },
    {
        "time": 11.22,
        "phone": "K"
    },
    {
        "time": 11.28,
        "phone": "E"
    },
    {
        "time": 11.43,
        "phone": "TH"
    },
    {
        "time": 11.49,
        "phone": "I"
    },
    {
        "time": 11.64,
        "phone": "R"
    },
    {
        "time": 11.7,
        "phone": "U"
    },
    {
        "time": 11.725,
        "end": 12.276,
        "phone": "REST"
    },
    {
        "time": 12.27,
        "phone": "A"
    },
    {
        "time": 12.39,
        "phone": "N"
    },
    {
        "time": 12.54,
        "phone": "E"
    },
    {
        "time": 12.6,
        "phone": "S"
    },
    {
        "time": 12.72,
        "phone": "K"
    },
    {
        "time": 12.78,
        "phone": "O"
    },
    {
        "time": 12.84,
        "phone": "A"
    },
    {
        "time": 13.05,
        "phone": "W"
    },
    {
        "time": 13.08,
        "phone": "I"
    },
    {
        "time": 13.2,
        "phone": "F"
    },
    {
        "time": 13.26,
        "phone": "A"
    },
    {
        "time": 13.38,
        "phone": "N"
    },
    {
        "time": 13.44,
        "phone": "EH"
    },
    {
        "time": 13.5,
        "phone": "D"
    },
    {
        "time": 13.53,
        "phone": "I"
    },
    {
        "time": 13.65,
        "phone": "SH"
    },
    {
        "time": 13.74,
        "phone": "K"
    },
    {
        "time": 13.8,
        "phone": "O"
    },
    {
        "time": 13.92,
        "phone": null
    },
    {
        "time": 14.04,
        "phone": "OO"
    },
    {
        "time": 14.07,
        "phone": "O"
    },
    {
        "time": 14.13,
        "phone": "TH"
    },
    {
        "time": 14.19,
        "phone": "I"
    },
    {
        "time": 14.31,
        "phone": "L"
    },
    {
        "time": 14.37,
        "phone": "A"
    },
    {
        "time": 14.43,
        "phone": "I"
    },
    {
        "time": 14.46,
        "phone": "N"
    },
    {
        "time": 14.52,
        "phone": "I"
    },
    {
        "time": 14.61,
        "phone": "S"
    },
    {
        "time": 14.7,
        "phone": "I"
    },
    {
        "time": 14.91,
        "phone": "A"
    },
    {
        "time": 14.937000000000001,
        "end": 21.397000000000002,
        "phone": "REST"
    },
    {
        "time": 21.42,
        "phone": "I"
    },
    {
        "time": 21.54,
        "phone": "N"
    },
    {
        "time": 21.6,
        "phone": "EH"
    },
    {
        "time": 21.685,
        "end": 22.03,
        "phone": "REST"
    },
    {
        "time": 21.99,
        "phone": "D"
    },
    {
        "time": 22.02,
        "phone": "O"
    },
    {
        "time": 22.08,
        "phone": "R"
    },
    {
        "time": 22.11,
        "phone": "E"
    },
    {
        "time": 22.17,
        "phone": "F"
    },
    {
        "time": 22.23,
        "phone": "OU"
    },
    {
        "time": 22.32,
        "phone": "M"
    },
    {
        "time": 22.38,
        "phone": "A"
    },
    {
        "time": 22.5,
        "phone": "N"
    },
    {
        "time": 22.53,
        "phone": "I"
    },
    {
        "time": 22.59,
        "phone": "S"
    },
    {
        "time": 22.62,
        "phone": "T"
    },
    {
        "time": 22.65,
        "phone": "OO"
    },
    {
        "time": 22.68,
        "phone": "W"
    },
    {
        "time": 22.71,
        "phone": "I"
    },
    {
        "time": 22.8,
        "phone": "S"
    },
    {
        "time": 22.86,
        "phone": "I"
    },
    {
        "time": 22.95,
        "phone": "O"
    },
    {
        "time": 23.04,
        "phone": "A"
    },
    {
        "time": 23.07,
        "phone": "I"
    },
    {
        "time": 23.13,
        "phone": "S"
    },
    {
        "time": 23.22,
        "phone": "T"
    },
    {
        "time": 23.28,
        "phone": "I"
    },
    {
        "time": 23.37,
        "phone": "S"
    },
    {
        "time": 23.46,
        "phone": "P"
    },
    {
        "time": 23.49,
        "phone": "I"
    },
    {
        "time": 23.55,
        "phone": "N"
    },
    {
        "time": 23.67,
        "phone": "S"
    },
    {
        "time": 23.76,
        "phone": "OU"
    },
    {
        "time": 23.94,
        "phone": "S"
    },
    {
        "time": 24.03,
        "phone": "G"
    },
    {
        "time": 24.09,
        "phone": "E"
    },
    {
        "time": 24.15,
        "phone": "L"
    },
    {
        "time": 24.21,
        "phone": "D"
    },
    {
        "time": 24.24,
        "phone": "EH"
    },
    {
        "time": 24.3,
        "phone": "B"
    },
    {
        "time": 24.36,
        "phone": "A"
    },
    {
        "time": 24.51,
        "phone": "TH"
    },
    {
        "time": 24.57,
        "phone": "I"
    },
    {
        "time": 24.63,
        "phone": "S"
    },
    {
        "time": 24.75,
        "phone": "O"
    },
    {
        "time": 24.96,
        "phone": "K"
    },
    {
        "time": 25.02,
        "phone": "OU"
    },
    {
        "time": 25.2,
        "phone": "S"
    },
    {
        "time": 25.32,
        "phone": "T"
    },
    {
        "time": 25.38,
        "phone": "EH"
    },
    {
        "time": 25.47,
        "phone": "F"
    },
    {
        "time": 25.53,
        "phone": "OU"
    },
    {
        "time": 25.59,
        "phone": "Y"
    },
    {
        "time": 25.62,
        "phone": "N"
    },
    {
        "time": 25.68,
        "phone": "G"
    },
    {
        "time": 25.74,
        "phone": "EH"
    },
    {
        "time": 25.77,
        "phone": "R"
    },
    {
        "time": 25.86,
        "phone": "OH"
    },
    {
        "time": 25.98,
        "phone": "L"
    },
    {
        "time": 26.01,
        "phone": "E"
    },
    {
        "time": 26.1,
        "phone": "K"
    },
    {
        "time": 26.139,
        "end": 30.949,
        "phone": "REST"
    },
    {
        "time": 26.16,
        "phone": "EE"
    },
    {
        "time": 26.22,
        "phone": "Y"
    },
    {
        "time": 30.96,
        "phone": "A"
    },
    {
        "time": 31.02,
        "phone": "I"
    },
    {
        "time": 31.11,
        "phone": "N"
    },
    {
        "time": 31.17,
        "phone": "EH"
    },
    {
        "time": 31.352,
        "end": 31.967000000000002,
        "phone": "REST"
    },
    {
        "time": 31.95,
        "phone": "A"
    },
    {
        "time": 32.01,
        "phone": "I"
    },
    {
        "time": 32.13,
        "phone": "EE"
    },
    {
        "time": 32.16,
        "phone": "S"
    },
    {
        "time": 32.25,
        "phone": "T"
    },
    {
        "time": 32.28,
        "phone": "UH"
    },
    {
        "time": 32.31,
        "phone": "OO"
    },
    {
        "time": 32.4,
        "phone": "G"
    },
    {
        "time": 32.46,
        "phone": "O"
    },
    {
        "time": 32.52,
        "phone": "N"
    },
    {
        "time": 32.58,
        "phone": "U"
    },
    {
        "time": 32.7,
        "phone": "F"
    },
    {
        "time": 32.76,
        "phone": "E"
    },
    {
        "time": 32.85,
        "phone": "I"
    },
    {
        "time": 32.94,
        "phone": "O"
    },
    {
        "time": 32.949,
        "end": 36.779,
        "phone": "REST"
    },
    {
        "time": 36.75,
        "phone": "W"
    },
    {
        "time": 36.84,
        "phone": "A"
    },
    {
        "time": 37.156,
        "end": 37.507,
        "phone": "REST"
    },
    {
        "time": 37.44,
        "phone": null
    },
    {
        "time": 37.5,
        "phone": "OO"
    },
    {
        "time": 37.53,
        "phone": null
    },
    {
        "time": 37.56,
        "phone": "A"
    },
    {
        "time": 37.68,
        "phone": "K"
    },
    {
        "time": 37.71,
        "phone": "Y"
    },
    {
        "time": 37.74,
        "phone": "I"
    },
    {
        "time": 37.86,
        "phone": "P"
    },
    {
        "time": 37.92,
        "phone": "EE"
    },
    {
        "time": 38.22,
        "phone": "S"
    },
    {
        "time": 38.321,
        "end": 43.344,
        "phone": "REST"
    },
    {
        "time": 43.35,
        "phone": "E"
    },
    {
        "time": 43.47,
        "phone": "S"
    },
    {
        "time": 43.59,
        "phone": "P"
    },
    {
        "time": 43.65,
        "phone": "I"
    },
    {
        "time": 43.74,
        "phone": "OO"
    },
    {
        "time": 43.8,
        "phone": "D"
    },
    {
        "time": 43.86,
        "phone": "O"
    },
    {
        "time": 43.98,
        "phone": "F"
    },
    {
        "time": 44.07,
        "phone": "OU"
    },
    {
        "time": 44.122,
        "end": 52.566,
        "phone": "REST"
    },
    {
        "time": 52.56,
        "phone": "A"
    },
    {
        "time": 52.65,
        "phone": "N"
    },
    {
        "time": 52.77,
        "phone": "P"
    },
    {
        "time": 52.83,
        "phone": "W"
    },
    {
        "time": 52.89,
        "phone": "A"
    },
    {
        "time": 53.109,
        "end": 54.178000000000004,
        "phone": "REST"
    },
    {
        "time": 53.13,
        "phone": "N"
    },
    {
        "time": 54.18,
        "phone": "A"
    },
    {
        "time": 54.27,
        "phone": "N"
    },
    {
        "time": 54.36,
        "phone": "P"
    },
    {
        "time": 54.45,
        "phone": "N"
    },
    {
        "time": 54.51,
        "phone": "I"
    },
    {
        "time": 54.63,
        "phone": "N"
    },
    {
        "time": 54.69,
        "phone": "D"
    },
    {
        "time": 54.72,
        "phone": "EH"
    },
    {
        "time": 54.84,
        "phone": "D"
    },
    {
        "time": 54.87,
        "phone": "I"
    },
    {
        "time": 54.96,
        "phone": "S"
    },
    {
        "time": 55.02,
        "phone": "OO"
    },
    {
        "time": 55.08,
        "phone": "N"
    },
    {
        "time": 55.14,
        "phone": "A"
    },
    {
        "time": 55.23,
        "phone": "TH"
    },
    {
        "time": 55.26,
        "phone": "EH"
    },
    {
        "time": 55.35,
        "phone": "K"
    },
    {
        "time": 55.41,
        "phone": "O"
    },
    {
        "time": 55.53,
        "phone": "G"
    },
    {
        "time": 55.59,
        "phone": "E"
    },
    {
        "time": 55.65,
        "phone": "V"
    },
    {
        "time": 55.68,
        "phone": "O"
    },
    {
        "time": 55.74,
        "phone": "S"
    },
    {
        "time": 55.8,
        "phone": "T"
    },
    {
        "time": 55.83,
        "phone": "EH"
    },
    {
        "time": 55.95,
        "phone": "P"
    },
    {
        "time": 56.04,
        "phone": "A"
    },
    {
        "time": 56.13,
        "phone": "UH"
    },
    {
        "time": 56.16,
        "phone": "O"
    },
    {
        "time": 56.19,
        "phone": "EH"
    },
    {
        "time": 56.31,
        "phone": "L"
    },
    {
        "time": 56.34,
        "phone": "EH"
    },
    {
        "time": 56.46,
        "phone": "S"
    },
    {
        "time": 56.52,
        "phone": "E"
    },
    {
        "time": 56.64,
        "phone": "T"
    },
    {
        "time": 56.7,
        "phone": "O"
    },
    {
        "time": 56.91,
        "phone": "L"
    },
    {
        "time": 56.97,
        "phone": "O"
    },
    {
        "time": 57.06,
        "phone": "T"
    },
    {
        "time": 57.093,
        "end": 73.69,
        "phone": "REST"
    },
    {
        "time": 57.12,
        "phone": "I"
    },
    {
        "time": 73.68,
        "phone": "A"
    },
    {
        "time": 73.71,
        "phone": "Y"
    },
    {
        "time": 73.83,
        "phone": "TH"
    },
    {
        "time": 73.89,
        "phone": "I"
    },
    {
        "time": 73.92,
        "phone": "N"
    },
    {
        "time": 73.95,
        "phone": "K"
    },
    {
        "time": 74.01,
        "phone": "TH"
    },
    {
        "time": 74.07,
        "phone": "EH"
    },
    {
        "time": 74.16,
        "phone": "R"
    },
    {
        "time": 74.22,
        "phone": "E"
    },
    {
        "time": 74.28,
        "phone": "L"
    },
    {
        "time": 74.34,
        "phone": "EH"
    },
    {
        "time": 74.4,
        "phone": "K"
    },
    {
        "time": 74.46,
        "phone": "EE"
    },
    {
        "time": 74.52,
        "phone": "Z"
    },
    {
        "time": 74.58,
        "phone": "EH"
    },
    {
        "time": 74.64,
        "phone": "M"
    },
    {
        "time": 74.73,
        "phone": "L"
    },
    {
        "time": 74.79,
        "phone": "AR"
    },
    {
        "time": 74.91,
        "phone": "K"
    },
    {
        "time": 74.97,
        "phone": "EE"
    },
    {
        "time": 75.06,
        "phone": "D"
    },
    {
        "time": 75.09,
        "phone": "E"
    },
    {
        "time": 75.12,
        "phone": "S"
    },
    {
        "time": 75.21,
        "phone": "P"
    },
    {
        "time": 75.3,
        "phone": "A"
    },
    {
        "time": 75.39,
        "phone": "W"
    },
    {
        "time": 75.45,
        "phone": "R"
    },
    {
        "time": 75.544,
        "end": 76.512,
        "phone": "REST"
    },
    {
        "time": 76.47,
        "phone": "W"
    },
    {
        "time": 76.53,
        "phone": "I"
    },
    {
        "time": 76.62,
        "phone": "M"
    },
    {
        "time": 76.65,
        "phone": "U"
    },
    {
        "time": 76.71,
        "phone": "S"
    },
    {
        "time": 76.83,
        "phone": "W"
    },
    {
        "time": 76.89,
        "phone": "I"
    },
    {
        "time": 77.01,
        "phone": "K"
    },
    {
        "time": 77.1,
        "phone": "I"
    },
    {
        "time": 77.16,
        "phone": "R"
    },
    {
        "time": 77.28,
        "phone": "F"
    },
    {
        "time": 77.37,
        "phone": "EH"
    },
    {
        "time": 77.4,
        "phone": "L"
    },
    {
        "time": 77.452,
        "end": 87.775,
        "phone": "REST"
    },
    {
        "time": 87.75,
        "phone": "A"
    },
    {
        "time": 87.81,
        "phone": "Y"
    },
    {
        "time": 87.9,
        "phone": "S"
    },
    {
        "time": 87.99,
        "phone": "I"
    },
    {
        "time": 88.02,
        "phone": "N"
    },
    {
        "time": 88.08,
        "phone": "K"
    },
    {
        "time": 88.14,
        "phone": "W"
    },
    {
        "time": 88.26,
        "phone": "AR"
    },
    {
        "time": 88.35,
        "phone": "I"
    },
    {
        "time": 88.38,
        "phone": "N"
    },
    {
        "time": 88.41,
        "phone": "TH"
    },
    {
        "time": 88.44,
        "phone": "EH"
    },
    {
        "time": 88.62,
        "phone": "E"
    },
    {
        "time": 88.65,
        "phone": "Y"
    },
    {
        "time": 88.74,
        "phone": "M"
    },
    {
        "time": 88.83,
        "phone": "OO"
    },
    {
        "time": 88.92,
        "phone": "U"
    },
    {
        "time": 88.95,
        "phone": "V"
    },
    {
        "time": 89.07,
        "phone": "S"
    },
    {
        "time": 89.13,
        "phone": "I"
    },
    {
        "time": 89.25,
        "phone": "K"
    },
    {
        "time": 89.31,
        "phone": "R"
    },
    {
        "time": 89.37,
        "phone": "EH"
    },
    {
        "time": 89.43,
        "phone": "TH"
    },
    {
        "time": 89.52,
        "phone": "S"
    },
    {
        "time": 89.583,
        "end": 90.507,
        "phone": "REST"
    },
    {
        "time": 90.45,
        "phone": "TH"
    },
    {
        "time": 90.51,
        "phone": "I"
    },
    {
        "time": 90.6,
        "phone": "S"
    },
    {
        "time": 90.66,
        "phone": "I"
    },
    {
        "time": 90.75,
        "phone": "Z"
    },
    {
        "time": 90.81,
        "phone": "W"
    },
    {
        "time": 90.84,
        "phone": "E"
    },
    {
        "time": 91.02,
        "phone": "T"
    },
    {
        "time": 91.08,
        "phone": "OO"
    },
    {
        "time": 91.2,
        "phone": "TH"
    },
    {
        "time": 91.23,
        "phone": "EH"
    },
    {
        "time": 91.26,
        "phone": "N"
    },
    {
        "time": 91.35,
        "phone": "K"
    },
    {
        "time": 91.41,
        "phone": "A"
    },
    {
        "time": 91.53,
        "phone": "M"
    },
    {
        "time": 91.62,
        "phone": "EH"
    },
    {
        "time": 91.65,
        "phone": "N"
    },
    {
        "time": 91.74,
        "phone": "H"
    },
    {
        "time": 91.77,
        "phone": "E"
    },
    {
        "time": 91.86,
        "phone": "L"
    },
    {
        "time": 91.92,
        "phone": "I"
    },
    {
        "time": 91.98,
        "phone": "Z"
    },
    {
        "time": 92.07,
        "phone": "M"
    },
    {
        "time": 92.13,
        "phone": "OU"
    },
    {
        "time": 92.25,
        "phone": "S"
    },
    {
        "time": 92.31,
        "phone": "T"
    },
    {
        "time": 92.4,
        "phone": "P"
    },
    {
        "time": 92.46,
        "phone": "A"
    },
    {
        "time": 92.52,
        "phone": "W"
    },
    {
        "time": 92.61,
        "phone": "EH"
    },
    {
        "time": 92.7,
        "phone": "F"
    },
    {
        "time": 92.76,
        "phone": "OU"
    },
    {
        "time": 92.88,
        "phone": "R"
    },
    {
        "time": 92.94,
        "phone": "OH"
    },
    {
        "time": 93.03,
        "phone": "L"
    },
    {
        "time": 93.09,
        "phone": "EH"
    },
    {
        "time": 93.18,
        "phone": "K"
    },
    {
        "time": 93.352,
        "end": 111.058,
        "phone": "REST"
    },
    {
        "time": 111.03,
        "phone": "Y"
    },
    {
        "time": 111.12,
        "phone": "E"
    },
    {
        "time": 111.33,
        "phone": "S"
    },
    {
        "time": 111.443,
        "end": 111.8,
        "phone": "REST"
    },
    {
        "time": 111.75,
        "phone": "B"
    },
    {
        "time": 111.81,
        "phone": "U"
    },
    {
        "time": 111.96,
        "phone": "I"
    },
    {
        "time": 112.08,
        "phone": "M"
    },
    {
        "time": 112.14,
        "phone": "U"
    },
    {
        "time": 112.23,
        "phone": "Z"
    },
    {
        "time": 112.26,
        "phone": "T"
    },
    {
        "time": 112.35,
        "phone": "B"
    },
    {
        "time": 112.41,
        "phone": "EE"
    },
    {
        "time": 112.53,
        "phone": "K"
    },
    {
        "time": 112.59,
        "phone": "Y"
    },
    {
        "time": 112.62,
        "phone": "EE"
    },
    {
        "time": 112.71,
        "phone": "R"
    },
    {
        "time": 112.86,
        "phone": "F"
    },
    {
        "time": 112.95,
        "phone": "OU"
    },
    {
        "time": 113.04,
        "end": 113.57300000000001,
        "phone": "REST"
    },
    {
        "time": 113.61,
        "phone": "I"
    },
    {
        "time": 113.64,
        "phone": "Y"
    },
    {
        "time": 113.67,
        "phone": "D"
    },
    {
        "time": 113.73,
        "phone": "W"
    },
    {
        "time": 113.76,
        "phone": "N"
    },
    {
        "time": 113.91,
        "phone": "N"
    },
    {
        "time": 113.97,
        "phone": "OO"
    },
    {
        "time": 114.0,
        "phone": "W"
    },
    {
        "time": 114.12,
        "phone": "A"
    },
    {
        "time": 114.24,
        "phone": null
    },
    {
        "time": 114.33,
        "phone": "A"
    },
    {
        "time": 114.39,
        "phone": "Y"
    },
    {
        "time": 114.45,
        "phone": "N"
    },
    {
        "time": 114.51,
        "phone": "W"
    },
    {
        "time": 114.54,
        "end": 114.752,
        "phone": "REST"
    },
    {
        "time": 114.57,
        "phone": "F"
    },
    {
        "time": 114.66,
        "phone": "P"
    },
    {
        "time": 114.78,
        "phone": "A"
    },
    {
        "time": 114.87,
        "phone": "W"
    },
    {
        "time": 114.93,
        "phone": "R"
    },
    {
        "time": 114.99,
        "phone": "A"
    },
    {
        "time": 115.05,
        "phone": "D"
    },
    {
        "time": 115.08,
        "phone": "W"
    },
    {
        "time": 115.17,
        "phone": "S"
    },
    {
        "time": 115.26,
        "phone": "R"
    },
    {
        "time": 115.32,
        "phone": "OH"
    },
    {
        "time": 115.41,
        "phone": "L"
    },
    {
        "time": 115.44,
        "phone": "A"
    },
    {
        "time": 115.59,
        "phone": "K"
    },
    {
        "time": 115.68,
        "phone": "O"
    },
    {
        "time": 115.8,
        "phone": "L"
    },
    {
        "time": 116.047,
        "end": 123.024,
        "phone": "REST"
    },
    {
        "time": 123.0,
        "phone": "OO"
    },
    {
        "time": 123.06,
        "phone": "I"
    },
    {
        "time": 123.18,
        "phone": "D"
    },
    {
        "time": 123.24,
        "phone": "E"
    },
    {
        "time": 123.33,
        "phone": "L"
    },
    {
        "time": 123.39,
        "phone": "E"
    },
    {
        "time": 123.48,
        "phone": "T"
    },
    {
        "time": 123.516,
        "end": 124.539,
        "phone": "REST"
    },
    {
        "time": 124.5,
        "phone": "W"
    },
    {
        "time": 124.53,
        "phone": "I"
    },
    {
        "time": 124.68,
        "phone": "F"
    },
    {
        "time": 124.74,
        "phone": "OH"
    },
    {
        "time": 124.89,
        "phone": "M"
    },
    {
        "time": 124.92,
        "phone": "EH"
    },
    {
        "time": 125.07,
        "phone": "S"
    },
    {
        "time": 125.13,
        "phone": "I"
    },
    {
        "time": 125.25,
        "phone": "K"
    },
    {
        "time": 125.31,
        "phone": "OU"
    },
    {
        "time": 125.34,
        "phone": "L"
    },
    {
        "time": 125.4,
        "phone": "A"
    },
    {
        "time": 125.46,
        "phone": "V"
    },
    {
        "time": 125.55,
        "phone": "T"
    },
    {
        "time": 125.61,
        "phone": "OO"
    },
    {
        "time": 125.7,
        "phone": "D"
    },
    {
        "time": 125.73,
        "phone": "EH"
    },
    {
        "time": 125.85,
        "phone": "K"
    },
    {
        "time": 125.94,
        "phone": "OH"
    },
    {
        "time": 126.06,
        "phone": "M"
    },
    {
        "time": 126.09,
        "phone": "U"
    },
    {
        "time": 126.21,
        "phone": "S"
    },
    {
        "time": 126.27,
        "phone": "OO"
    },
    {
        "time": 126.3,
        "phone": "L"
    },
    {
        "time": 126.36,
        "phone": "OH"
    },
    {
        "time": 126.45,
        "phone": "L"
    },
    {
        "time": 126.51,
        "phone": "A"
    },
    {
        "time": 126.6,
        "phone": "K"
    },
    {
        "time": 126.632,
        "end": 141.43800000000002,
        "phone": "REST"
    },
    {
        "time": 126.66,
        "phone": "E"
    }
]