{
  "cover": "https://i.ibb.co/TkyDn4w/Cover.jpg",
  "title": "StepMother Friend - Chapter 007 [UNCENSORED]",
  "images": [
    "https://i.ibb.co/k5tCr1r/001.jpg",
    "https://i.ibb.co/FXQVXvS/002.jpg",
    "https://i.ibb.co/L8Xht10/003.jpg",
    "https://i.ibb.co/0GzG39K/004.jpg",
    "https://i.ibb.co/mDRnhLj/005.jpg",
    "https://i.ibb.co/R3dNw8f/006.jpg",
    "https://i.ibb.co/pZRXRvG/007.jpg",
    "https://i.ibb.co/Lthvn4c/008.jpg",
    "https://i.ibb.co/TKfNd1B/009.jpg",
    "https://i.ibb.co/MkLzsWw/010.jpg",
    "https://i.ibb.co/7nrxdsJ/011.jpg",
    "https://i.ibb.co/1KwmCWm/012.jpg",
    "https://i.ibb.co/SXfQpF1/013.jpg",
    "https://i.ibb.co/qjVxbbh/014.jpg",
    "https://i.ibb.co/nLvzy5F/015.jpg",
    "https://i.ibb.co/CWZPJg8/016.jpg",
    "https://i.ibb.co/Vm7Frhj/017.jpg",
    "https://i.ibb.co/gy6CnnY/018.jpg",
    "https://i.ibb.co/3pGT9c1/019.jpg",
    "https://i.ibb.co/vP1qRSw/020.jpg",
    "https://i.ibb.co/GQPN30g/021.jpg",
    "https://i.ibb.co/q5K9Lxt/022.jpg",
    "https://i.ibb.co/5nrTf5b/023.jpg",
    "https://i.ibb.co/Ln1h6Rw/024.jpg",
    "https://i.ibb.co/VS5t242/025.jpg",
    "https://i.ibb.co/7kQQ9yL/026.jpg",
    "https://i.ibb.co/3hZj10P/027.jpg",
    "https://i.ibb.co/Y3JrhKn/028.jpg",
    "https://i.ibb.co/Km22qCJ/029.jpg",
    "https://i.ibb.co/3WYsL0W/030.jpg",
    "https://i.ibb.co/92RYpgL/031.jpg",
    "https://i.ibb.co/BgtPQjR/032.jpg",
    "https://i.ibb.co/48vpWhd/033.jpg",
    "https://i.ibb.co/bgFXBcn/034.jpg",
    "https://i.ibb.co/HXRGtk4/035.jpg",
    "https://i.ibb.co/Y0mB6L8/036.jpg",
    "https://i.ibb.co/pPSm6KQ/037.jpg",
    "https://i.ibb.co/f2mhZCn/038.jpg",
    "https://i.ibb.co/vw9yydf/039.jpg",
    "https://i.ibb.co/w0BSsYz/040.jpg",
    "https://i.ibb.co/GcQMfzH/041.jpg",
    "https://i.ibb.co/zFx2Nns/042.jpg"
  ]
}