{
  "cover": "https://i.ibb.co/TkyDn4w/Cover.jpg",
  "title": "StepMother Friend - Chapter 008 [UNCENSORED]",
  "images": [
    "https://i.ibb.co/Kwf1vhn/001.jpg",
    "https://i.ibb.co/5rxfrGM/002-copy.jpg",
    "https://i.ibb.co/NF42RhW/003-copy.jpg",
    "https://i.ibb.co/ZGTtNWP/004-copy.jpg",
    "https://i.ibb.co/d4xHxmx/005-copy.jpg",
    "https://i.ibb.co/qFv3p9T/006-copy.jpg",
    "https://i.ibb.co/ZNsJfhg/007-copy.jpg",
    "https://i.ibb.co/M5qgb3x/008-copy.jpg",
    "https://i.ibb.co/JQW1Ghy/009-copy.jpg",
    "https://i.ibb.co/hYj048R/010-copy.jpg",
    "https://i.ibb.co/KzxY9gr/011-copy.jpg",
    "https://i.ibb.co/0VByd9r/012-copy.jpg",
    "https://i.ibb.co/QkZWxNq/013-copy.jpg",
    "https://i.ibb.co/cYmrtsJ/014-copy.jpg",
    "https://i.ibb.co/TmzctCT/015-copy.jpg",
    "https://i.ibb.co/55Nd69P/016-copy.jpg",
    "https://i.ibb.co/H7yCdDm/017-copy.jpg",
    "https://i.ibb.co/rZGVtQT/018-copy.jpg",
    "https://i.ibb.co/9GGnRyL/019-copy.jpg",
    "https://i.ibb.co/5TnfDHz/020-copy.jpg",
    "https://i.ibb.co/F7q6pCz/021-copy.jpg",
    "https://i.ibb.co/KNVwmyC/022-copy.jpg",
    "https://i.ibb.co/h84j1Kr/023-copy.jpg",
    "https://i.ibb.co/18Vw51m/024-copy.jpg",
    "https://i.ibb.co/6Hxs7zr/025-copy.jpg",
    "https://i.ibb.co/K9GstNr/026-copy.jpg",
    "https://i.ibb.co/ckZPjMD/027-copy.jpg",
    "https://i.ibb.co/w4pjG0z/028-copy.jpg",
    "https://i.ibb.co/d4t9cRG/029-copy.jpg",
    "https://i.ibb.co/nkLfdyV/030-copy.jpg",
    "https://i.ibb.co/hdFT8jC/031-copy.jpg",
    "https://i.ibb.co/4KMr0SL/032-copy.jpg",
    "https://i.ibb.co/VtgJwSW/033-copy.jpg",
    "https://i.ibb.co/cx3CvJc/034-copy.jpg",
    "https://i.ibb.co/TM1LdqW/035-copy.jpg",
    "https://i.ibb.co/ckWdDYr/036-copy.jpg",
    "https://i.ibb.co/sCNnb76/037-copy.jpg",
    "https://i.ibb.co/W5Y3mDg/038-copy.jpg",
    "https://i.ibb.co/9VSBHvg/039-copy.jpg",
    "https://i.ibb.co/CQbr2KF/040-copy.jpg",
    "https://i.ibb.co/2qnDBVY/041-copy.jpg",
    "https://i.ibb.co/BcQfRnL/042-copy.jpg",
    "https://i.ibb.co/dWG9ckL/999.jpg"
  ]
}