{
  "cover": "https://i.ibb.co/nc0DZS2/001.jpg",
  "title": "Fitness - Chapter 004 [UNCENSORED]",
  "images": [
    "https://i.ibb.co/dKfq1GG/1.jpg",
    "https://i.ibb.co/5TFfHXv/2.jpg",
    "https://i.ibb.co/mhYtRxw/3.jpg",
    "https://i.ibb.co/rGWtnyP/4.jpg"
  ]
}