{
  "cover": "https://i.ibb.co/TkyDn4w/Cover.jpg",
  "title": "StepMother Friend - Chapter 011 [UNCENSORED]",
  "images": [
    "https://i.ibb.co/HGGfD4p/001.jpg",
    "https://i.ibb.co/RcBpmtY/002-copy.jpg",
    "https://i.ibb.co/PjdnqqR/003-copy.jpg",
    "https://i.ibb.co/qjVhWJC/004-copy.jpg",
    "https://i.ibb.co/PMGHhnw/005-copy.jpg",
    "https://i.ibb.co/qBddFqt/006-copy.jpg",
    "https://i.ibb.co/JshTBXK/007-copy.jpg",
    "https://i.ibb.co/8B4gt7Y/008-copy.jpg",
    "https://i.ibb.co/k5jTT6j/009-copy.jpg",
    "https://i.ibb.co/mTqHfkk/010-copy.jpg",
    "https://i.ibb.co/Qv3z1MW/011-copy.jpg",
    "https://i.ibb.co/Zmc0nF2/012-copy.jpg",
    "https://i.ibb.co/1zdWVw2/013-copy.jpg",
    "https://i.ibb.co/7pTp4Fv/014-copy.jpg",
    "https://i.ibb.co/1RMmTNT/015-copy.jpg",
    "https://i.ibb.co/Nn7fWw3/016-copy.jpg",
    "https://i.ibb.co/yVSd6hR/017-copy.jpg",
    "https://i.ibb.co/5jC91NK/018-copy.jpg",
    "https://i.ibb.co/kM5pX2s/019-copy.jpg",
    "https://i.ibb.co/tLmf4wn/020-copy.jpg",
    "https://i.ibb.co/qsQS5hD/021-copy.jpg",
    "https://i.ibb.co/nfLFt1q/022-copy.jpg",
    "https://i.ibb.co/k8jX3R5/023-copy.jpg",
    "https://i.ibb.co/vcsbpTf/024-copy.jpg",
    "https://i.ibb.co/TPyBvX3/025-copy.jpg",
    "https://i.ibb.co/HgqdNC8/026-copy.jpg",
    "https://i.ibb.co/fM7shCb/027-copy.jpg",
    "https://i.ibb.co/ZHgKdn4/028-copy.jpg",
    "https://i.ibb.co/QHxntZ2/029-copy.jpg",
    "https://i.ibb.co/NnrYbfs/030-copy.jpg",
    "https://i.ibb.co/qYDwbsC/031-copy.jpg",
    "https://i.ibb.co/1qzFkGT/032-copy.jpg",
    "https://i.ibb.co/RgmNCYQ/033-copy.jpg",
    "https://i.ibb.co/2Fx4WMY/034-copy.jpg",
    "https://i.ibb.co/qMcVMbF/035-copy.jpg",
    "https://i.ibb.co/MgntNvL/036-copy.jpg",
    "https://i.ibb.co/JcVsVvd/037-copy.jpg",
    "https://i.ibb.co/VWRjwn7/038-copy.jpg",
    "https://i.ibb.co/MhXmJn0/039-copy.jpg",
    "https://i.ibb.co/p3nNDBd/040-copy.jpg",
    "https://i.ibb.co/my7JFMk/041-1-copy.jpg",
    "https://i.ibb.co/8YpGgN8/042-1-copy.jpg",
    "https://i.ibb.co/sbjKbYL/043-1-copy.jpg",
    "https://i.ibb.co/41spSMn/044-1-copy.jpg",
    "https://i.ibb.co/YXF0bmN/045-1-copy.jpg",
    "https://i.ibb.co/KKYcQhX/046-1-copy.jpg",
    "https://i.ibb.co/ysRcKkK/047-1-copy.jpg",
    "https://i.ibb.co/T8P4zj7/048-1-copy.jpg",
    "https://i.ibb.co/wS59mRK/049-1-copy.jpg",
    "https://i.ibb.co/dWG9ckL/999.jpg"
  ]
}