{
  "cover": "https://i.ibb.co/B3SfGsN/001.jpg",
  "title": "Boarding Diary - Chapter 004 [UNCENSORED]",
  "images": [
    "https://i.ibb.co/3BhvQkK/1.jpg",
    "https://i.ibb.co/nrS1zXL/2.jpg",
    "https://i.ibb.co/NyGrvZN/3.jpg",
    "https://i.ibb.co/60tNjK8/4.jpg"
  ]
}