{
  "cover": "https://i.ibb.co/TkyDn4w/Cover.jpg",
  "title": "StepMother Friend - Chapter 001 [UNCENSORED]",
  "images": [
    "https://i.ibb.co/YpNkfCk/1.jpg",
    "https://i.ibb.co/ctYDsfC/2.jpg",
    "https://i.ibb.co/KwRqxJb/3.jpg",
    "https://i.ibb.co/XfP94rL/4.jpg"
  ]
}