{
  "cover": "https://i.ibb.co/B3SfGsN/001.jpg",
  "title": "Boarding Diary - Chapter 001 [UNCENSORED]",
  "images": [
    "https://i.ibb.co/c3gVvnK/1.jpg",
    "https://i.ibb.co/5MnKG3f/2.jpg",
    "https://i.ibb.co/djGHCXP/3.jpg",
    "https://i.ibb.co/tb0zptT/4.jpg"
  ]
}