EESchema Schematic File Version 4
EELAYER 29 0
EELAYER END
$Descr A4 11693 8268
encoding utf-8
Sheet 1 1
Title "pixie"
Date "2019-07-05"
Rev "1"
Comp "Ballarat Hackerspace"
Comment1 "firnsy"
Comment2 ""
Comment3 ""
Comment4 ""
$EndDescr
$Comp
L Connector_Generic:Conn_01x06 J4
U 1 1 5D1EFD41
P 9200 5000
F 0 "J4" H 9280 5042 50  0000 L CNN
F 1 "MATRIX" H 9280 4951 50  0000 L CNN
F 2 "lib_fp:WS2812B_8x8_Matrix" H 9200 5000 50  0001 C CNN
F 3 "~" H 9200 5000 50  0001 C CNN
	1    9200 5000
	1    0    0    -1  
$EndComp
$Comp
L Connector_Generic:Conn_01x04 J2
U 1 1 5D1F08CD
P 1750 2500
F 0 "J2" H 1830 2492 50  0000 L CNN
F 1 "ULTRA_2" H 1830 2401 50  0000 L CNN
F 2 "Connector_PinHeader_2.54mm:PinHeader_1x04_P2.54mm_Vertical" H 1750 2500 50  0001 C CNN
F 3 "~" H 1750 2500 50  0001 C CNN
	1    1750 2500
	-1   0    0    -1  
$EndComp
$Comp
L Device:R_PHOTO R8
U 1 1 5D1F1C97
P 2850 1450
F 0 "R8" H 2920 1496 50  0000 L CNN
F 1 "PHOTO_1" H 2920 1405 50  0000 L CNN
F 2 "OptoDevice:R_LDR_D6.4mm_P3.4mm_Vertical" V 2900 1200 50  0001 L CNN
F 3 "~" H 2850 1400 50  0001 C CNN
	1    2850 1450
	1    0    0    -1  
$EndComp
$Comp
L Connector_Generic:Conn_01x04 J1
U 1 1 5D1F28FC
P 1750 1400
F 0 "J1" H 1830 1392 50  0000 L CNN
F 1 "ULTRA_1" H 1830 1301 50  0000 L CNN
F 2 "Connector_PinHeader_2.54mm:PinHeader_1x04_P2.54mm_Vertical" H 1750 1400 50  0001 C CNN
F 3 "~" H 1750 1400 50  0001 C CNN
	1    1750 1400
	-1   0    0    -1  
$EndComp
$Comp
L Amplifier_Operational:LM324 U1
U 1 1 5D1F4000
P 3300 4650
F 0 "U1" H 3300 5017 50  0000 C CNN
F 1 "LM324" H 3300 4926 50  0000 C CNN
F 2 "Package_DIP:DIP-14_W7.62mm" H 3250 4750 50  0001 C CNN
F 3 "http://www.ti.com/lit/ds/symlink/lm2902-n.pdf" H 3350 4850 50  0001 C CNN
	1    3300 4650
	1    0    0    -1  
$EndComp
$Comp
L Amplifier_Operational:LM324 U1
U 2 1 5D1F60A5
P 5250 4550
F 0 "U1" H 5250 4917 50  0000 C CNN
F 1 "LM324" H 5250 4826 50  0000 C CNN
F 2 "Package_DIP:DIP-14_W7.62mm" H 5200 4650 50  0001 C CNN
F 3 "http://www.ti.com/lit/ds/symlink/lm2902-n.pdf" H 5300 4750 50  0001 C CNN
	2    5250 4550
	1    0    0    -1  
$EndComp
$Comp
L Amplifier_Operational:LM324 U1
U 5 1 5D1F7F52
P 5950 3650
F 0 "U1" H 5908 3696 50  0000 L CNN
F 1 "LM324" H 5908 3605 50  0000 L CNN
F 2 "Package_DIP:DIP-14_W7.62mm" H 5900 3750 50  0001 C CNN
F 3 "http://www.ti.com/lit/ds/symlink/lm2902-n.pdf" H 6000 3850 50  0001 C CNN
	5    5950 3650
	1    0    0    -1  
$EndComp
$Comp
L Device:R_Small R18
U 1 1 5D1FD228
P 5250 4850
F 0 "R18" V 5150 4850 50  0000 C CNN
F 1 "1M" V 5350 4850 50  0000 C CNN
F 2 "Resistor_THT:R_Axial_DIN0207_L6.3mm_D2.5mm_P10.16mm_Horizontal" H 5250 4850 50  0001 C CNN
F 3 "~" H 5250 4850 50  0001 C CNN
	1    5250 4850
	0    1    1    0   
$EndComp
$Comp
L Device:R_Small R7
U 1 1 5D1FD610
P 2800 5250
F 0 "R7" H 2741 5204 50  0000 R CNN
F 1 "10k" H 2741 5295 50  0000 R CNN
F 2 "Resistor_THT:R_Axial_DIN0207_L6.3mm_D2.5mm_P10.16mm_Horizontal" H 2800 5250 50  0001 C CNN
F 3 "~" H 2800 5250 50  0001 C CNN
	1    2800 5250
	1    0    0    1   
$EndComp
$Comp
L Device:R_Small R10
U 1 1 5D1FD9C1
P 3200 3450
F 0 "R10" H 3259 3496 50  0000 L CNN
F 1 "100k" H 3259 3405 50  0000 L CNN
F 2 "Resistor_THT:R_Axial_DIN0207_L6.3mm_D2.5mm_P10.16mm_Horizontal" H 3200 3450 50  0001 C CNN
F 3 "~" H 3200 3450 50  0001 C CNN
	1    3200 3450
	1    0    0    -1  
$EndComp
$Comp
L Device:R_Small R11
U 1 1 5D1FE66F
P 3200 3850
F 0 "R11" H 3259 3896 50  0000 L CNN
F 1 "100k" H 3259 3805 50  0000 L CNN
F 2 "Resistor_THT:R_Axial_DIN0207_L6.3mm_D2.5mm_P10.16mm_Horizontal" H 3200 3850 50  0001 C CNN
F 3 "~" H 3200 3850 50  0001 C CNN
	1    3200 3850
	1    0    0    -1  
$EndComp
$Comp
L Device:R_Small R6
U 1 1 5D1FECCF
P 2800 3850
F 0 "R6" H 2859 3896 50  0000 L CNN
F 1 "330k" H 2859 3805 50  0000 L CNN
F 2 "Resistor_THT:R_Axial_DIN0207_L6.3mm_D2.5mm_P10.16mm_Horizontal" H 2800 3850 50  0001 C CNN
F 3 "~" H 2800 3850 50  0001 C CNN
	1    2800 3850
	1    0    0    -1  
$EndComp
$Comp
L Device:R_Small R17
U 1 1 5D1FF47C
P 4500 4650
F 0 "R17" V 4304 4650 50  0000 C CNN
F 1 "8k2" V 4395 4650 50  0000 C CNN
F 2 "Resistor_THT:R_Axial_DIN0207_L6.3mm_D2.5mm_P10.16mm_Horizontal" H 4500 4650 50  0001 C CNN
F 3 "~" H 4500 4650 50  0001 C CNN
	1    4500 4650
	0    1    1    0   
$EndComp
$Comp
L Device:R_Small R4
U 1 1 5D1FF9CA
P 2250 4800
F 0 "R4" H 2309 4846 50  0000 L CNN
F 1 "12k" H 2309 4755 50  0000 L CNN
F 2 "Resistor_THT:R_Axial_DIN0207_L6.3mm_D2.5mm_P10.16mm_Horizontal" H 2250 4800 50  0001 C CNN
F 3 "~" H 2250 4800 50  0001 C CNN
	1    2250 4800
	1    0    0    -1  
$EndComp
$Comp
L Device:C_Small C9
U 1 1 5D200988
P 5250 5150
F 0 "C9" V 5150 5150 50  0000 C CNN
F 1 "2n2" V 5350 5150 50  0000 C CNN
F 2 "Capacitor_THT:C_Disc_D5.0mm_W2.5mm_P5.00mm" H 5250 5150 50  0001 C CNN
F 3 "~" H 5250 5150 50  0001 C CNN
	1    5250 5150
	0    1    1    0   
$EndComp
$Comp
L Device:C_Small C1
U 1 1 5D203166
P 2250 4150
F 0 "C1" H 2342 4196 50  0000 L CNN
F 1 "100n" H 2342 4105 50  0000 L CNN
F 2 "Capacitor_THT:C_Disc_D5.0mm_W2.5mm_P5.00mm" H 2250 4150 50  0001 C CNN
F 3 "~" H 2250 4150 50  0001 C CNN
	1    2250 4150
	1    0    0    -1  
$EndComp
$Comp
L Device:CP_Small C6
U 1 1 5D20439A
P 3600 3850
F 0 "C6" H 3688 3896 50  0000 L CNN
F 1 "100u" H 3688 3805 50  0000 L CNN
F 2 "Capacitor_THT:CP_Radial_D10.0mm_P5.00mm" H 3600 3850 50  0001 C CNN
F 3 "~" H 3600 3850 50  0001 C CNN
	1    3600 3850
	1    0    0    -1  
$EndComp
$Comp
L Device:CP_Small C4
U 1 1 5D20485D
P 2800 5550
F 0 "C4" H 2712 5596 50  0000 R CNN
F 1 "4u7" H 2712 5505 50  0000 R CNN
F 2 "Capacitor_THT:CP_Radial_D10.0mm_P5.00mm" H 2800 5550 50  0001 C CNN
F 3 "~" H 2800 5550 50  0001 C CNN
	1    2800 5550
	-1   0    0    -1  
$EndComp
$Comp
L Device:CP_Small C7
U 1 1 5D2052C4
P 4100 4650
F 0 "C7" V 3875 4650 50  0000 C CNN
F 1 "4u7" V 3966 4650 50  0000 C CNN
F 2 "Capacitor_THT:CP_Radial_D10.0mm_P5.00mm" H 4100 4650 50  0001 C CNN
F 3 "~" H 4100 4650 50  0001 C CNN
	1    4100 4650
	0    1    1    0   
$EndComp
$Comp
L Device:CP_Small C3
U 1 1 5D20583A
P 2550 4550
F 0 "C3" V 2325 4550 50  0000 C CNN
F 1 "4u7" V 2416 4550 50  0000 C CNN
F 2 "Capacitor_THT:CP_Radial_D10.0mm_P5.00mm" H 2550 4550 50  0001 C CNN
F 3 "~" H 2550 4550 50  0001 C CNN
	1    2550 4550
	0    1    1    0   
$EndComp
$Comp
L power:GNDREF #PWR015
U 1 1 5D20976A
P 3200 4050
F 0 "#PWR015" H 3200 3800 50  0001 C CNN
F 1 "GNDREF" H 3205 3877 50  0001 C CNN
F 2 "" H 3200 4050 50  0001 C CNN
F 3 "" H 3200 4050 50  0001 C CNN
	1    3200 4050
	1    0    0    -1  
$EndComp
$Comp
L power:+5V #PWR07
U 1 1 5D209FAA
P 2050 3850
F 0 "#PWR07" H 2050 3700 50  0001 C CNN
F 1 "+5V" H 2065 4023 50  0000 C CNN
F 2 "" H 2050 3850 50  0001 C CNN
F 3 "" H 2050 3850 50  0001 C CNN
	1    2050 3850
	1    0    0    -1  
$EndComp
$Comp
L power:+3.3V #PWR014
U 1 1 5D20A757
P 3200 3250
F 0 "#PWR014" H 3200 3100 50  0001 C CNN
F 1 "+3.3V" H 3215 3423 50  0000 C CNN
F 2 "" H 3200 3250 50  0001 C CNN
F 3 "" H 3200 3250 50  0001 C CNN
	1    3200 3250
	1    0    0    -1  
$EndComp
$Comp
L Device:R_Small R9
U 1 1 5D20B46F
P 2850 1900
F 0 "R9" H 2909 1946 50  0000 L CNN
F 1 "10k" H 2909 1855 50  0000 L CNN
F 2 "Resistor_THT:R_Axial_DIN0207_L6.3mm_D2.5mm_P10.16mm_Horizontal" H 2850 1900 50  0001 C CNN
F 3 "~" H 2850 1900 50  0001 C CNN
	1    2850 1900
	1    0    0    -1  
$EndComp
Wire Wire Line
	3200 4050 3200 3950
Wire Wire Line
	1950 4550 2250 4550
$Comp
L power:GNDREF #PWR08
U 1 1 5D26F6AC
P 2050 5000
F 0 "#PWR08" H 2050 4750 50  0001 C CNN
F 1 "GNDREF" H 2055 4827 50  0001 C CNN
F 2 "" H 2050 5000 50  0001 C CNN
F 3 "" H 2050 5000 50  0001 C CNN
	1    2050 5000
	1    0    0    -1  
$EndComp
Wire Wire Line
	3200 3250 3200 3350
Wire Wire Line
	2050 4450 1950 4450
Wire Wire Line
	1950 4750 2050 4750
Wire Wire Line
	2050 4750 2050 5000
Wire Wire Line
	2800 4550 2800 3950
Wire Wire Line
	3200 3550 3200 3650
$Comp
L power:+3.3V #PWR021
U 1 1 5D2EDC5D
P 5850 3250
F 0 "#PWR021" H 5850 3100 50  0001 C CNN
F 1 "+3.3V" H 5865 3423 50  0000 C CNN
F 2 "" H 5850 3250 50  0001 C CNN
F 3 "" H 5850 3250 50  0001 C CNN
	1    5850 3250
	1    0    0    -1  
$EndComp
$Comp
L power:GNDREF #PWR022
U 1 1 5D2EE243
P 5850 4050
F 0 "#PWR022" H 5850 3800 50  0001 C CNN
F 1 "GNDREF" H 5855 3877 50  0001 C CNN
F 2 "" H 5850 4050 50  0001 C CNN
F 3 "" H 5850 4050 50  0001 C CNN
	1    5850 4050
	1    0    0    -1  
$EndComp
Wire Wire Line
	5850 4050 5850 3950
Wire Wire Line
	5850 3250 5850 3350
Wire Wire Line
	2800 3750 2800 3650
Wire Wire Line
	2800 3650 3200 3650
Connection ~ 3200 3650
Wire Wire Line
	3200 3650 3200 3750
$Comp
L Device:C_Small C5
U 1 1 5D301787
P 3300 5250
F 0 "C5" V 3200 5250 50  0000 C CNN
F 1 "2n2" V 3400 5250 50  0000 C CNN
F 2 "Capacitor_THT:C_Disc_D5.0mm_W2.5mm_P5.00mm" H 3300 5250 50  0001 C CNN
F 3 "~" H 3300 5250 50  0001 C CNN
	1    3300 5250
	0    1    1    0   
$EndComp
$Comp
L Device:R_Small R12
U 1 1 5D1F9243
P 3300 4950
F 0 "R12" V 3200 4950 50  0000 C CNN
F 1 "1M" V 3400 4950 50  0000 C CNN
F 2 "Resistor_THT:R_Axial_DIN0207_L6.3mm_D2.5mm_P10.16mm_Horizontal" H 3300 4950 50  0001 C CNN
F 3 "~" H 3300 4950 50  0001 C CNN
	1    3300 4950
	0    1    1    0   
$EndComp
$Comp
L power:GNDREF #PWR010
U 1 1 5D327DA6
P 2250 5000
F 0 "#PWR010" H 2250 4750 50  0001 C CNN
F 1 "GNDREF" H 2255 4827 50  0001 C CNN
F 2 "" H 2250 5000 50  0001 C CNN
F 3 "" H 2250 5000 50  0001 C CNN
	1    2250 5000
	1    0    0    -1  
$EndComp
Wire Wire Line
	2250 4900 2250 5000
Wire Wire Line
	2250 4700 2250 4550
Connection ~ 2250 4550
Wire Wire Line
	2250 4550 2450 4550
Wire Wire Line
	2650 4550 2800 4550
Connection ~ 2800 4550
Wire Wire Line
	2800 4550 3000 4550
Wire Wire Line
	3000 4750 2800 4750
Wire Wire Line
	2800 5350 2800 5450
$Comp
L power:GNDREF #PWR011
U 1 1 5D33DA4A
P 2800 5750
F 0 "#PWR011" H 2800 5500 50  0001 C CNN
F 1 "GNDREF" H 2805 5577 50  0001 C CNN
F 2 "" H 2800 5750 50  0001 C CNN
F 3 "" H 2800 5750 50  0001 C CNN
	1    2800 5750
	1    0    0    -1  
$EndComp
Wire Wire Line
	2800 5650 2800 5750
Wire Wire Line
	3600 4650 3800 4650
Wire Wire Line
	3800 4650 3800 4950
Wire Wire Line
	3800 4950 3500 4950
Wire Wire Line
	3200 4950 3100 4950
Wire Wire Line
	2800 4750 2800 4950
Wire Wire Line
	3400 5250 3500 5250
Wire Wire Line
	3500 5250 3500 4950
Connection ~ 3500 4950
Wire Wire Line
	3500 4950 3400 4950
Wire Wire Line
	3200 5250 3100 5250
Wire Wire Line
	3100 5250 3100 4950
Connection ~ 3100 4950
Wire Wire Line
	3100 4950 2800 4950
Wire Wire Line
	2800 5150 2800 4950
Connection ~ 2800 4950
Wire Wire Line
	4950 4650 4850 4650
Wire Wire Line
	4850 4650 4850 4850
Wire Wire Line
	4850 4850 5050 4850
Wire Wire Line
	5350 4850 5450 4850
Wire Wire Line
	5650 4850 5650 4550
Wire Wire Line
	5650 4550 5550 4550
Wire Wire Line
	4400 4650 4200 4650
Wire Wire Line
	3800 4650 4000 4650
Connection ~ 3800 4650
Wire Wire Line
	5450 4850 5450 5150
Wire Wire Line
	5450 5150 5350 5150
Connection ~ 5450 4850
Wire Wire Line
	5450 4850 5650 4850
Wire Wire Line
	5150 5150 5050 5150
Wire Wire Line
	5050 5150 5050 4850
Connection ~ 5050 4850
Wire Wire Line
	5050 4850 5150 4850
$Comp
L power:GNDREF #PWR016
U 1 1 5D3E54B4
P 3600 4050
F 0 "#PWR016" H 3600 3800 50  0001 C CNN
F 1 "GNDREF" H 3605 3877 50  0001 C CNN
F 2 "" H 3600 4050 50  0001 C CNN
F 3 "" H 3600 4050 50  0001 C CNN
	1    3600 4050
	1    0    0    -1  
$EndComp
Wire Wire Line
	3200 3650 3600 3650
Wire Wire Line
	3600 3650 3600 3750
Wire Wire Line
	3600 3950 3600 4050
$Comp
L power:GNDREF #PWR09
U 1 1 5D3FE4F6
P 2250 4350
F 0 "#PWR09" H 2250 4100 50  0001 C CNN
F 1 "GNDREF" H 2255 4177 50  0001 C CNN
F 2 "" H 2250 4350 50  0001 C CNN
F 3 "" H 2250 4350 50  0001 C CNN
	1    2250 4350
	1    0    0    -1  
$EndComp
Wire Wire Line
	2050 3850 2050 3950
Wire Wire Line
	2250 4050 2250 3950
Wire Wire Line
	2250 3950 2050 3950
Connection ~ 2050 3950
Wire Wire Line
	2050 3950 2050 4450
Wire Wire Line
	2250 4250 2250 4350
Wire Wire Line
	4850 4650 4600 4650
Connection ~ 4850 4650
Wire Wire Line
	4950 4450 4850 4450
Wire Wire Line
	4850 4450 4850 3650
Wire Wire Line
	4850 3650 3600 3650
Connection ~ 3600 3650
$Comp
L Connector:TestPoint_2Pole TP2
U 1 1 5D43DD74
P 5850 4850
F 0 "TP2" V 5804 4908 50  0000 L CNN
F 1 "TestPoint_2Pole" V 5895 4908 50  0001 L CNN
F 2 "TestPoint:TestPoint_2Pads_Pitch2.54mm_Drill0.8mm" H 5850 4850 50  0001 C CNN
F 3 "~" H 5850 4850 50  0001 C CNN
	1    5850 4850
	0    1    1    0   
$EndComp
$Comp
L power:GNDREF #PWR023
U 1 1 5D43F1A2
P 5850 5150
F 0 "#PWR023" H 5850 4900 50  0001 C CNN
F 1 "GNDREF" H 5855 4977 50  0001 C CNN
F 2 "" H 5850 5150 50  0001 C CNN
F 3 "" H 5850 5150 50  0001 C CNN
	1    5850 5150
	1    0    0    -1  
$EndComp
Wire Wire Line
	5650 4550 5850 4550
Wire Wire Line
	5850 4550 5850 4650
Connection ~ 5650 4550
Wire Wire Line
	5850 5050 5850 5150
Text Label 5850 4550 0    50   ~ 0
DOPPLER
$Comp
L power:+3.3V #PWR024
U 1 1 5D49CB09
P 7650 1150
F 0 "#PWR024" H 7650 1000 50  0001 C CNN
F 1 "+3.3V" H 7665 1323 50  0000 C CNN
F 2 "" H 7650 1150 50  0001 C CNN
F 3 "" H 7650 1150 50  0001 C CNN
	1    7650 1150
	1    0    0    -1  
$EndComp
Wire Wire Line
	7650 1150 7650 2550
Wire Wire Line
	7650 2550 8050 2550
$Comp
L power:GNDREF #PWR025
U 1 1 5D4A1227
P 7850 3550
F 0 "#PWR025" H 7850 3300 50  0001 C CNN
F 1 "GNDREF" H 7855 3377 50  0001 C CNN
F 2 "" H 7850 3550 50  0001 C CNN
F 3 "" H 7850 3550 50  0001 C CNN
	1    7850 3550
	1    0    0    -1  
$EndComp
Wire Wire Line
	7850 3550 7850 2250
Wire Wire Line
	7850 2250 8050 2250
$Comp
L power:GNDREF #PWR030
U 1 1 5D4A5196
P 9850 3550
F 0 "#PWR030" H 9850 3300 50  0001 C CNN
F 1 "GNDREF" H 9855 3377 50  0001 C CNN
F 2 "" H 9850 3550 50  0001 C CNN
F 3 "" H 9850 3550 50  0001 C CNN
	1    9850 3550
	1    0    0    -1  
$EndComp
Wire Wire Line
	9650 3250 9850 3250
Wire Wire Line
	9850 3250 9850 3550
$Comp
L power:+5V #PWR029
U 1 1 5D4A77F4
P 9850 1150
F 0 "#PWR029" H 9850 1000 50  0001 C CNN
F 1 "+5V" H 9865 1323 50  0000 C CNN
F 2 "" H 9850 1150 50  0001 C CNN
F 3 "" H 9850 1150 50  0001 C CNN
	1    9850 1150
	1    0    0    -1  
$EndComp
Wire Wire Line
	9650 1550 9850 1550
Wire Wire Line
	9850 1550 9850 1150
Wire Wire Line
	9650 1650 9850 1650
Wire Wire Line
	9850 1650 9850 3250
Connection ~ 9850 3250
$Comp
L Device:D_Small D1
U 1 1 5D1FC2E5
P 8700 4900
F 0 "D1" H 8700 4695 50  0000 C CNN
F 1 "1N4004" H 8700 4786 50  0000 C CNN
F 2 "Diode_THT:D_DO-15_P10.16mm_Horizontal" V 8700 4900 50  0001 C CNN
F 3 "~" V 8700 4900 50  0001 C CNN
	1    8700 4900
	-1   0    0    -1  
$EndComp
$Comp
L power:GNDREF #PWR06
U 1 1 5D23EFAB
P 2050 2800
F 0 "#PWR06" H 2050 2550 50  0001 C CNN
F 1 "GNDREF" H 2055 2627 50  0001 C CNN
F 2 "" H 2050 2800 50  0001 C CNN
F 3 "" H 2050 2800 50  0001 C CNN
	1    2050 2800
	1    0    0    -1  
$EndComp
$Comp
L power:+5V #PWR05
U 1 1 5D24C7CB
P 2050 2300
F 0 "#PWR05" H 2050 2150 50  0001 C CNN
F 1 "+5V" H 2065 2473 50  0000 C CNN
F 2 "" H 2050 2300 50  0001 C CNN
F 3 "" H 2050 2300 50  0001 C CNN
	1    2050 2300
	1    0    0    -1  
$EndComp
Wire Wire Line
	1950 2700 2050 2700
Wire Wire Line
	2050 2700 2050 2800
Wire Wire Line
	1950 2400 2050 2400
Wire Wire Line
	2050 2400 2050 2300
$Comp
L power:+5V #PWR03
U 1 1 5D259143
P 2050 1200
F 0 "#PWR03" H 2050 1050 50  0001 C CNN
F 1 "+5V" H 2065 1373 50  0000 C CNN
F 2 "" H 2050 1200 50  0001 C CNN
F 3 "" H 2050 1200 50  0001 C CNN
	1    2050 1200
	1    0    0    -1  
$EndComp
$Comp
L power:GNDREF #PWR04
U 1 1 5D2597F4
P 2050 1700
F 0 "#PWR04" H 2050 1450 50  0001 C CNN
F 1 "GNDREF" H 2055 1527 50  0001 C CNN
F 2 "" H 2050 1700 50  0001 C CNN
F 3 "" H 2050 1700 50  0001 C CNN
	1    2050 1700
	1    0    0    -1  
$EndComp
Wire Wire Line
	1950 1600 2050 1600
Wire Wire Line
	2050 1600 2050 1700
Wire Wire Line
	1950 1300 2050 1300
Wire Wire Line
	2050 1300 2050 1200
$Comp
L power:+3.3V #PWR012
U 1 1 5D27D9E8
P 2850 1200
F 0 "#PWR012" H 2850 1050 50  0001 C CNN
F 1 "+3.3V" H 2865 1373 50  0000 C CNN
F 2 "" H 2850 1200 50  0001 C CNN
F 3 "" H 2850 1200 50  0001 C CNN
	1    2850 1200
	1    0    0    -1  
$EndComp
$Comp
L power:GNDREF #PWR013
U 1 1 5D27E033
P 2850 2100
F 0 "#PWR013" H 2850 1850 50  0001 C CNN
F 1 "GNDREF" H 2855 1927 50  0001 C CNN
F 2 "" H 2850 2100 50  0001 C CNN
F 3 "" H 2850 2100 50  0001 C CNN
	1    2850 2100
	1    0    0    -1  
$EndComp
Wire Wire Line
	2850 1200 2850 1300
Wire Wire Line
	2850 2000 2850 2100
Wire Wire Line
	2850 1600 2850 1800
$Comp
L Device:R_PHOTO R14
U 1 1 5D291259
P 3650 1450
F 0 "R14" H 3720 1496 50  0000 L CNN
F 1 "PHOTO_2" H 3720 1405 50  0000 L CNN
F 2 "OptoDevice:R_LDR_D6.4mm_P3.4mm_Vertical" V 3700 1200 50  0001 L CNN
F 3 "~" H 3650 1400 50  0001 C CNN
	1    3650 1450
	1    0    0    -1  
$EndComp
$Comp
L Device:R_Small R15
U 1 1 5D291263
P 3650 1900
F 0 "R15" H 3709 1946 50  0000 L CNN
F 1 "10k" H 3709 1855 50  0000 L CNN
F 2 "Resistor_THT:R_Axial_DIN0207_L6.3mm_D2.5mm_P10.16mm_Horizontal" H 3650 1900 50  0001 C CNN
F 3 "~" H 3650 1900 50  0001 C CNN
	1    3650 1900
	1    0    0    -1  
$EndComp
$Comp
L power:+3.3V #PWR017
U 1 1 5D29126D
P 3650 1200
F 0 "#PWR017" H 3650 1050 50  0001 C CNN
F 1 "+3.3V" H 3665 1373 50  0000 C CNN
F 2 "" H 3650 1200 50  0001 C CNN
F 3 "" H 3650 1200 50  0001 C CNN
	1    3650 1200
	1    0    0    -1  
$EndComp
$Comp
L power:GNDREF #PWR018
U 1 1 5D291277
P 3650 2100
F 0 "#PWR018" H 3650 1850 50  0001 C CNN
F 1 "GNDREF" H 3655 1927 50  0001 C CNN
F 2 "" H 3650 2100 50  0001 C CNN
F 3 "" H 3650 2100 50  0001 C CNN
	1    3650 2100
	1    0    0    -1  
$EndComp
Wire Wire Line
	3650 1200 3650 1300
Wire Wire Line
	3650 2000 3650 2100
Wire Wire Line
	3650 1600 3650 1800
Text Label 1950 1400 0    50   ~ 0
TRIG1
Text Label 2350 1500 0    50   ~ 0
ECHO1
Text Label 1950 2500 0    50   ~ 0
TRIG2
Text Label 2350 2600 0    50   ~ 0
ECHO2
Text Label 2850 1700 0    50   ~ 0
LIGHT1
Text Label 3650 1700 0    50   ~ 0
LIGHT2
$Comp
L power:+5V #PWR026
U 1 1 5D213B9B
P 8200 4700
F 0 "#PWR026" H 8200 4550 50  0001 C CNN
F 1 "+5V" H 8215 4873 50  0000 C CNN
F 2 "" H 8200 4700 50  0001 C CNN
F 3 "" H 8200 4700 50  0001 C CNN
	1    8200 4700
	1    0    0    -1  
$EndComp
$Comp
L Device:CP_Small C10
U 1 1 5D21C7E5
P 8200 5100
F 0 "C10" H 8288 5146 50  0000 L CNN
F 1 "1500u" H 8288 5055 50  0000 L CNN
F 2 "Capacitor_THT:CP_Radial_D10.0mm_P5.00mm" H 8200 5100 50  0001 C CNN
F 3 "~" H 8200 5100 50  0001 C CNN
	1    8200 5100
	-1   0    0    -1  
$EndComp
$Comp
L power:GNDREF #PWR027
U 1 1 5D22F08E
P 8200 5400
F 0 "#PWR027" H 8200 5150 50  0001 C CNN
F 1 "GNDREF" H 8205 5227 50  0001 C CNN
F 2 "" H 8200 5400 50  0001 C CNN
F 3 "" H 8200 5400 50  0001 C CNN
	1    8200 5400
	1    0    0    -1  
$EndComp
$Comp
L power:GNDREF #PWR028
U 1 1 5D2331A9
P 8900 5400
F 0 "#PWR028" H 8900 5150 50  0001 C CNN
F 1 "GNDREF" H 8905 5227 50  0001 C CNN
F 2 "" H 8900 5400 50  0001 C CNN
F 3 "" H 8900 5400 50  0001 C CNN
	1    8900 5400
	1    0    0    -1  
$EndComp
Wire Wire Line
	8900 5400 8900 5300
Wire Wire Line
	8900 5000 9000 5000
Wire Wire Line
	8200 5200 8200 5400
Wire Wire Line
	8200 4700 8200 4900
Wire Wire Line
	8200 4900 8600 4900
Wire Wire Line
	8800 4900 9000 4900
Wire Wire Line
	8200 5000 8200 4900
Connection ~ 8200 4900
Text Label 8050 1950 2    50   ~ 0
ECHO2
Text Label 9650 2950 0    50   ~ 0
ECHO1
Text Label 9650 2850 0    50   ~ 0
TRIG1
Text Label 8050 1750 2    50   ~ 0
DOPPLER
Text Label 8050 1650 2    50   ~ 0
LIGHT2
Text Label 8050 1550 2    50   ~ 0
LIGHT1
$Comp
L Amplifier_Operational:LM324 U1
U 3 1 5D221579
P 3550 6550
F 0 "U1" H 3550 6917 50  0000 C CNN
F 1 "LM324" H 3550 6826 50  0000 C CNN
F 2 "Package_DIP:DIP-14_W7.62mm" H 3500 6650 50  0001 C CNN
F 3 "http://www.ti.com/lit/ds/symlink/lm2902-n.pdf" H 3600 6750 50  0001 C CNN
	3    3550 6550
	1    0    0    -1  
$EndComp
$Comp
L Device:Microphone MK1
U 1 1 5D22349D
P 1800 6950
F 0 "MK1" H 1930 6996 50  0000 L CNN
F 1 "Microphone" H 1930 6905 50  0000 L CNN
F 2 "Connector_PinHeader_2.54mm:PinHeader_1x02_P2.54mm_Vertical" V 1800 7050 50  0001 C CNN
F 3 "~" V 1800 7050 50  0001 C CNN
F 4 "https://au.rs-online.com/web/p/condenser-microphone-components/7243134/" H 1800 6950 50  0001 C CNN "RSO"
	1    1800 6950
	1    0    0    -1  
$EndComp
$Comp
L Device:R_Small R1
U 1 1 5D22919E
P 1800 6450
F 0 "R1" H 1859 6496 50  0000 L CNN
F 1 "1k" H 1859 6405 50  0000 L CNN
F 2 "Resistor_THT:R_Axial_DIN0207_L6.3mm_D2.5mm_P10.16mm_Horizontal" H 1800 6450 50  0001 C CNN
F 3 "~" H 1800 6450 50  0001 C CNN
	1    1800 6450
	1    0    0    -1  
$EndComp
$Comp
L power:+3.3V #PWR01
U 1 1 5D2291A8
P 1800 6250
F 0 "#PWR01" H 1800 6100 50  0001 C CNN
F 1 "+3.3V" H 1815 6423 50  0000 C CNN
F 2 "" H 1800 6250 50  0001 C CNN
F 3 "" H 1800 6250 50  0001 C CNN
	1    1800 6250
	1    0    0    -1  
$EndComp
Wire Wire Line
	1800 6250 1800 6350
Text Label 4850 3650 0    50   ~ 0
BIAS
Text Label 3250 6450 2    50   ~ 0
BIAS
Wire Wire Line
	1800 6550 1800 6650
$Comp
L Device:R_Small R5
U 1 1 5D25846C
P 2750 6650
F 0 "R5" V 2850 6700 50  0000 R CNN
F 1 "1k" V 2650 6700 50  0000 R CNN
F 2 "Resistor_THT:R_Axial_DIN0207_L6.3mm_D2.5mm_P10.16mm_Horizontal" H 2750 6650 50  0001 C CNN
F 3 "~" H 2750 6650 50  0001 C CNN
	1    2750 6650
	0    1    -1   0   
$EndComp
$Comp
L Device:C_Small C2
U 1 1 5D259052
P 2350 6650
F 0 "C2" V 2250 6650 50  0000 C CNN
F 1 "1u" V 2450 6650 50  0000 C CNN
F 2 "Capacitor_THT:C_Disc_D5.0mm_W2.5mm_P5.00mm" H 2350 6650 50  0001 C CNN
F 3 "~" H 2350 6650 50  0001 C CNN
	1    2350 6650
	0    1    1    0   
$EndComp
$Comp
L Device:R_Small R13
U 1 1 5D260E29
P 3550 6850
F 0 "R13" V 3650 6900 50  0000 R CNN
F 1 "220k" V 3450 6900 50  0000 R CNN
F 2 "Resistor_THT:R_Axial_DIN0207_L6.3mm_D2.5mm_P10.16mm_Horizontal" H 3550 6850 50  0001 C CNN
F 3 "~" H 3550 6850 50  0001 C CNN
	1    3550 6850
	0    1    -1   0   
$EndComp
Wire Wire Line
	3850 6550 4050 6550
Wire Wire Line
	4050 6550 4050 6850
Wire Wire Line
	4050 6850 3650 6850
Wire Wire Line
	1800 6650 2250 6650
Connection ~ 1800 6650
Wire Wire Line
	1800 6650 1800 6750
Wire Wire Line
	2450 6650 2650 6650
Wire Wire Line
	2850 6650 3050 6650
Wire Wire Line
	3050 6650 3050 6850
Wire Wire Line
	3050 6850 3450 6850
Connection ~ 3050 6650
Wire Wire Line
	3050 6650 3250 6650
$Comp
L power:GNDREF #PWR02
U 1 1 5D29E873
P 1800 7250
F 0 "#PWR02" H 1800 7000 50  0001 C CNN
F 1 "GNDREF" H 1805 7077 50  0001 C CNN
F 2 "" H 1800 7250 50  0001 C CNN
F 3 "" H 1800 7250 50  0001 C CNN
	1    1800 7250
	1    0    0    -1  
$EndComp
Wire Wire Line
	1800 7250 1800 7150
$Comp
L Device:R_Small R16
U 1 1 5D2A2BBA
P 4350 6550
F 0 "R16" V 4450 6600 50  0000 R CNN
F 1 "1k5" V 4250 6600 50  0000 R CNN
F 2 "Resistor_THT:R_Axial_DIN0207_L6.3mm_D2.5mm_P10.16mm_Horizontal" H 4350 6550 50  0001 C CNN
F 3 "~" H 4350 6550 50  0001 C CNN
	1    4350 6550
	0    1    -1   0   
$EndComp
Wire Wire Line
	4250 6550 4050 6550
Connection ~ 4050 6550
$Comp
L Device:C_Small C8
U 1 1 5D2A6AAB
P 4650 6850
F 0 "C8" V 4550 6850 50  0000 C CNN
F 1 "10n" V 4750 6850 50  0000 C CNN
F 2 "Capacitor_THT:C_Disc_D5.0mm_W2.5mm_P5.00mm" H 4650 6850 50  0001 C CNN
F 3 "~" H 4650 6850 50  0001 C CNN
	1    4650 6850
	1    0    0    -1  
$EndComp
$Comp
L power:GNDREF #PWR019
U 1 1 5D2A7DA7
P 4650 7150
F 0 "#PWR019" H 4650 6900 50  0001 C CNN
F 1 "GNDREF" H 4655 6977 50  0001 C CNN
F 2 "" H 4650 7150 50  0001 C CNN
F 3 "" H 4650 7150 50  0001 C CNN
	1    4650 7150
	1    0    0    -1  
$EndComp
Wire Wire Line
	4650 7150 4650 6950
Wire Wire Line
	4650 6550 4450 6550
$Comp
L Connector:TestPoint_2Pole TP1
U 1 1 5D2B6C90
P 4900 6850
F 0 "TP1" V 4854 6908 50  0000 L CNN
F 1 "TestPoint_2Pole" V 4945 6908 50  0001 L CNN
F 2 "TestPoint:TestPoint_2Pads_Pitch2.54mm_Drill0.8mm" H 4900 6850 50  0001 C CNN
F 3 "~" H 4900 6850 50  0001 C CNN
	1    4900 6850
	0    1    1    0   
$EndComp
Wire Wire Line
	4650 6550 4900 6550
Wire Wire Line
	4900 6550 4900 6650
Connection ~ 4650 6550
$Comp
L power:GNDREF #PWR020
U 1 1 5D2BB33E
P 4900 7150
F 0 "#PWR020" H 4900 6900 50  0001 C CNN
F 1 "GNDREF" H 4905 6977 50  0001 C CNN
F 2 "" H 4900 7150 50  0001 C CNN
F 3 "" H 4900 7150 50  0001 C CNN
	1    4900 7150
	1    0    0    -1  
$EndComp
Wire Wire Line
	4900 7050 4900 7150
Wire Wire Line
	4650 6750 4650 6550
Text Label 4900 6550 0    50   ~ 0
MIC
Text Label 9650 1450 0    50   ~ 0
MIC
NoConn ~ 9650 1350
NoConn ~ 9650 1850
NoConn ~ 9650 1950
NoConn ~ 9650 2050
NoConn ~ 9650 2150
NoConn ~ 9650 2250
NoConn ~ 9650 2350
NoConn ~ 9650 2450
NoConn ~ 8050 3250
NoConn ~ 8050 3150
NoConn ~ 8050 3050
NoConn ~ 8050 2950
NoConn ~ 8050 2850
NoConn ~ 8050 2750
NoConn ~ 8050 2650
NoConn ~ 8050 2450
NoConn ~ 8050 2350
NoConn ~ 8050 2150
NoConn ~ 8050 1850
NoConn ~ 8050 1450
NoConn ~ 8050 1350
$Comp
L Device:R_Small R2
U 1 1 5D3B4229
P 2250 1500
F 0 "R2" V 2054 1500 50  0000 C CNN
F 1 "1k" V 2145 1500 50  0000 C CNN
F 2 "Resistor_THT:R_Axial_DIN0207_L6.3mm_D2.5mm_P10.16mm_Horizontal" H 2250 1500 50  0001 C CNN
F 3 "~" H 2250 1500 50  0001 C CNN
	1    2250 1500
	0    1    1    0   
$EndComp
$Comp
L Device:R_Small R3
U 1 1 5D3BB9C3
P 2250 2600
F 0 "R3" V 2054 2600 50  0000 C CNN
F 1 "1k" V 2145 2600 50  0000 C CNN
F 2 "Resistor_THT:R_Axial_DIN0207_L6.3mm_D2.5mm_P10.16mm_Horizontal" H 2250 2600 50  0001 C CNN
F 3 "~" H 2250 2600 50  0001 C CNN
	1    2250 2600
	0    1    1    0   
$EndComp
Wire Wire Line
	1950 1500 2150 1500
Wire Wire Line
	1950 2600 2150 2600
Text Label 8600 4800 2    50   ~ 0
MATRIX
$Comp
L Device:R_Small R19
U 1 1 5D4B6BAA
P 8700 4800
F 0 "R19" V 8504 4800 50  0000 C CNN
F 1 "330" V 8595 4800 50  0000 C CNN
F 2 "Resistor_THT:R_Axial_DIN0207_L6.3mm_D2.5mm_P10.16mm_Horizontal" H 8700 4800 50  0001 C CNN
F 3 "~" H 8700 4800 50  0001 C CNN
	1    8700 4800
	0    -1   1    0   
$EndComp
Wire Wire Line
	9000 5300 8900 5300
Connection ~ 8900 5300
Wire Wire Line
	8900 5300 8900 5000
NoConn ~ 9000 5200
NoConn ~ 9000 5100
Wire Wire Line
	8800 4800 9000 4800
$Comp
L Connector_Generic:Conn_01x04 J3
U 1 1 5D1F103B
P 1750 4550
F 0 "J3" H 1750 4750 50  0000 C CNN
F 1 "DOPPLER" H 1850 4250 50  0000 C CNN
F 2 "lib_fp:hb100" H 1750 4550 50  0001 C CNN
F 3 "~" H 1750 4550 50  0001 C CNN
	1    1750 4550
	-1   0    0    -1  
$EndComp
Wire Wire Line
	1950 4650 2050 4650
Wire Wire Line
	2050 4650 2050 4750
Connection ~ 2050 4750
$Comp
L Connector:TestPoint_2Pole TP3
U 1 1 5D2F642D
P 3800 5400
F 0 "TP3" V 3754 5458 50  0000 L CNN
F 1 "TestPoint_2Pole" V 3845 5458 50  0001 L CNN
F 2 "TestPoint:TestPoint_2Pads_Pitch2.54mm_Drill0.8mm" H 3800 5400 50  0001 C CNN
F 3 "~" H 3800 5400 50  0001 C CNN
	1    3800 5400
	0    1    1    0   
$EndComp
$Comp
L power:GNDREF #PWR0101
U 1 1 5D2F7DA4
P 3800 5750
F 0 "#PWR0101" H 3800 5500 50  0001 C CNN
F 1 "GNDREF" H 3805 5577 50  0001 C CNN
F 2 "" H 3800 5750 50  0001 C CNN
F 3 "" H 3800 5750 50  0001 C CNN
	1    3800 5750
	1    0    0    -1  
$EndComp
Wire Wire Line
	3800 4950 3800 5200
Connection ~ 3800 4950
Wire Wire Line
	3800 5600 3800 5750
Text Label 9650 2650 0    50   ~ 0
MATRIX
NoConn ~ 9650 2750
NoConn ~ 9650 1750
NoConn ~ 9650 3050
$Comp
L local:MH-ET_LIVE_mini U2
U 1 1 5D1EC623
P 8850 2300
F 0 "U2" H 8850 3515 50  0000 C CNN
F 1 "MH-ET_LIVE_mini" H 8850 3424 50  0000 C CNN
F 2 "lib_fp:mh-et-live-esp32-minikit" H 9950 1500 50  0001 C CNN
F 3 "" H 9950 1500 50  0001 C CNN
	1    8850 2300
	1    0    0    -1  
$EndComp
Text Label 8050 2050 2    50   ~ 0
TRIG2
$EndSCHEMATC
