G04 #@! TF.FileFunction,Soldermask,Top*
%FSLAX46Y46*%
G04 Gerber Fmt 4.6, Leading zero omitted, Abs format (unit mm)*
G04 Created by KiCad (PCBNEW 4.0.6) date Tue Sep  4 18:54:11 2018*
%MOMM*%
%LPD*%
G01*
G04 APERTURE LIST*
%ADD10C,0.100000*%
%ADD11R,2.100000X2.100000*%
%ADD12O,2.100000X2.100000*%
%ADD13C,1.400000*%
%ADD14R,1.400000X1.400000*%
%ADD15C,1.924000*%
%ADD16R,2.200000X2.200000*%
%ADD17O,2.200000X2.200000*%
%ADD18C,2.000000*%
%ADD19O,2.000000X2.000000*%
G04 APERTURE END LIST*
D10*
D11*
X115500000Y-136500000D03*
D12*
X118040000Y-136500000D03*
X120580000Y-136500000D03*
X123120000Y-136500000D03*
D11*
X151210000Y-94060000D03*
D12*
X151210000Y-91520000D03*
X153750000Y-94060000D03*
X153750000Y-91520000D03*
X156290000Y-94060000D03*
X156290000Y-91520000D03*
X158830000Y-94060000D03*
X158830000Y-91520000D03*
X161370000Y-94060000D03*
X161370000Y-91520000D03*
D11*
X130000000Y-94060000D03*
D12*
X130000000Y-91520000D03*
X132540000Y-94060000D03*
X132540000Y-91520000D03*
X135080000Y-94060000D03*
X135080000Y-91520000D03*
X137620000Y-94060000D03*
X137620000Y-91520000D03*
X140160000Y-94060000D03*
X140160000Y-91520000D03*
D11*
X118110000Y-91520000D03*
D12*
X120650000Y-91520000D03*
D13*
X127000000Y-100330000D03*
X125730000Y-101600000D03*
D14*
X125730000Y-99060000D03*
D15*
X115650000Y-129620000D03*
X118190000Y-129620000D03*
X120730000Y-129620000D03*
X123270000Y-129620000D03*
X125810000Y-129620000D03*
X128350000Y-129620000D03*
X130890000Y-129620000D03*
X133430000Y-129620000D03*
X135970000Y-129620000D03*
X138510000Y-129620000D03*
X141050000Y-129620000D03*
X143590000Y-129620000D03*
X146130000Y-129620000D03*
X148670000Y-129620000D03*
X151210000Y-129620000D03*
X153750000Y-129620000D03*
X153750000Y-109300000D03*
X151210000Y-109300000D03*
X148670000Y-109300000D03*
X146130000Y-109300000D03*
X143590000Y-109300000D03*
X141050000Y-109300000D03*
X138510000Y-109300000D03*
X135970000Y-109300000D03*
X133430000Y-109300000D03*
X130890000Y-109300000D03*
X128350000Y-109300000D03*
X125810000Y-109300000D03*
D16*
X110490000Y-96520000D03*
D17*
X120650000Y-96520000D03*
D18*
X120650000Y-100330000D03*
D19*
X110490000Y-100330000D03*
M02*
