G04 #@! TF.FileFunction,Copper,L2,Bot,Signal*
%FSLAX46Y46*%
G04 Gerber Fmt 4.6, Leading zero omitted, Abs format (unit mm)*
G04 Created by KiCad (PCBNEW 4.0.6) date Tue Sep  4 18:54:11 2018*
%MOMM*%
%LPD*%
G01*
G04 APERTURE LIST*
%ADD10C,0.100000*%
%ADD11R,1.700000X1.700000*%
%ADD12O,1.700000X1.700000*%
%ADD13C,1.000000*%
%ADD14R,1.000000X1.000000*%
%ADD15C,1.524000*%
%ADD16R,1.800000X1.800000*%
%ADD17O,1.800000X1.800000*%
%ADD18C,1.600000*%
%ADD19O,1.600000X1.600000*%
%ADD20C,0.600000*%
%ADD21C,0.750000*%
%ADD22C,0.400000*%
%ADD23C,0.500000*%
%ADD24C,0.254000*%
G04 APERTURE END LIST*
D10*
D11*
X115500000Y-136500000D03*
D12*
X118040000Y-136500000D03*
X120580000Y-136500000D03*
X123120000Y-136500000D03*
D11*
X151210000Y-94060000D03*
D12*
X151210000Y-91520000D03*
X153750000Y-94060000D03*
X153750000Y-91520000D03*
X156290000Y-94060000D03*
X156290000Y-91520000D03*
X158830000Y-94060000D03*
X158830000Y-91520000D03*
X161370000Y-94060000D03*
X161370000Y-91520000D03*
D11*
X130000000Y-94060000D03*
D12*
X130000000Y-91520000D03*
X132540000Y-94060000D03*
X132540000Y-91520000D03*
X135080000Y-94060000D03*
X135080000Y-91520000D03*
X137620000Y-94060000D03*
X137620000Y-91520000D03*
X140160000Y-94060000D03*
X140160000Y-91520000D03*
D11*
X118110000Y-91520000D03*
D12*
X120650000Y-91520000D03*
D13*
X127000000Y-100330000D03*
X125730000Y-101600000D03*
D14*
X125730000Y-99060000D03*
D15*
X115650000Y-129620000D03*
X118190000Y-129620000D03*
X120730000Y-129620000D03*
X123270000Y-129620000D03*
X125810000Y-129620000D03*
X128350000Y-129620000D03*
X130890000Y-129620000D03*
X133430000Y-129620000D03*
X135970000Y-129620000D03*
X138510000Y-129620000D03*
X141050000Y-129620000D03*
X143590000Y-129620000D03*
X146130000Y-129620000D03*
X148670000Y-129620000D03*
X151210000Y-129620000D03*
X153750000Y-129620000D03*
X153750000Y-109300000D03*
X151210000Y-109300000D03*
X148670000Y-109300000D03*
X146130000Y-109300000D03*
X143590000Y-109300000D03*
X141050000Y-109300000D03*
X138510000Y-109300000D03*
X135970000Y-109300000D03*
X133430000Y-109300000D03*
X130890000Y-109300000D03*
X128350000Y-109300000D03*
X125810000Y-109300000D03*
D16*
X110490000Y-96520000D03*
D17*
X120650000Y-96520000D03*
D18*
X120650000Y-100330000D03*
D19*
X110490000Y-100330000D03*
D20*
X141056649Y-125845594D03*
X153670000Y-100330000D03*
D21*
X110490000Y-96520000D02*
X110490000Y-97665357D01*
X110490000Y-97665357D02*
X112395000Y-99570357D01*
X112395000Y-99570357D02*
X112395000Y-123364844D01*
X110490000Y-96520000D02*
X110490000Y-94870000D01*
X110490000Y-94870000D02*
X113840000Y-91520000D01*
X116510000Y-91520000D02*
X118110000Y-91520000D01*
X113840000Y-91520000D02*
X116510000Y-91520000D01*
X128730156Y-115236844D02*
X130890000Y-113077000D01*
X130890000Y-113077000D02*
X130890000Y-109300000D01*
X120523000Y-115236844D02*
X128730156Y-115236844D01*
X112395000Y-123364844D02*
X120523000Y-115236844D01*
X115500000Y-136500000D02*
X115500000Y-134900000D01*
X115500000Y-134900000D02*
X112395000Y-131795000D01*
X112395000Y-131795000D02*
X112395000Y-123364844D01*
D22*
X120650000Y-91520000D02*
X120650000Y-96520000D01*
X120650000Y-96520000D02*
X124090000Y-96520000D01*
X124090000Y-96520000D02*
X125730000Y-98160000D01*
X125730000Y-98160000D02*
X125730000Y-99060000D01*
D21*
X123270000Y-129620000D02*
X123270000Y-136350000D01*
X123270000Y-136350000D02*
X123120000Y-136500000D01*
X158830000Y-91520000D02*
X156310000Y-89000000D01*
X156310000Y-89000000D02*
X140140000Y-89000000D01*
X140140000Y-89000000D02*
X137620000Y-91520000D01*
X132540000Y-91520000D02*
X130000000Y-91520000D01*
X135080000Y-91520000D02*
X132540000Y-91520000D01*
X137620000Y-91520000D02*
X135080000Y-91520000D01*
X158830000Y-91520000D02*
X158830000Y-94060000D01*
D23*
X151210000Y-91520000D02*
X151210000Y-94060000D01*
X153750000Y-91520000D02*
X153750000Y-94060000D01*
X154940000Y-101600000D02*
X156290000Y-100250000D01*
X156290000Y-100250000D02*
X156290000Y-94060000D01*
X143510000Y-101600000D02*
X154940000Y-101600000D01*
X141050000Y-104060000D02*
X143510000Y-101600000D01*
X141050000Y-109300000D02*
X141050000Y-104060000D01*
X156290000Y-91520000D02*
X156290000Y-94060000D01*
X160020000Y-104140000D02*
X161370000Y-102790000D01*
X161370000Y-102790000D02*
X161370000Y-94060000D01*
X144780000Y-104140000D02*
X160020000Y-104140000D01*
X143590000Y-105330000D02*
X144780000Y-104140000D01*
X143590000Y-109300000D02*
X143590000Y-105330000D01*
X161370000Y-91520000D02*
X161370000Y-94060000D01*
D22*
X141050000Y-125852243D02*
X141056649Y-125845594D01*
X141050000Y-129620000D02*
X141050000Y-125852243D01*
X144860000Y-94060000D02*
X140160000Y-94060000D01*
X144860000Y-94060000D02*
X147400000Y-94060000D01*
X147400000Y-94060000D02*
X153670000Y-100330000D01*
X120650000Y-100330000D02*
X127000000Y-100330000D01*
D24*
G36*
X166373000Y-134873000D02*
X162500000Y-134873000D01*
X162450590Y-134883006D01*
X162408965Y-134911447D01*
X162381685Y-134953841D01*
X162373000Y-135000000D01*
X162373000Y-138873000D01*
X108627000Y-138873000D01*
X108627000Y-92627000D01*
X111304644Y-92627000D01*
X109775822Y-94155822D01*
X109556882Y-94483490D01*
X109480000Y-94870000D01*
X109480000Y-94993258D01*
X109354683Y-95016838D01*
X109138559Y-95155910D01*
X108993569Y-95368110D01*
X108942560Y-95620000D01*
X108942560Y-97420000D01*
X108986838Y-97655317D01*
X109125910Y-97871441D01*
X109338110Y-98016431D01*
X109563733Y-98062121D01*
X109775822Y-98379535D01*
X110319591Y-98923304D01*
X109912736Y-99004233D01*
X109447189Y-99315302D01*
X109136120Y-99780849D01*
X109026887Y-100330000D01*
X109136120Y-100879151D01*
X109447189Y-101344698D01*
X109912736Y-101655767D01*
X110461887Y-101765000D01*
X110518113Y-101765000D01*
X111067264Y-101655767D01*
X111385000Y-101443462D01*
X111385000Y-131795000D01*
X111461882Y-132181510D01*
X111680822Y-132509178D01*
X114295302Y-135123658D01*
X114198559Y-135185910D01*
X114053569Y-135398110D01*
X114002560Y-135650000D01*
X114002560Y-137350000D01*
X114046838Y-137585317D01*
X114185910Y-137801441D01*
X114398110Y-137946431D01*
X114650000Y-137997440D01*
X116350000Y-137997440D01*
X116585317Y-137953162D01*
X116801441Y-137814090D01*
X116946431Y-137601890D01*
X116960086Y-137534459D01*
X116989946Y-137579147D01*
X117471715Y-137901054D01*
X118040000Y-138014093D01*
X118608285Y-137901054D01*
X119090054Y-137579147D01*
X119310000Y-137249974D01*
X119529946Y-137579147D01*
X120011715Y-137901054D01*
X120580000Y-138014093D01*
X121148285Y-137901054D01*
X121630054Y-137579147D01*
X121857702Y-137238447D01*
X121924817Y-137381358D01*
X122353076Y-137771645D01*
X122763110Y-137941476D01*
X122993000Y-137820155D01*
X122993000Y-136627000D01*
X123247000Y-136627000D01*
X123247000Y-137820155D01*
X123476890Y-137941476D01*
X123886924Y-137771645D01*
X124315183Y-137381358D01*
X124561486Y-136856892D01*
X124440819Y-136627000D01*
X123247000Y-136627000D01*
X122993000Y-136627000D01*
X122973000Y-136627000D01*
X122973000Y-136373000D01*
X122993000Y-136373000D01*
X122993000Y-135179845D01*
X123247000Y-135179845D01*
X123247000Y-136373000D01*
X124440819Y-136373000D01*
X124561486Y-136143108D01*
X124315183Y-135618642D01*
X123886924Y-135228355D01*
X123476890Y-135058524D01*
X123247000Y-135179845D01*
X122993000Y-135179845D01*
X122763110Y-135058524D01*
X122353076Y-135228355D01*
X121924817Y-135618642D01*
X121857702Y-135761553D01*
X121630054Y-135420853D01*
X121148285Y-135098946D01*
X120580000Y-134985907D01*
X120011715Y-135098946D01*
X119529946Y-135420853D01*
X119310000Y-135750026D01*
X119090054Y-135420853D01*
X118608285Y-135098946D01*
X118040000Y-134985907D01*
X117471715Y-135098946D01*
X116989946Y-135420853D01*
X116962150Y-135462452D01*
X116953162Y-135414683D01*
X116814090Y-135198559D01*
X116601890Y-135053569D01*
X116510000Y-135034961D01*
X116510000Y-134900000D01*
X116433118Y-134513490D01*
X116214178Y-134185822D01*
X113405000Y-131376644D01*
X113405000Y-129896661D01*
X114252758Y-129896661D01*
X114464990Y-130410303D01*
X114857630Y-130803629D01*
X115370900Y-131016757D01*
X115926661Y-131017242D01*
X116440303Y-130805010D01*
X116833629Y-130412370D01*
X116919949Y-130204488D01*
X117004990Y-130410303D01*
X117397630Y-130803629D01*
X117910900Y-131016757D01*
X118466661Y-131017242D01*
X118980303Y-130805010D01*
X119373629Y-130412370D01*
X119459949Y-130204488D01*
X119544990Y-130410303D01*
X119937630Y-130803629D01*
X120450900Y-131016757D01*
X121006661Y-131017242D01*
X121520303Y-130805010D01*
X121725457Y-130600213D01*
X122469392Y-130600213D01*
X122538857Y-130842397D01*
X123062302Y-131029144D01*
X123617368Y-131001362D01*
X124001143Y-130842397D01*
X124070608Y-130600213D01*
X123270000Y-129799605D01*
X122469392Y-130600213D01*
X121725457Y-130600213D01*
X121913629Y-130412370D01*
X121993395Y-130220273D01*
X122047603Y-130351143D01*
X122289787Y-130420608D01*
X123090395Y-129620000D01*
X123449605Y-129620000D01*
X124250213Y-130420608D01*
X124492397Y-130351143D01*
X124542509Y-130210682D01*
X124624990Y-130410303D01*
X125017630Y-130803629D01*
X125530900Y-131016757D01*
X126086661Y-131017242D01*
X126600303Y-130805010D01*
X126993629Y-130412370D01*
X127079949Y-130204488D01*
X127164990Y-130410303D01*
X127557630Y-130803629D01*
X128070900Y-131016757D01*
X128626661Y-131017242D01*
X129140303Y-130805010D01*
X129533629Y-130412370D01*
X129619949Y-130204488D01*
X129704990Y-130410303D01*
X130097630Y-130803629D01*
X130610900Y-131016757D01*
X131166661Y-131017242D01*
X131680303Y-130805010D01*
X132073629Y-130412370D01*
X132159949Y-130204488D01*
X132244990Y-130410303D01*
X132637630Y-130803629D01*
X133150900Y-131016757D01*
X133706661Y-131017242D01*
X134220303Y-130805010D01*
X134613629Y-130412370D01*
X134699949Y-130204488D01*
X134784990Y-130410303D01*
X135177630Y-130803629D01*
X135690900Y-131016757D01*
X136246661Y-131017242D01*
X136760303Y-130805010D01*
X137153629Y-130412370D01*
X137239949Y-130204488D01*
X137324990Y-130410303D01*
X137717630Y-130803629D01*
X138230900Y-131016757D01*
X138786661Y-131017242D01*
X139300303Y-130805010D01*
X139693629Y-130412370D01*
X139779949Y-130204488D01*
X139864990Y-130410303D01*
X140257630Y-130803629D01*
X140770900Y-131016757D01*
X141326661Y-131017242D01*
X141840303Y-130805010D01*
X142233629Y-130412370D01*
X142319949Y-130204488D01*
X142404990Y-130410303D01*
X142797630Y-130803629D01*
X143310900Y-131016757D01*
X143866661Y-131017242D01*
X144380303Y-130805010D01*
X144773629Y-130412370D01*
X144859949Y-130204488D01*
X144944990Y-130410303D01*
X145337630Y-130803629D01*
X145850900Y-131016757D01*
X146406661Y-131017242D01*
X146920303Y-130805010D01*
X147313629Y-130412370D01*
X147399949Y-130204488D01*
X147484990Y-130410303D01*
X147877630Y-130803629D01*
X148390900Y-131016757D01*
X148946661Y-131017242D01*
X149460303Y-130805010D01*
X149853629Y-130412370D01*
X149939949Y-130204488D01*
X150024990Y-130410303D01*
X150417630Y-130803629D01*
X150930900Y-131016757D01*
X151486661Y-131017242D01*
X152000303Y-130805010D01*
X152393629Y-130412370D01*
X152479949Y-130204488D01*
X152564990Y-130410303D01*
X152957630Y-130803629D01*
X153470900Y-131016757D01*
X154026661Y-131017242D01*
X154540303Y-130805010D01*
X154933629Y-130412370D01*
X155146757Y-129899100D01*
X155147242Y-129343339D01*
X154935010Y-128829697D01*
X154542370Y-128436371D01*
X154029100Y-128223243D01*
X153473339Y-128222758D01*
X152959697Y-128434990D01*
X152566371Y-128827630D01*
X152480051Y-129035512D01*
X152395010Y-128829697D01*
X152002370Y-128436371D01*
X151489100Y-128223243D01*
X150933339Y-128222758D01*
X150419697Y-128434990D01*
X150026371Y-128827630D01*
X149940051Y-129035512D01*
X149855010Y-128829697D01*
X149462370Y-128436371D01*
X148949100Y-128223243D01*
X148393339Y-128222758D01*
X147879697Y-128434990D01*
X147486371Y-128827630D01*
X147400051Y-129035512D01*
X147315010Y-128829697D01*
X146922370Y-128436371D01*
X146409100Y-128223243D01*
X145853339Y-128222758D01*
X145339697Y-128434990D01*
X144946371Y-128827630D01*
X144860051Y-129035512D01*
X144775010Y-128829697D01*
X144382370Y-128436371D01*
X143869100Y-128223243D01*
X143313339Y-128222758D01*
X142799697Y-128434990D01*
X142406371Y-128827630D01*
X142320051Y-129035512D01*
X142235010Y-128829697D01*
X141885000Y-128479075D01*
X141885000Y-126288841D01*
X141991487Y-126032393D01*
X141991811Y-125660427D01*
X141849766Y-125316651D01*
X141586976Y-125053402D01*
X141243448Y-124910756D01*
X140871482Y-124910432D01*
X140527706Y-125052477D01*
X140264457Y-125315267D01*
X140121811Y-125658795D01*
X140121487Y-126030761D01*
X140215000Y-126257080D01*
X140215000Y-128479609D01*
X139866371Y-128827630D01*
X139780051Y-129035512D01*
X139695010Y-128829697D01*
X139302370Y-128436371D01*
X138789100Y-128223243D01*
X138233339Y-128222758D01*
X137719697Y-128434990D01*
X137326371Y-128827630D01*
X137240051Y-129035512D01*
X137155010Y-128829697D01*
X136762370Y-128436371D01*
X136249100Y-128223243D01*
X135693339Y-128222758D01*
X135179697Y-128434990D01*
X134786371Y-128827630D01*
X134700051Y-129035512D01*
X134615010Y-128829697D01*
X134222370Y-128436371D01*
X133709100Y-128223243D01*
X133153339Y-128222758D01*
X132639697Y-128434990D01*
X132246371Y-128827630D01*
X132160051Y-129035512D01*
X132075010Y-128829697D01*
X131682370Y-128436371D01*
X131169100Y-128223243D01*
X130613339Y-128222758D01*
X130099697Y-128434990D01*
X129706371Y-128827630D01*
X129620051Y-129035512D01*
X129535010Y-128829697D01*
X129142370Y-128436371D01*
X128629100Y-128223243D01*
X128073339Y-128222758D01*
X127559697Y-128434990D01*
X127166371Y-128827630D01*
X127080051Y-129035512D01*
X126995010Y-128829697D01*
X126602370Y-128436371D01*
X126089100Y-128223243D01*
X125533339Y-128222758D01*
X125019697Y-128434990D01*
X124626371Y-128827630D01*
X124546605Y-129019727D01*
X124492397Y-128888857D01*
X124250213Y-128819392D01*
X123449605Y-129620000D01*
X123090395Y-129620000D01*
X122289787Y-128819392D01*
X122047603Y-128888857D01*
X121997491Y-129029318D01*
X121915010Y-128829697D01*
X121725432Y-128639787D01*
X122469392Y-128639787D01*
X123270000Y-129440395D01*
X124070608Y-128639787D01*
X124001143Y-128397603D01*
X123477698Y-128210856D01*
X122922632Y-128238638D01*
X122538857Y-128397603D01*
X122469392Y-128639787D01*
X121725432Y-128639787D01*
X121522370Y-128436371D01*
X121009100Y-128223243D01*
X120453339Y-128222758D01*
X119939697Y-128434990D01*
X119546371Y-128827630D01*
X119460051Y-129035512D01*
X119375010Y-128829697D01*
X118982370Y-128436371D01*
X118469100Y-128223243D01*
X117913339Y-128222758D01*
X117399697Y-128434990D01*
X117006371Y-128827630D01*
X116920051Y-129035512D01*
X116835010Y-128829697D01*
X116442370Y-128436371D01*
X115929100Y-128223243D01*
X115373339Y-128222758D01*
X114859697Y-128434990D01*
X114466371Y-128827630D01*
X114253243Y-129340900D01*
X114252758Y-129896661D01*
X113405000Y-129896661D01*
X113405000Y-123783200D01*
X120941356Y-116246844D01*
X128730156Y-116246844D01*
X129116666Y-116169962D01*
X129444334Y-115951022D01*
X131604178Y-113791178D01*
X131823118Y-113463510D01*
X131900000Y-113077000D01*
X131900000Y-110265696D01*
X132073629Y-110092370D01*
X132159949Y-109884488D01*
X132244990Y-110090303D01*
X132637630Y-110483629D01*
X133150900Y-110696757D01*
X133706661Y-110697242D01*
X134220303Y-110485010D01*
X134613629Y-110092370D01*
X134699949Y-109884488D01*
X134784990Y-110090303D01*
X135177630Y-110483629D01*
X135690900Y-110696757D01*
X136246661Y-110697242D01*
X136760303Y-110485010D01*
X137153629Y-110092370D01*
X137239949Y-109884488D01*
X137324990Y-110090303D01*
X137717630Y-110483629D01*
X138230900Y-110696757D01*
X138786661Y-110697242D01*
X139300303Y-110485010D01*
X139693629Y-110092370D01*
X139779949Y-109884488D01*
X139864990Y-110090303D01*
X140257630Y-110483629D01*
X140770900Y-110696757D01*
X141326661Y-110697242D01*
X141840303Y-110485010D01*
X142233629Y-110092370D01*
X142319949Y-109884488D01*
X142404990Y-110090303D01*
X142797630Y-110483629D01*
X143310900Y-110696757D01*
X143866661Y-110697242D01*
X144380303Y-110485010D01*
X144773629Y-110092370D01*
X144859949Y-109884488D01*
X144944990Y-110090303D01*
X145337630Y-110483629D01*
X145850900Y-110696757D01*
X146406661Y-110697242D01*
X146920303Y-110485010D01*
X147313629Y-110092370D01*
X147399949Y-109884488D01*
X147484990Y-110090303D01*
X147877630Y-110483629D01*
X148390900Y-110696757D01*
X148946661Y-110697242D01*
X149460303Y-110485010D01*
X149853629Y-110092370D01*
X149939949Y-109884488D01*
X150024990Y-110090303D01*
X150417630Y-110483629D01*
X150930900Y-110696757D01*
X151486661Y-110697242D01*
X152000303Y-110485010D01*
X152393629Y-110092370D01*
X152479949Y-109884488D01*
X152564990Y-110090303D01*
X152957630Y-110483629D01*
X153470900Y-110696757D01*
X154026661Y-110697242D01*
X154540303Y-110485010D01*
X154933629Y-110092370D01*
X155146757Y-109579100D01*
X155147242Y-109023339D01*
X154935010Y-108509697D01*
X154542370Y-108116371D01*
X154029100Y-107903243D01*
X153473339Y-107902758D01*
X152959697Y-108114990D01*
X152566371Y-108507630D01*
X152480051Y-108715512D01*
X152395010Y-108509697D01*
X152002370Y-108116371D01*
X151489100Y-107903243D01*
X150933339Y-107902758D01*
X150419697Y-108114990D01*
X150026371Y-108507630D01*
X149940051Y-108715512D01*
X149855010Y-108509697D01*
X149462370Y-108116371D01*
X148949100Y-107903243D01*
X148393339Y-107902758D01*
X147879697Y-108114990D01*
X147486371Y-108507630D01*
X147400051Y-108715512D01*
X147315010Y-108509697D01*
X146922370Y-108116371D01*
X146409100Y-107903243D01*
X145853339Y-107902758D01*
X145339697Y-108114990D01*
X144946371Y-108507630D01*
X144860051Y-108715512D01*
X144775010Y-108509697D01*
X144475000Y-108209163D01*
X144475000Y-105696580D01*
X145146579Y-105025000D01*
X160019995Y-105025000D01*
X160020000Y-105025001D01*
X160302484Y-104968810D01*
X160358675Y-104957633D01*
X160645790Y-104765790D01*
X161995787Y-103415792D01*
X161995790Y-103415790D01*
X162187633Y-103128675D01*
X162255000Y-102790000D01*
X162255000Y-95249432D01*
X162420054Y-95139147D01*
X162741961Y-94657378D01*
X162855000Y-94089093D01*
X162855000Y-94030907D01*
X162741961Y-93462622D01*
X162420054Y-92980853D01*
X162255000Y-92870568D01*
X162255000Y-92709432D01*
X162420054Y-92599147D01*
X162741961Y-92117378D01*
X162855000Y-91549093D01*
X162855000Y-91490907D01*
X162741961Y-90922622D01*
X162420054Y-90440853D01*
X161938285Y-90118946D01*
X161370000Y-90005907D01*
X160801715Y-90118946D01*
X160319946Y-90440853D01*
X160092298Y-90781553D01*
X160025183Y-90638642D01*
X159596924Y-90248355D01*
X159186890Y-90078524D01*
X158957000Y-90199845D01*
X158957000Y-91393000D01*
X158977000Y-91393000D01*
X158977000Y-91647000D01*
X158957000Y-91647000D01*
X158957000Y-93933000D01*
X158977000Y-93933000D01*
X158977000Y-94187000D01*
X158957000Y-94187000D01*
X158957000Y-95380155D01*
X159186890Y-95501476D01*
X159596924Y-95331645D01*
X160025183Y-94941358D01*
X160092298Y-94798447D01*
X160319946Y-95139147D01*
X160485000Y-95249432D01*
X160485000Y-102423421D01*
X159653420Y-103255000D01*
X144780005Y-103255000D01*
X144780000Y-103254999D01*
X144441325Y-103322367D01*
X144154210Y-103514210D01*
X144154208Y-103514213D01*
X142964210Y-104704210D01*
X142772367Y-104991325D01*
X142772367Y-104991326D01*
X142704999Y-105330000D01*
X142705000Y-105330005D01*
X142705000Y-108209522D01*
X142406371Y-108507630D01*
X142320051Y-108715512D01*
X142235010Y-108509697D01*
X141935000Y-108209163D01*
X141935000Y-104426580D01*
X143876579Y-102485000D01*
X154939995Y-102485000D01*
X154940000Y-102485001D01*
X155222484Y-102428810D01*
X155278675Y-102417633D01*
X155565790Y-102225790D01*
X156915787Y-100875792D01*
X156915790Y-100875790D01*
X157107633Y-100588675D01*
X157175000Y-100250000D01*
X157175000Y-95249432D01*
X157340054Y-95139147D01*
X157567702Y-94798447D01*
X157634817Y-94941358D01*
X158063076Y-95331645D01*
X158473110Y-95501476D01*
X158703000Y-95380155D01*
X158703000Y-94187000D01*
X158683000Y-94187000D01*
X158683000Y-93933000D01*
X158703000Y-93933000D01*
X158703000Y-91647000D01*
X158683000Y-91647000D01*
X158683000Y-91393000D01*
X158703000Y-91393000D01*
X158703000Y-90199845D01*
X158473110Y-90078524D01*
X158063076Y-90248355D01*
X157634817Y-90638642D01*
X157567702Y-90781553D01*
X157340054Y-90440853D01*
X156858285Y-90118946D01*
X156290000Y-90005907D01*
X155721715Y-90118946D01*
X155239946Y-90440853D01*
X155020000Y-90770026D01*
X154800054Y-90440853D01*
X154318285Y-90118946D01*
X153750000Y-90005907D01*
X153181715Y-90118946D01*
X152699946Y-90440853D01*
X152480000Y-90770026D01*
X152260054Y-90440853D01*
X151778285Y-90118946D01*
X151210000Y-90005907D01*
X150641715Y-90118946D01*
X150159946Y-90440853D01*
X149838039Y-90922622D01*
X149725000Y-91490907D01*
X149725000Y-91549093D01*
X149838039Y-92117378D01*
X150159946Y-92599147D01*
X150161179Y-92599971D01*
X150124683Y-92606838D01*
X149908559Y-92745910D01*
X149763569Y-92958110D01*
X149712560Y-93210000D01*
X149712560Y-94910000D01*
X149756838Y-95145317D01*
X149895910Y-95361441D01*
X150108110Y-95506431D01*
X150360000Y-95557440D01*
X152060000Y-95557440D01*
X152295317Y-95513162D01*
X152511441Y-95374090D01*
X152656431Y-95161890D01*
X152670086Y-95094459D01*
X152699946Y-95139147D01*
X153181715Y-95461054D01*
X153750000Y-95574093D01*
X154318285Y-95461054D01*
X154800054Y-95139147D01*
X155020000Y-94809974D01*
X155239946Y-95139147D01*
X155405000Y-95249432D01*
X155405000Y-99883421D01*
X154573420Y-100715000D01*
X154522537Y-100715000D01*
X154604838Y-100516799D01*
X154605162Y-100144833D01*
X154463117Y-99801057D01*
X154200327Y-99537808D01*
X153958090Y-99437222D01*
X147990434Y-93469566D01*
X147937520Y-93434210D01*
X147719541Y-93288561D01*
X147400000Y-93225000D01*
X141373187Y-93225000D01*
X141210054Y-92980853D01*
X140924422Y-92790000D01*
X141210054Y-92599147D01*
X141531961Y-92117378D01*
X141645000Y-91549093D01*
X141645000Y-91490907D01*
X141531961Y-90922622D01*
X141210054Y-90440853D01*
X140728285Y-90118946D01*
X140160000Y-90005907D01*
X139591715Y-90118946D01*
X139109946Y-90440853D01*
X138882298Y-90781553D01*
X138815183Y-90638642D01*
X138386924Y-90248355D01*
X137976890Y-90078524D01*
X137747000Y-90199845D01*
X137747000Y-91393000D01*
X137767000Y-91393000D01*
X137767000Y-91647000D01*
X137747000Y-91647000D01*
X137747000Y-91667000D01*
X137493000Y-91667000D01*
X137493000Y-91647000D01*
X135207000Y-91647000D01*
X135207000Y-91667000D01*
X134953000Y-91667000D01*
X134953000Y-91647000D01*
X132667000Y-91647000D01*
X132667000Y-91667000D01*
X132413000Y-91667000D01*
X132413000Y-91647000D01*
X130127000Y-91647000D01*
X130127000Y-91667000D01*
X129873000Y-91667000D01*
X129873000Y-91647000D01*
X128679181Y-91647000D01*
X128558514Y-91876892D01*
X128804817Y-92401358D01*
X129010504Y-92588808D01*
X128914683Y-92606838D01*
X128698559Y-92745910D01*
X128553569Y-92958110D01*
X128502560Y-93210000D01*
X128502560Y-94910000D01*
X128546838Y-95145317D01*
X128685910Y-95361441D01*
X128898110Y-95506431D01*
X129150000Y-95557440D01*
X130850000Y-95557440D01*
X131085317Y-95513162D01*
X131301441Y-95374090D01*
X131446431Y-95161890D01*
X131460086Y-95094459D01*
X131489946Y-95139147D01*
X131971715Y-95461054D01*
X132540000Y-95574093D01*
X133108285Y-95461054D01*
X133590054Y-95139147D01*
X133810000Y-94809974D01*
X134029946Y-95139147D01*
X134511715Y-95461054D01*
X135080000Y-95574093D01*
X135648285Y-95461054D01*
X136130054Y-95139147D01*
X136350000Y-94809974D01*
X136569946Y-95139147D01*
X137051715Y-95461054D01*
X137620000Y-95574093D01*
X138188285Y-95461054D01*
X138670054Y-95139147D01*
X138890000Y-94809974D01*
X139109946Y-95139147D01*
X139591715Y-95461054D01*
X140160000Y-95574093D01*
X140728285Y-95461054D01*
X141210054Y-95139147D01*
X141373187Y-94895000D01*
X147054132Y-94895000D01*
X152777465Y-100618333D01*
X152817407Y-100715000D01*
X143510000Y-100715000D01*
X143171325Y-100782367D01*
X142884210Y-100974210D01*
X142884208Y-100974213D01*
X140424210Y-103434210D01*
X140232367Y-103721325D01*
X140232367Y-103721326D01*
X140164999Y-104060000D01*
X140165000Y-104060005D01*
X140165000Y-108209522D01*
X139866371Y-108507630D01*
X139780051Y-108715512D01*
X139695010Y-108509697D01*
X139302370Y-108116371D01*
X138789100Y-107903243D01*
X138233339Y-107902758D01*
X137719697Y-108114990D01*
X137326371Y-108507630D01*
X137240051Y-108715512D01*
X137155010Y-108509697D01*
X136762370Y-108116371D01*
X136249100Y-107903243D01*
X135693339Y-107902758D01*
X135179697Y-108114990D01*
X134786371Y-108507630D01*
X134700051Y-108715512D01*
X134615010Y-108509697D01*
X134222370Y-108116371D01*
X133709100Y-107903243D01*
X133153339Y-107902758D01*
X132639697Y-108114990D01*
X132246371Y-108507630D01*
X132160051Y-108715512D01*
X132075010Y-108509697D01*
X131682370Y-108116371D01*
X131169100Y-107903243D01*
X130613339Y-107902758D01*
X130099697Y-108114990D01*
X129706371Y-108507630D01*
X129620051Y-108715512D01*
X129535010Y-108509697D01*
X129142370Y-108116371D01*
X128629100Y-107903243D01*
X128073339Y-107902758D01*
X127559697Y-108114990D01*
X127166371Y-108507630D01*
X127080051Y-108715512D01*
X126995010Y-108509697D01*
X126602370Y-108116371D01*
X126089100Y-107903243D01*
X125533339Y-107902758D01*
X125019697Y-108114990D01*
X124626371Y-108507630D01*
X124413243Y-109020900D01*
X124412758Y-109576661D01*
X124624990Y-110090303D01*
X125017630Y-110483629D01*
X125530900Y-110696757D01*
X126086661Y-110697242D01*
X126600303Y-110485010D01*
X126993629Y-110092370D01*
X127079949Y-109884488D01*
X127164990Y-110090303D01*
X127557630Y-110483629D01*
X128070900Y-110696757D01*
X128626661Y-110697242D01*
X129140303Y-110485010D01*
X129533629Y-110092370D01*
X129619949Y-109884488D01*
X129704990Y-110090303D01*
X129880000Y-110265619D01*
X129880000Y-112658644D01*
X128311800Y-114226844D01*
X120523000Y-114226844D01*
X120136490Y-114303726D01*
X119808822Y-114522666D01*
X113405000Y-120926488D01*
X113405000Y-102390104D01*
X125119501Y-102390104D01*
X125156648Y-102605217D01*
X125584972Y-102748112D01*
X126035375Y-102716217D01*
X126303352Y-102605217D01*
X126340499Y-102390104D01*
X125730000Y-101779605D01*
X125119501Y-102390104D01*
X113405000Y-102390104D01*
X113405000Y-99570357D01*
X113328118Y-99183847D01*
X113109178Y-98856179D01*
X111961450Y-97708451D01*
X111986431Y-97671890D01*
X112037440Y-97420000D01*
X112037440Y-95620000D01*
X111993162Y-95384683D01*
X111854090Y-95168559D01*
X111714901Y-95073455D01*
X114258356Y-92530000D01*
X116642666Y-92530000D01*
X116656838Y-92605317D01*
X116795910Y-92821441D01*
X117008110Y-92966431D01*
X117260000Y-93017440D01*
X118960000Y-93017440D01*
X119195317Y-92973162D01*
X119411441Y-92834090D01*
X119556431Y-92621890D01*
X119570086Y-92554459D01*
X119599946Y-92599147D01*
X119815000Y-92742841D01*
X119815000Y-95247180D01*
X119534519Y-95434591D01*
X119201773Y-95932581D01*
X119084928Y-96520000D01*
X119201773Y-97107419D01*
X119534519Y-97605409D01*
X120032509Y-97938155D01*
X120619928Y-98055000D01*
X120680072Y-98055000D01*
X121267491Y-97938155D01*
X121765481Y-97605409D01*
X121932799Y-97355000D01*
X123744132Y-97355000D01*
X124659415Y-98270283D01*
X124633569Y-98308110D01*
X124582560Y-98560000D01*
X124582560Y-99495000D01*
X121844083Y-99495000D01*
X121463923Y-99114176D01*
X120936691Y-98895250D01*
X120365813Y-98894752D01*
X119838200Y-99112757D01*
X119434176Y-99516077D01*
X119215250Y-100043309D01*
X119214752Y-100614187D01*
X119432757Y-101141800D01*
X119836077Y-101545824D01*
X120363309Y-101764750D01*
X120934187Y-101765248D01*
X121461800Y-101547243D01*
X121844710Y-101165000D01*
X124678627Y-101165000D01*
X124581888Y-101454972D01*
X124613783Y-101905375D01*
X124724783Y-102173352D01*
X124939896Y-102210499D01*
X125550395Y-101600000D01*
X125536253Y-101585858D01*
X125715858Y-101406253D01*
X125730000Y-101420395D01*
X125744143Y-101406253D01*
X125923748Y-101585858D01*
X125909605Y-101600000D01*
X126520104Y-102210499D01*
X126735217Y-102173352D01*
X126878112Y-101745028D01*
X126858273Y-101464877D01*
X127224775Y-101465197D01*
X127642086Y-101292767D01*
X127961645Y-100973765D01*
X128134803Y-100556756D01*
X128135197Y-100105225D01*
X127962767Y-99687914D01*
X127643765Y-99368355D01*
X127226756Y-99195197D01*
X126877440Y-99194892D01*
X126877440Y-98560000D01*
X126833162Y-98324683D01*
X126694090Y-98108559D01*
X126532854Y-97998391D01*
X126501439Y-97840459D01*
X126320434Y-97569566D01*
X124680434Y-95929566D01*
X124606253Y-95880000D01*
X124409541Y-95748561D01*
X124090000Y-95685000D01*
X121932799Y-95685000D01*
X121765481Y-95434591D01*
X121485000Y-95247180D01*
X121485000Y-92742841D01*
X121700054Y-92599147D01*
X122021961Y-92117378D01*
X122135000Y-91549093D01*
X122135000Y-91490907D01*
X122069797Y-91163108D01*
X128558514Y-91163108D01*
X128679181Y-91393000D01*
X129873000Y-91393000D01*
X129873000Y-90199845D01*
X130127000Y-90199845D01*
X130127000Y-91393000D01*
X132413000Y-91393000D01*
X132413000Y-90199845D01*
X132667000Y-90199845D01*
X132667000Y-91393000D01*
X134953000Y-91393000D01*
X134953000Y-90199845D01*
X135207000Y-90199845D01*
X135207000Y-91393000D01*
X137493000Y-91393000D01*
X137493000Y-90199845D01*
X137263110Y-90078524D01*
X136853076Y-90248355D01*
X136424817Y-90638642D01*
X136350000Y-90797954D01*
X136275183Y-90638642D01*
X135846924Y-90248355D01*
X135436890Y-90078524D01*
X135207000Y-90199845D01*
X134953000Y-90199845D01*
X134723110Y-90078524D01*
X134313076Y-90248355D01*
X133884817Y-90638642D01*
X133810000Y-90797954D01*
X133735183Y-90638642D01*
X133306924Y-90248355D01*
X132896890Y-90078524D01*
X132667000Y-90199845D01*
X132413000Y-90199845D01*
X132183110Y-90078524D01*
X131773076Y-90248355D01*
X131344817Y-90638642D01*
X131270000Y-90797954D01*
X131195183Y-90638642D01*
X130766924Y-90248355D01*
X130356890Y-90078524D01*
X130127000Y-90199845D01*
X129873000Y-90199845D01*
X129643110Y-90078524D01*
X129233076Y-90248355D01*
X128804817Y-90638642D01*
X128558514Y-91163108D01*
X122069797Y-91163108D01*
X122021961Y-90922622D01*
X121700054Y-90440853D01*
X121218285Y-90118946D01*
X120650000Y-90005907D01*
X120081715Y-90118946D01*
X119599946Y-90440853D01*
X119572150Y-90482452D01*
X119563162Y-90434683D01*
X119424090Y-90218559D01*
X119211890Y-90073569D01*
X118960000Y-90022560D01*
X117260000Y-90022560D01*
X117024683Y-90066838D01*
X116808559Y-90205910D01*
X116663569Y-90418110D01*
X116644961Y-90510000D01*
X113840000Y-90510000D01*
X113453489Y-90586882D01*
X113125822Y-90805822D01*
X112627000Y-91304644D01*
X112627000Y-88627000D01*
X166373000Y-88627000D01*
X166373000Y-134873000D01*
X166373000Y-134873000D01*
G37*
X166373000Y-134873000D02*
X162500000Y-134873000D01*
X162450590Y-134883006D01*
X162408965Y-134911447D01*
X162381685Y-134953841D01*
X162373000Y-135000000D01*
X162373000Y-138873000D01*
X108627000Y-138873000D01*
X108627000Y-92627000D01*
X111304644Y-92627000D01*
X109775822Y-94155822D01*
X109556882Y-94483490D01*
X109480000Y-94870000D01*
X109480000Y-94993258D01*
X109354683Y-95016838D01*
X109138559Y-95155910D01*
X108993569Y-95368110D01*
X108942560Y-95620000D01*
X108942560Y-97420000D01*
X108986838Y-97655317D01*
X109125910Y-97871441D01*
X109338110Y-98016431D01*
X109563733Y-98062121D01*
X109775822Y-98379535D01*
X110319591Y-98923304D01*
X109912736Y-99004233D01*
X109447189Y-99315302D01*
X109136120Y-99780849D01*
X109026887Y-100330000D01*
X109136120Y-100879151D01*
X109447189Y-101344698D01*
X109912736Y-101655767D01*
X110461887Y-101765000D01*
X110518113Y-101765000D01*
X111067264Y-101655767D01*
X111385000Y-101443462D01*
X111385000Y-131795000D01*
X111461882Y-132181510D01*
X111680822Y-132509178D01*
X114295302Y-135123658D01*
X114198559Y-135185910D01*
X114053569Y-135398110D01*
X114002560Y-135650000D01*
X114002560Y-137350000D01*
X114046838Y-137585317D01*
X114185910Y-137801441D01*
X114398110Y-137946431D01*
X114650000Y-137997440D01*
X116350000Y-137997440D01*
X116585317Y-137953162D01*
X116801441Y-137814090D01*
X116946431Y-137601890D01*
X116960086Y-137534459D01*
X116989946Y-137579147D01*
X117471715Y-137901054D01*
X118040000Y-138014093D01*
X118608285Y-137901054D01*
X119090054Y-137579147D01*
X119310000Y-137249974D01*
X119529946Y-137579147D01*
X120011715Y-137901054D01*
X120580000Y-138014093D01*
X121148285Y-137901054D01*
X121630054Y-137579147D01*
X121857702Y-137238447D01*
X121924817Y-137381358D01*
X122353076Y-137771645D01*
X122763110Y-137941476D01*
X122993000Y-137820155D01*
X122993000Y-136627000D01*
X123247000Y-136627000D01*
X123247000Y-137820155D01*
X123476890Y-137941476D01*
X123886924Y-137771645D01*
X124315183Y-137381358D01*
X124561486Y-136856892D01*
X124440819Y-136627000D01*
X123247000Y-136627000D01*
X122993000Y-136627000D01*
X122973000Y-136627000D01*
X122973000Y-136373000D01*
X122993000Y-136373000D01*
X122993000Y-135179845D01*
X123247000Y-135179845D01*
X123247000Y-136373000D01*
X124440819Y-136373000D01*
X124561486Y-136143108D01*
X124315183Y-135618642D01*
X123886924Y-135228355D01*
X123476890Y-135058524D01*
X123247000Y-135179845D01*
X122993000Y-135179845D01*
X122763110Y-135058524D01*
X122353076Y-135228355D01*
X121924817Y-135618642D01*
X121857702Y-135761553D01*
X121630054Y-135420853D01*
X121148285Y-135098946D01*
X120580000Y-134985907D01*
X120011715Y-135098946D01*
X119529946Y-135420853D01*
X119310000Y-135750026D01*
X119090054Y-135420853D01*
X118608285Y-135098946D01*
X118040000Y-134985907D01*
X117471715Y-135098946D01*
X116989946Y-135420853D01*
X116962150Y-135462452D01*
X116953162Y-135414683D01*
X116814090Y-135198559D01*
X116601890Y-135053569D01*
X116510000Y-135034961D01*
X116510000Y-134900000D01*
X116433118Y-134513490D01*
X116214178Y-134185822D01*
X113405000Y-131376644D01*
X113405000Y-129896661D01*
X114252758Y-129896661D01*
X114464990Y-130410303D01*
X114857630Y-130803629D01*
X115370900Y-131016757D01*
X115926661Y-131017242D01*
X116440303Y-130805010D01*
X116833629Y-130412370D01*
X116919949Y-130204488D01*
X117004990Y-130410303D01*
X117397630Y-130803629D01*
X117910900Y-131016757D01*
X118466661Y-131017242D01*
X118980303Y-130805010D01*
X119373629Y-130412370D01*
X119459949Y-130204488D01*
X119544990Y-130410303D01*
X119937630Y-130803629D01*
X120450900Y-131016757D01*
X121006661Y-131017242D01*
X121520303Y-130805010D01*
X121725457Y-130600213D01*
X122469392Y-130600213D01*
X122538857Y-130842397D01*
X123062302Y-131029144D01*
X123617368Y-131001362D01*
X124001143Y-130842397D01*
X124070608Y-130600213D01*
X123270000Y-129799605D01*
X122469392Y-130600213D01*
X121725457Y-130600213D01*
X121913629Y-130412370D01*
X121993395Y-130220273D01*
X122047603Y-130351143D01*
X122289787Y-130420608D01*
X123090395Y-129620000D01*
X123449605Y-129620000D01*
X124250213Y-130420608D01*
X124492397Y-130351143D01*
X124542509Y-130210682D01*
X124624990Y-130410303D01*
X125017630Y-130803629D01*
X125530900Y-131016757D01*
X126086661Y-131017242D01*
X126600303Y-130805010D01*
X126993629Y-130412370D01*
X127079949Y-130204488D01*
X127164990Y-130410303D01*
X127557630Y-130803629D01*
X128070900Y-131016757D01*
X128626661Y-131017242D01*
X129140303Y-130805010D01*
X129533629Y-130412370D01*
X129619949Y-130204488D01*
X129704990Y-130410303D01*
X130097630Y-130803629D01*
X130610900Y-131016757D01*
X131166661Y-131017242D01*
X131680303Y-130805010D01*
X132073629Y-130412370D01*
X132159949Y-130204488D01*
X132244990Y-130410303D01*
X132637630Y-130803629D01*
X133150900Y-131016757D01*
X133706661Y-131017242D01*
X134220303Y-130805010D01*
X134613629Y-130412370D01*
X134699949Y-130204488D01*
X134784990Y-130410303D01*
X135177630Y-130803629D01*
X135690900Y-131016757D01*
X136246661Y-131017242D01*
X136760303Y-130805010D01*
X137153629Y-130412370D01*
X137239949Y-130204488D01*
X137324990Y-130410303D01*
X137717630Y-130803629D01*
X138230900Y-131016757D01*
X138786661Y-131017242D01*
X139300303Y-130805010D01*
X139693629Y-130412370D01*
X139779949Y-130204488D01*
X139864990Y-130410303D01*
X140257630Y-130803629D01*
X140770900Y-131016757D01*
X141326661Y-131017242D01*
X141840303Y-130805010D01*
X142233629Y-130412370D01*
X142319949Y-130204488D01*
X142404990Y-130410303D01*
X142797630Y-130803629D01*
X143310900Y-131016757D01*
X143866661Y-131017242D01*
X144380303Y-130805010D01*
X144773629Y-130412370D01*
X144859949Y-130204488D01*
X144944990Y-130410303D01*
X145337630Y-130803629D01*
X145850900Y-131016757D01*
X146406661Y-131017242D01*
X146920303Y-130805010D01*
X147313629Y-130412370D01*
X147399949Y-130204488D01*
X147484990Y-130410303D01*
X147877630Y-130803629D01*
X148390900Y-131016757D01*
X148946661Y-131017242D01*
X149460303Y-130805010D01*
X149853629Y-130412370D01*
X149939949Y-130204488D01*
X150024990Y-130410303D01*
X150417630Y-130803629D01*
X150930900Y-131016757D01*
X151486661Y-131017242D01*
X152000303Y-130805010D01*
X152393629Y-130412370D01*
X152479949Y-130204488D01*
X152564990Y-130410303D01*
X152957630Y-130803629D01*
X153470900Y-131016757D01*
X154026661Y-131017242D01*
X154540303Y-130805010D01*
X154933629Y-130412370D01*
X155146757Y-129899100D01*
X155147242Y-129343339D01*
X154935010Y-128829697D01*
X154542370Y-128436371D01*
X154029100Y-128223243D01*
X153473339Y-128222758D01*
X152959697Y-128434990D01*
X152566371Y-128827630D01*
X152480051Y-129035512D01*
X152395010Y-128829697D01*
X152002370Y-128436371D01*
X151489100Y-128223243D01*
X150933339Y-128222758D01*
X150419697Y-128434990D01*
X150026371Y-128827630D01*
X149940051Y-129035512D01*
X149855010Y-128829697D01*
X149462370Y-128436371D01*
X148949100Y-128223243D01*
X148393339Y-128222758D01*
X147879697Y-128434990D01*
X147486371Y-128827630D01*
X147400051Y-129035512D01*
X147315010Y-128829697D01*
X146922370Y-128436371D01*
X146409100Y-128223243D01*
X145853339Y-128222758D01*
X145339697Y-128434990D01*
X144946371Y-128827630D01*
X144860051Y-129035512D01*
X144775010Y-128829697D01*
X144382370Y-128436371D01*
X143869100Y-128223243D01*
X143313339Y-128222758D01*
X142799697Y-128434990D01*
X142406371Y-128827630D01*
X142320051Y-129035512D01*
X142235010Y-128829697D01*
X141885000Y-128479075D01*
X141885000Y-126288841D01*
X141991487Y-126032393D01*
X141991811Y-125660427D01*
X141849766Y-125316651D01*
X141586976Y-125053402D01*
X141243448Y-124910756D01*
X140871482Y-124910432D01*
X140527706Y-125052477D01*
X140264457Y-125315267D01*
X140121811Y-125658795D01*
X140121487Y-126030761D01*
X140215000Y-126257080D01*
X140215000Y-128479609D01*
X139866371Y-128827630D01*
X139780051Y-129035512D01*
X139695010Y-128829697D01*
X139302370Y-128436371D01*
X138789100Y-128223243D01*
X138233339Y-128222758D01*
X137719697Y-128434990D01*
X137326371Y-128827630D01*
X137240051Y-129035512D01*
X137155010Y-128829697D01*
X136762370Y-128436371D01*
X136249100Y-128223243D01*
X135693339Y-128222758D01*
X135179697Y-128434990D01*
X134786371Y-128827630D01*
X134700051Y-129035512D01*
X134615010Y-128829697D01*
X134222370Y-128436371D01*
X133709100Y-128223243D01*
X133153339Y-128222758D01*
X132639697Y-128434990D01*
X132246371Y-128827630D01*
X132160051Y-129035512D01*
X132075010Y-128829697D01*
X131682370Y-128436371D01*
X131169100Y-128223243D01*
X130613339Y-128222758D01*
X130099697Y-128434990D01*
X129706371Y-128827630D01*
X129620051Y-129035512D01*
X129535010Y-128829697D01*
X129142370Y-128436371D01*
X128629100Y-128223243D01*
X128073339Y-128222758D01*
X127559697Y-128434990D01*
X127166371Y-128827630D01*
X127080051Y-129035512D01*
X126995010Y-128829697D01*
X126602370Y-128436371D01*
X126089100Y-128223243D01*
X125533339Y-128222758D01*
X125019697Y-128434990D01*
X124626371Y-128827630D01*
X124546605Y-129019727D01*
X124492397Y-128888857D01*
X124250213Y-128819392D01*
X123449605Y-129620000D01*
X123090395Y-129620000D01*
X122289787Y-128819392D01*
X122047603Y-128888857D01*
X121997491Y-129029318D01*
X121915010Y-128829697D01*
X121725432Y-128639787D01*
X122469392Y-128639787D01*
X123270000Y-129440395D01*
X124070608Y-128639787D01*
X124001143Y-128397603D01*
X123477698Y-128210856D01*
X122922632Y-128238638D01*
X122538857Y-128397603D01*
X122469392Y-128639787D01*
X121725432Y-128639787D01*
X121522370Y-128436371D01*
X121009100Y-128223243D01*
X120453339Y-128222758D01*
X119939697Y-128434990D01*
X119546371Y-128827630D01*
X119460051Y-129035512D01*
X119375010Y-128829697D01*
X118982370Y-128436371D01*
X118469100Y-128223243D01*
X117913339Y-128222758D01*
X117399697Y-128434990D01*
X117006371Y-128827630D01*
X116920051Y-129035512D01*
X116835010Y-128829697D01*
X116442370Y-128436371D01*
X115929100Y-128223243D01*
X115373339Y-128222758D01*
X114859697Y-128434990D01*
X114466371Y-128827630D01*
X114253243Y-129340900D01*
X114252758Y-129896661D01*
X113405000Y-129896661D01*
X113405000Y-123783200D01*
X120941356Y-116246844D01*
X128730156Y-116246844D01*
X129116666Y-116169962D01*
X129444334Y-115951022D01*
X131604178Y-113791178D01*
X131823118Y-113463510D01*
X131900000Y-113077000D01*
X131900000Y-110265696D01*
X132073629Y-110092370D01*
X132159949Y-109884488D01*
X132244990Y-110090303D01*
X132637630Y-110483629D01*
X133150900Y-110696757D01*
X133706661Y-110697242D01*
X134220303Y-110485010D01*
X134613629Y-110092370D01*
X134699949Y-109884488D01*
X134784990Y-110090303D01*
X135177630Y-110483629D01*
X135690900Y-110696757D01*
X136246661Y-110697242D01*
X136760303Y-110485010D01*
X137153629Y-110092370D01*
X137239949Y-109884488D01*
X137324990Y-110090303D01*
X137717630Y-110483629D01*
X138230900Y-110696757D01*
X138786661Y-110697242D01*
X139300303Y-110485010D01*
X139693629Y-110092370D01*
X139779949Y-109884488D01*
X139864990Y-110090303D01*
X140257630Y-110483629D01*
X140770900Y-110696757D01*
X141326661Y-110697242D01*
X141840303Y-110485010D01*
X142233629Y-110092370D01*
X142319949Y-109884488D01*
X142404990Y-110090303D01*
X142797630Y-110483629D01*
X143310900Y-110696757D01*
X143866661Y-110697242D01*
X144380303Y-110485010D01*
X144773629Y-110092370D01*
X144859949Y-109884488D01*
X144944990Y-110090303D01*
X145337630Y-110483629D01*
X145850900Y-110696757D01*
X146406661Y-110697242D01*
X146920303Y-110485010D01*
X147313629Y-110092370D01*
X147399949Y-109884488D01*
X147484990Y-110090303D01*
X147877630Y-110483629D01*
X148390900Y-110696757D01*
X148946661Y-110697242D01*
X149460303Y-110485010D01*
X149853629Y-110092370D01*
X149939949Y-109884488D01*
X150024990Y-110090303D01*
X150417630Y-110483629D01*
X150930900Y-110696757D01*
X151486661Y-110697242D01*
X152000303Y-110485010D01*
X152393629Y-110092370D01*
X152479949Y-109884488D01*
X152564990Y-110090303D01*
X152957630Y-110483629D01*
X153470900Y-110696757D01*
X154026661Y-110697242D01*
X154540303Y-110485010D01*
X154933629Y-110092370D01*
X155146757Y-109579100D01*
X155147242Y-109023339D01*
X154935010Y-108509697D01*
X154542370Y-108116371D01*
X154029100Y-107903243D01*
X153473339Y-107902758D01*
X152959697Y-108114990D01*
X152566371Y-108507630D01*
X152480051Y-108715512D01*
X152395010Y-108509697D01*
X152002370Y-108116371D01*
X151489100Y-107903243D01*
X150933339Y-107902758D01*
X150419697Y-108114990D01*
X150026371Y-108507630D01*
X149940051Y-108715512D01*
X149855010Y-108509697D01*
X149462370Y-108116371D01*
X148949100Y-107903243D01*
X148393339Y-107902758D01*
X147879697Y-108114990D01*
X147486371Y-108507630D01*
X147400051Y-108715512D01*
X147315010Y-108509697D01*
X146922370Y-108116371D01*
X146409100Y-107903243D01*
X145853339Y-107902758D01*
X145339697Y-108114990D01*
X144946371Y-108507630D01*
X144860051Y-108715512D01*
X144775010Y-108509697D01*
X144475000Y-108209163D01*
X144475000Y-105696580D01*
X145146579Y-105025000D01*
X160019995Y-105025000D01*
X160020000Y-105025001D01*
X160302484Y-104968810D01*
X160358675Y-104957633D01*
X160645790Y-104765790D01*
X161995787Y-103415792D01*
X161995790Y-103415790D01*
X162187633Y-103128675D01*
X162255000Y-102790000D01*
X162255000Y-95249432D01*
X162420054Y-95139147D01*
X162741961Y-94657378D01*
X162855000Y-94089093D01*
X162855000Y-94030907D01*
X162741961Y-93462622D01*
X162420054Y-92980853D01*
X162255000Y-92870568D01*
X162255000Y-92709432D01*
X162420054Y-92599147D01*
X162741961Y-92117378D01*
X162855000Y-91549093D01*
X162855000Y-91490907D01*
X162741961Y-90922622D01*
X162420054Y-90440853D01*
X161938285Y-90118946D01*
X161370000Y-90005907D01*
X160801715Y-90118946D01*
X160319946Y-90440853D01*
X160092298Y-90781553D01*
X160025183Y-90638642D01*
X159596924Y-90248355D01*
X159186890Y-90078524D01*
X158957000Y-90199845D01*
X158957000Y-91393000D01*
X158977000Y-91393000D01*
X158977000Y-91647000D01*
X158957000Y-91647000D01*
X158957000Y-93933000D01*
X158977000Y-93933000D01*
X158977000Y-94187000D01*
X158957000Y-94187000D01*
X158957000Y-95380155D01*
X159186890Y-95501476D01*
X159596924Y-95331645D01*
X160025183Y-94941358D01*
X160092298Y-94798447D01*
X160319946Y-95139147D01*
X160485000Y-95249432D01*
X160485000Y-102423421D01*
X159653420Y-103255000D01*
X144780005Y-103255000D01*
X144780000Y-103254999D01*
X144441325Y-103322367D01*
X144154210Y-103514210D01*
X144154208Y-103514213D01*
X142964210Y-104704210D01*
X142772367Y-104991325D01*
X142772367Y-104991326D01*
X142704999Y-105330000D01*
X142705000Y-105330005D01*
X142705000Y-108209522D01*
X142406371Y-108507630D01*
X142320051Y-108715512D01*
X142235010Y-108509697D01*
X141935000Y-108209163D01*
X141935000Y-104426580D01*
X143876579Y-102485000D01*
X154939995Y-102485000D01*
X154940000Y-102485001D01*
X155222484Y-102428810D01*
X155278675Y-102417633D01*
X155565790Y-102225790D01*
X156915787Y-100875792D01*
X156915790Y-100875790D01*
X157107633Y-100588675D01*
X157175000Y-100250000D01*
X157175000Y-95249432D01*
X157340054Y-95139147D01*
X157567702Y-94798447D01*
X157634817Y-94941358D01*
X158063076Y-95331645D01*
X158473110Y-95501476D01*
X158703000Y-95380155D01*
X158703000Y-94187000D01*
X158683000Y-94187000D01*
X158683000Y-93933000D01*
X158703000Y-93933000D01*
X158703000Y-91647000D01*
X158683000Y-91647000D01*
X158683000Y-91393000D01*
X158703000Y-91393000D01*
X158703000Y-90199845D01*
X158473110Y-90078524D01*
X158063076Y-90248355D01*
X157634817Y-90638642D01*
X157567702Y-90781553D01*
X157340054Y-90440853D01*
X156858285Y-90118946D01*
X156290000Y-90005907D01*
X155721715Y-90118946D01*
X155239946Y-90440853D01*
X155020000Y-90770026D01*
X154800054Y-90440853D01*
X154318285Y-90118946D01*
X153750000Y-90005907D01*
X153181715Y-90118946D01*
X152699946Y-90440853D01*
X152480000Y-90770026D01*
X152260054Y-90440853D01*
X151778285Y-90118946D01*
X151210000Y-90005907D01*
X150641715Y-90118946D01*
X150159946Y-90440853D01*
X149838039Y-90922622D01*
X149725000Y-91490907D01*
X149725000Y-91549093D01*
X149838039Y-92117378D01*
X150159946Y-92599147D01*
X150161179Y-92599971D01*
X150124683Y-92606838D01*
X149908559Y-92745910D01*
X149763569Y-92958110D01*
X149712560Y-93210000D01*
X149712560Y-94910000D01*
X149756838Y-95145317D01*
X149895910Y-95361441D01*
X150108110Y-95506431D01*
X150360000Y-95557440D01*
X152060000Y-95557440D01*
X152295317Y-95513162D01*
X152511441Y-95374090D01*
X152656431Y-95161890D01*
X152670086Y-95094459D01*
X152699946Y-95139147D01*
X153181715Y-95461054D01*
X153750000Y-95574093D01*
X154318285Y-95461054D01*
X154800054Y-95139147D01*
X155020000Y-94809974D01*
X155239946Y-95139147D01*
X155405000Y-95249432D01*
X155405000Y-99883421D01*
X154573420Y-100715000D01*
X154522537Y-100715000D01*
X154604838Y-100516799D01*
X154605162Y-100144833D01*
X154463117Y-99801057D01*
X154200327Y-99537808D01*
X153958090Y-99437222D01*
X147990434Y-93469566D01*
X147937520Y-93434210D01*
X147719541Y-93288561D01*
X147400000Y-93225000D01*
X141373187Y-93225000D01*
X141210054Y-92980853D01*
X140924422Y-92790000D01*
X141210054Y-92599147D01*
X141531961Y-92117378D01*
X141645000Y-91549093D01*
X141645000Y-91490907D01*
X141531961Y-90922622D01*
X141210054Y-90440853D01*
X140728285Y-90118946D01*
X140160000Y-90005907D01*
X139591715Y-90118946D01*
X139109946Y-90440853D01*
X138882298Y-90781553D01*
X138815183Y-90638642D01*
X138386924Y-90248355D01*
X137976890Y-90078524D01*
X137747000Y-90199845D01*
X137747000Y-91393000D01*
X137767000Y-91393000D01*
X137767000Y-91647000D01*
X137747000Y-91647000D01*
X137747000Y-91667000D01*
X137493000Y-91667000D01*
X137493000Y-91647000D01*
X135207000Y-91647000D01*
X135207000Y-91667000D01*
X134953000Y-91667000D01*
X134953000Y-91647000D01*
X132667000Y-91647000D01*
X132667000Y-91667000D01*
X132413000Y-91667000D01*
X132413000Y-91647000D01*
X130127000Y-91647000D01*
X130127000Y-91667000D01*
X129873000Y-91667000D01*
X129873000Y-91647000D01*
X128679181Y-91647000D01*
X128558514Y-91876892D01*
X128804817Y-92401358D01*
X129010504Y-92588808D01*
X128914683Y-92606838D01*
X128698559Y-92745910D01*
X128553569Y-92958110D01*
X128502560Y-93210000D01*
X128502560Y-94910000D01*
X128546838Y-95145317D01*
X128685910Y-95361441D01*
X128898110Y-95506431D01*
X129150000Y-95557440D01*
X130850000Y-95557440D01*
X131085317Y-95513162D01*
X131301441Y-95374090D01*
X131446431Y-95161890D01*
X131460086Y-95094459D01*
X131489946Y-95139147D01*
X131971715Y-95461054D01*
X132540000Y-95574093D01*
X133108285Y-95461054D01*
X133590054Y-95139147D01*
X133810000Y-94809974D01*
X134029946Y-95139147D01*
X134511715Y-95461054D01*
X135080000Y-95574093D01*
X135648285Y-95461054D01*
X136130054Y-95139147D01*
X136350000Y-94809974D01*
X136569946Y-95139147D01*
X137051715Y-95461054D01*
X137620000Y-95574093D01*
X138188285Y-95461054D01*
X138670054Y-95139147D01*
X138890000Y-94809974D01*
X139109946Y-95139147D01*
X139591715Y-95461054D01*
X140160000Y-95574093D01*
X140728285Y-95461054D01*
X141210054Y-95139147D01*
X141373187Y-94895000D01*
X147054132Y-94895000D01*
X152777465Y-100618333D01*
X152817407Y-100715000D01*
X143510000Y-100715000D01*
X143171325Y-100782367D01*
X142884210Y-100974210D01*
X142884208Y-100974213D01*
X140424210Y-103434210D01*
X140232367Y-103721325D01*
X140232367Y-103721326D01*
X140164999Y-104060000D01*
X140165000Y-104060005D01*
X140165000Y-108209522D01*
X139866371Y-108507630D01*
X139780051Y-108715512D01*
X139695010Y-108509697D01*
X139302370Y-108116371D01*
X138789100Y-107903243D01*
X138233339Y-107902758D01*
X137719697Y-108114990D01*
X137326371Y-108507630D01*
X137240051Y-108715512D01*
X137155010Y-108509697D01*
X136762370Y-108116371D01*
X136249100Y-107903243D01*
X135693339Y-107902758D01*
X135179697Y-108114990D01*
X134786371Y-108507630D01*
X134700051Y-108715512D01*
X134615010Y-108509697D01*
X134222370Y-108116371D01*
X133709100Y-107903243D01*
X133153339Y-107902758D01*
X132639697Y-108114990D01*
X132246371Y-108507630D01*
X132160051Y-108715512D01*
X132075010Y-108509697D01*
X131682370Y-108116371D01*
X131169100Y-107903243D01*
X130613339Y-107902758D01*
X130099697Y-108114990D01*
X129706371Y-108507630D01*
X129620051Y-108715512D01*
X129535010Y-108509697D01*
X129142370Y-108116371D01*
X128629100Y-107903243D01*
X128073339Y-107902758D01*
X127559697Y-108114990D01*
X127166371Y-108507630D01*
X127080051Y-108715512D01*
X126995010Y-108509697D01*
X126602370Y-108116371D01*
X126089100Y-107903243D01*
X125533339Y-107902758D01*
X125019697Y-108114990D01*
X124626371Y-108507630D01*
X124413243Y-109020900D01*
X124412758Y-109576661D01*
X124624990Y-110090303D01*
X125017630Y-110483629D01*
X125530900Y-110696757D01*
X126086661Y-110697242D01*
X126600303Y-110485010D01*
X126993629Y-110092370D01*
X127079949Y-109884488D01*
X127164990Y-110090303D01*
X127557630Y-110483629D01*
X128070900Y-110696757D01*
X128626661Y-110697242D01*
X129140303Y-110485010D01*
X129533629Y-110092370D01*
X129619949Y-109884488D01*
X129704990Y-110090303D01*
X129880000Y-110265619D01*
X129880000Y-112658644D01*
X128311800Y-114226844D01*
X120523000Y-114226844D01*
X120136490Y-114303726D01*
X119808822Y-114522666D01*
X113405000Y-120926488D01*
X113405000Y-102390104D01*
X125119501Y-102390104D01*
X125156648Y-102605217D01*
X125584972Y-102748112D01*
X126035375Y-102716217D01*
X126303352Y-102605217D01*
X126340499Y-102390104D01*
X125730000Y-101779605D01*
X125119501Y-102390104D01*
X113405000Y-102390104D01*
X113405000Y-99570357D01*
X113328118Y-99183847D01*
X113109178Y-98856179D01*
X111961450Y-97708451D01*
X111986431Y-97671890D01*
X112037440Y-97420000D01*
X112037440Y-95620000D01*
X111993162Y-95384683D01*
X111854090Y-95168559D01*
X111714901Y-95073455D01*
X114258356Y-92530000D01*
X116642666Y-92530000D01*
X116656838Y-92605317D01*
X116795910Y-92821441D01*
X117008110Y-92966431D01*
X117260000Y-93017440D01*
X118960000Y-93017440D01*
X119195317Y-92973162D01*
X119411441Y-92834090D01*
X119556431Y-92621890D01*
X119570086Y-92554459D01*
X119599946Y-92599147D01*
X119815000Y-92742841D01*
X119815000Y-95247180D01*
X119534519Y-95434591D01*
X119201773Y-95932581D01*
X119084928Y-96520000D01*
X119201773Y-97107419D01*
X119534519Y-97605409D01*
X120032509Y-97938155D01*
X120619928Y-98055000D01*
X120680072Y-98055000D01*
X121267491Y-97938155D01*
X121765481Y-97605409D01*
X121932799Y-97355000D01*
X123744132Y-97355000D01*
X124659415Y-98270283D01*
X124633569Y-98308110D01*
X124582560Y-98560000D01*
X124582560Y-99495000D01*
X121844083Y-99495000D01*
X121463923Y-99114176D01*
X120936691Y-98895250D01*
X120365813Y-98894752D01*
X119838200Y-99112757D01*
X119434176Y-99516077D01*
X119215250Y-100043309D01*
X119214752Y-100614187D01*
X119432757Y-101141800D01*
X119836077Y-101545824D01*
X120363309Y-101764750D01*
X120934187Y-101765248D01*
X121461800Y-101547243D01*
X121844710Y-101165000D01*
X124678627Y-101165000D01*
X124581888Y-101454972D01*
X124613783Y-101905375D01*
X124724783Y-102173352D01*
X124939896Y-102210499D01*
X125550395Y-101600000D01*
X125536253Y-101585858D01*
X125715858Y-101406253D01*
X125730000Y-101420395D01*
X125744143Y-101406253D01*
X125923748Y-101585858D01*
X125909605Y-101600000D01*
X126520104Y-102210499D01*
X126735217Y-102173352D01*
X126878112Y-101745028D01*
X126858273Y-101464877D01*
X127224775Y-101465197D01*
X127642086Y-101292767D01*
X127961645Y-100973765D01*
X128134803Y-100556756D01*
X128135197Y-100105225D01*
X127962767Y-99687914D01*
X127643765Y-99368355D01*
X127226756Y-99195197D01*
X126877440Y-99194892D01*
X126877440Y-98560000D01*
X126833162Y-98324683D01*
X126694090Y-98108559D01*
X126532854Y-97998391D01*
X126501439Y-97840459D01*
X126320434Y-97569566D01*
X124680434Y-95929566D01*
X124606253Y-95880000D01*
X124409541Y-95748561D01*
X124090000Y-95685000D01*
X121932799Y-95685000D01*
X121765481Y-95434591D01*
X121485000Y-95247180D01*
X121485000Y-92742841D01*
X121700054Y-92599147D01*
X122021961Y-92117378D01*
X122135000Y-91549093D01*
X122135000Y-91490907D01*
X122069797Y-91163108D01*
X128558514Y-91163108D01*
X128679181Y-91393000D01*
X129873000Y-91393000D01*
X129873000Y-90199845D01*
X130127000Y-90199845D01*
X130127000Y-91393000D01*
X132413000Y-91393000D01*
X132413000Y-90199845D01*
X132667000Y-90199845D01*
X132667000Y-91393000D01*
X134953000Y-91393000D01*
X134953000Y-90199845D01*
X135207000Y-90199845D01*
X135207000Y-91393000D01*
X137493000Y-91393000D01*
X137493000Y-90199845D01*
X137263110Y-90078524D01*
X136853076Y-90248355D01*
X136424817Y-90638642D01*
X136350000Y-90797954D01*
X136275183Y-90638642D01*
X135846924Y-90248355D01*
X135436890Y-90078524D01*
X135207000Y-90199845D01*
X134953000Y-90199845D01*
X134723110Y-90078524D01*
X134313076Y-90248355D01*
X133884817Y-90638642D01*
X133810000Y-90797954D01*
X133735183Y-90638642D01*
X133306924Y-90248355D01*
X132896890Y-90078524D01*
X132667000Y-90199845D01*
X132413000Y-90199845D01*
X132183110Y-90078524D01*
X131773076Y-90248355D01*
X131344817Y-90638642D01*
X131270000Y-90797954D01*
X131195183Y-90638642D01*
X130766924Y-90248355D01*
X130356890Y-90078524D01*
X130127000Y-90199845D01*
X129873000Y-90199845D01*
X129643110Y-90078524D01*
X129233076Y-90248355D01*
X128804817Y-90638642D01*
X128558514Y-91163108D01*
X122069797Y-91163108D01*
X122021961Y-90922622D01*
X121700054Y-90440853D01*
X121218285Y-90118946D01*
X120650000Y-90005907D01*
X120081715Y-90118946D01*
X119599946Y-90440853D01*
X119572150Y-90482452D01*
X119563162Y-90434683D01*
X119424090Y-90218559D01*
X119211890Y-90073569D01*
X118960000Y-90022560D01*
X117260000Y-90022560D01*
X117024683Y-90066838D01*
X116808559Y-90205910D01*
X116663569Y-90418110D01*
X116644961Y-90510000D01*
X113840000Y-90510000D01*
X113453489Y-90586882D01*
X113125822Y-90805822D01*
X112627000Y-91304644D01*
X112627000Y-88627000D01*
X166373000Y-88627000D01*
X166373000Y-134873000D01*
M02*
