(kicad_pcb (version 4) (host pcbnew 4.0.6)

  (general
    (links 28)
    (no_connects 1)
    (area 107.399999 87.399999 167.600001 140.100001)
    (thickness 1.6)
    (drawings 8)
    (tracks 90)
    (zones 0)
    (modules 9)
    (nets 34)
  )

  (page A4)
  (layers
    (0 F.Cu signal)
    (31 B.Cu signal)
    (32 B.Adhes user)
    (33 F.Adhes user)
    (34 B.Paste user)
    (35 F.Paste user)
    (36 B.SilkS user)
    (37 F.SilkS user)
    (38 B.Mask user)
    (39 F.Mask user)
    (40 Dwgs.User user)
    (41 Cmts.User user)
    (42 Eco1.User user)
    (43 Eco2.User user)
    (44 Edge.Cuts user)
    (45 Margin user)
    (46 B.CrtYd user)
    (47 F.CrtYd user)
    (48 B.Fab user)
    (49 F.Fab user)
  )

  (setup
    (last_trace_width 0.4)
    (trace_clearance 0.2)
    (zone_clearance 0.508)
    (zone_45_only no)
    (trace_min 0.2)
    (segment_width 0.2)
    (edge_width 0.2)
    (via_size 0.6)
    (via_drill 0.4)
    (via_min_size 0.4)
    (via_min_drill 0.3)
    (uvia_size 0.3)
    (uvia_drill 0.1)
    (uvias_allowed no)
    (uvia_min_size 0.2)
    (uvia_min_drill 0.1)
    (pcb_text_width 0.3)
    (pcb_text_size 1.5 1.5)
    (mod_edge_width 0.15)
    (mod_text_size 1 1)
    (mod_text_width 0.15)
    (pad_size 1.524 1.524)
    (pad_drill 0.762)
    (pad_to_mask_clearance 0.2)
    (aux_axis_origin 0 0)
    (visible_elements FFFFFF7F)
    (pcbplotparams
      (layerselection 0x010f0_80000001)
      (usegerberextensions false)
      (excludeedgelayer true)
      (linewidth 0.100000)
      (plotframeref false)
      (viasonmask false)
      (mode 1)
      (useauxorigin false)
      (hpglpennumber 1)
      (hpglpenspeed 20)
      (hpglpendiameter 15)
      (hpglpenoverlay 2)
      (psnegative false)
      (psa4output false)
      (plotreference true)
      (plotvalue true)
      (plotinvisibletext false)
      (padsonsilk false)
      (subtractmaskfromsilk false)
      (outputformat 1)
      (mirror false)
      (drillshape 0)
      (scaleselection 1)
      (outputdirectory gerber/))
  )

  (net 0 "")
  (net 1 +5V)
  (net 2 "Net-(D1-Pad2)")
  (net 3 GNDREF)
  (net 4 "Net-(J1-Pad2)")
  (net 5 "Net-(J1-Pad3)")
  (net 6 /RELAY)
  (net 7 /DIG_ST)
  (net 8 /DIG_OE)
  (net 9 /DIG_CLK)
  (net 10 /DIG_DATA)
  (net 11 "Net-(J4-Pad1)")
  (net 12 /MAT_DATA)
  (net 13 /MAT_CLK)
  (net 14 /MAT_LE)
  (net 15 /MAT_A)
  (net 16 /MAT_B)
  (net 17 "Net-(Q1-Pad2)")
  (net 18 "Net-(U1-Pad1)")
  (net 19 "Net-(U1-Pad2)")
  (net 20 "Net-(U1-Pad3)")
  (net 21 "Net-(U1-Pad5)")
  (net 22 "Net-(U1-Pad6)")
  (net 23 "Net-(U1-Pad7)")
  (net 24 "Net-(U1-Pad8)")
  (net 25 "Net-(U1-Pad9)")
  (net 26 "Net-(U1-Pad10)")
  (net 27 "Net-(U1-Pad14)")
  (net 28 "Net-(U1-Pad16)")
  (net 29 "Net-(U1-Pad23)")
  (net 30 "Net-(U1-Pad24)")
  (net 31 "Net-(U1-Pad27)")
  (net 32 "Net-(U1-Pad28)")
  (net 33 "Net-(U1-Pad15)")

  (net_class Default "This is the default net class."
    (clearance 0.2)
    (trace_width 0.4)
    (via_dia 0.6)
    (via_drill 0.4)
    (uvia_dia 0.3)
    (uvia_drill 0.1)
    (add_net /DIG_CLK)
    (add_net /DIG_DATA)
    (add_net /DIG_OE)
    (add_net /DIG_ST)
    (add_net /MAT_A)
    (add_net /MAT_B)
    (add_net /MAT_CLK)
    (add_net /MAT_DATA)
    (add_net /MAT_LE)
    (add_net /RELAY)
    (add_net "Net-(D1-Pad2)")
    (add_net "Net-(J1-Pad2)")
    (add_net "Net-(J1-Pad3)")
    (add_net "Net-(J4-Pad1)")
    (add_net "Net-(Q1-Pad2)")
    (add_net "Net-(U1-Pad1)")
    (add_net "Net-(U1-Pad10)")
    (add_net "Net-(U1-Pad14)")
    (add_net "Net-(U1-Pad15)")
    (add_net "Net-(U1-Pad16)")
    (add_net "Net-(U1-Pad2)")
    (add_net "Net-(U1-Pad23)")
    (add_net "Net-(U1-Pad24)")
    (add_net "Net-(U1-Pad27)")
    (add_net "Net-(U1-Pad28)")
    (add_net "Net-(U1-Pad3)")
    (add_net "Net-(U1-Pad5)")
    (add_net "Net-(U1-Pad6)")
    (add_net "Net-(U1-Pad7)")
    (add_net "Net-(U1-Pad8)")
    (add_net "Net-(U1-Pad9)")
  )

  (net_class POWER ""
    (clearance 0.2)
    (trace_width 0.75)
    (via_dia 0.6)
    (via_drill 0.4)
    (uvia_dia 0.3)
    (uvia_drill 0.1)
    (add_net +5V)
    (add_net GNDREF)
  )

  (module Pin_Headers:Pin_Header_Straight_1x04_Pitch2.54mm (layer F.Cu) (tedit 5B8E4503) (tstamp 5B83482A)
    (at 115.5 136.5 90)
    (descr "Through hole straight pin header, 1x04, 2.54mm pitch, single row")
    (tags "Through hole pin header THT 1x04 2.54mm single row")
    (path /5B77E4C8)
    (fp_text reference J1 (at 0 -2.39 90) (layer F.SilkS)
      (effects (font (size 1 1) (thickness 0.15)))
    )
    (fp_text value POWER (at 2.515 3.88 180) (layer F.Fab)
      (effects (font (size 1 1) (thickness 0.15)))
    )
    (fp_line (start -1.27 -1.27) (end -1.27 8.89) (layer F.Fab) (width 0.1))
    (fp_line (start -1.27 8.89) (end 1.27 8.89) (layer F.Fab) (width 0.1))
    (fp_line (start 1.27 8.89) (end 1.27 -1.27) (layer F.Fab) (width 0.1))
    (fp_line (start 1.27 -1.27) (end -1.27 -1.27) (layer F.Fab) (width 0.1))
    (fp_line (start -1.39 1.27) (end -1.39 9.01) (layer F.SilkS) (width 0.12))
    (fp_line (start -1.39 9.01) (end 1.39 9.01) (layer F.SilkS) (width 0.12))
    (fp_line (start 1.39 9.01) (end 1.39 1.27) (layer F.SilkS) (width 0.12))
    (fp_line (start 1.39 1.27) (end -1.39 1.27) (layer F.SilkS) (width 0.12))
    (fp_line (start -1.39 0) (end -1.39 -1.39) (layer F.SilkS) (width 0.12))
    (fp_line (start -1.39 -1.39) (end 0 -1.39) (layer F.SilkS) (width 0.12))
    (fp_line (start -1.6 -1.6) (end -1.6 9.2) (layer F.CrtYd) (width 0.05))
    (fp_line (start -1.6 9.2) (end 1.6 9.2) (layer F.CrtYd) (width 0.05))
    (fp_line (start 1.6 9.2) (end 1.6 -1.6) (layer F.CrtYd) (width 0.05))
    (fp_line (start 1.6 -1.6) (end -1.6 -1.6) (layer F.CrtYd) (width 0.05))
    (pad 1 thru_hole rect (at 0 0 90) (size 1.7 1.7) (drill 1) (layers *.Cu *.Mask)
      (net 1 +5V))
    (pad 2 thru_hole oval (at 0 2.54 90) (size 1.7 1.7) (drill 1) (layers *.Cu *.Mask)
      (net 4 "Net-(J1-Pad2)"))
    (pad 3 thru_hole oval (at 0 5.08 90) (size 1.7 1.7) (drill 1) (layers *.Cu *.Mask)
      (net 5 "Net-(J1-Pad3)"))
    (pad 4 thru_hole oval (at 0 7.62 90) (size 1.7 1.7) (drill 1) (layers *.Cu *.Mask)
      (net 3 GNDREF))
    (model Pin_Headers.3dshapes/Pin_Header_Straight_1x04_Pitch2.54mm.wrl
      (at (xyz 0 -0.15 0))
      (scale (xyz 1 1 1))
      (rotate (xyz 0 0 90))
    )
  )

  (module Pin_Headers:Pin_Header_Straight_2x05_Pitch2.54mm (layer F.Cu) (tedit 5862ED53) (tstamp 5B83485C)
    (at 151.21 94.06 90)
    (descr "Through hole straight pin header, 2x05, 2.54mm pitch, double rows")
    (tags "Through hole pin header THT 2x05 2.54mm double row")
    (path /5B6E3DEE)
    (fp_text reference J3 (at 1.27 -2.39 90) (layer F.SilkS)
      (effects (font (size 1 1) (thickness 0.15)))
    )
    (fp_text value DIGITS (at 1.27 12.55 90) (layer F.Fab)
      (effects (font (size 1 1) (thickness 0.15)))
    )
    (fp_line (start -1.27 -1.27) (end -1.27 11.43) (layer F.Fab) (width 0.1))
    (fp_line (start -1.27 11.43) (end 3.81 11.43) (layer F.Fab) (width 0.1))
    (fp_line (start 3.81 11.43) (end 3.81 -1.27) (layer F.Fab) (width 0.1))
    (fp_line (start 3.81 -1.27) (end -1.27 -1.27) (layer F.Fab) (width 0.1))
    (fp_line (start -1.39 1.27) (end -1.39 11.55) (layer F.SilkS) (width 0.12))
    (fp_line (start -1.39 11.55) (end 3.93 11.55) (layer F.SilkS) (width 0.12))
    (fp_line (start 3.93 11.55) (end 3.93 -1.39) (layer F.SilkS) (width 0.12))
    (fp_line (start 3.93 -1.39) (end 1.27 -1.39) (layer F.SilkS) (width 0.12))
    (fp_line (start 1.27 -1.39) (end 1.27 1.27) (layer F.SilkS) (width 0.12))
    (fp_line (start 1.27 1.27) (end -1.39 1.27) (layer F.SilkS) (width 0.12))
    (fp_line (start -1.39 0) (end -1.39 -1.39) (layer F.SilkS) (width 0.12))
    (fp_line (start -1.39 -1.39) (end 0 -1.39) (layer F.SilkS) (width 0.12))
    (fp_line (start -1.6 -1.6) (end -1.6 11.7) (layer F.CrtYd) (width 0.05))
    (fp_line (start -1.6 11.7) (end 4.1 11.7) (layer F.CrtYd) (width 0.05))
    (fp_line (start 4.1 11.7) (end 4.1 -1.6) (layer F.CrtYd) (width 0.05))
    (fp_line (start 4.1 -1.6) (end -1.6 -1.6) (layer F.CrtYd) (width 0.05))
    (pad 1 thru_hole rect (at 0 0 90) (size 1.7 1.7) (drill 1) (layers *.Cu *.Mask)
      (net 7 /DIG_ST))
    (pad 2 thru_hole oval (at 2.54 0 90) (size 1.7 1.7) (drill 1) (layers *.Cu *.Mask)
      (net 7 /DIG_ST))
    (pad 3 thru_hole oval (at 0 2.54 90) (size 1.7 1.7) (drill 1) (layers *.Cu *.Mask)
      (net 8 /DIG_OE))
    (pad 4 thru_hole oval (at 2.54 2.54 90) (size 1.7 1.7) (drill 1) (layers *.Cu *.Mask)
      (net 8 /DIG_OE))
    (pad 5 thru_hole oval (at 0 5.08 90) (size 1.7 1.7) (drill 1) (layers *.Cu *.Mask)
      (net 9 /DIG_CLK))
    (pad 6 thru_hole oval (at 2.54 5.08 90) (size 1.7 1.7) (drill 1) (layers *.Cu *.Mask)
      (net 9 /DIG_CLK))
    (pad 7 thru_hole oval (at 0 7.62 90) (size 1.7 1.7) (drill 1) (layers *.Cu *.Mask)
      (net 3 GNDREF))
    (pad 8 thru_hole oval (at 2.54 7.62 90) (size 1.7 1.7) (drill 1) (layers *.Cu *.Mask)
      (net 3 GNDREF))
    (pad 9 thru_hole oval (at 0 10.16 90) (size 1.7 1.7) (drill 1) (layers *.Cu *.Mask)
      (net 10 /DIG_DATA))
    (pad 10 thru_hole oval (at 2.54 10.16 90) (size 1.7 1.7) (drill 1) (layers *.Cu *.Mask)
      (net 10 /DIG_DATA))
    (model Pin_Headers.3dshapes/Pin_Header_Straight_2x05_Pitch2.54mm.wrl
      (at (xyz 0.05 -0.2 0))
      (scale (xyz 1 1 1))
      (rotate (xyz 0 0 90))
    )
  )

  (module Pin_Headers:Pin_Header_Straight_2x05_Pitch2.54mm (layer F.Cu) (tedit 5862ED53) (tstamp 5B83487A)
    (at 130 94.06 90)
    (descr "Through hole straight pin header, 2x05, 2.54mm pitch, double rows")
    (tags "Through hole pin header THT 2x05 2.54mm double row")
    (path /5B6E3E5F)
    (fp_text reference J4 (at 1.27 -2.39 90) (layer F.SilkS)
      (effects (font (size 1 1) (thickness 0.15)))
    )
    (fp_text value MATRIX (at 1.27 12.55 90) (layer F.Fab)
      (effects (font (size 1 1) (thickness 0.15)))
    )
    (fp_line (start -1.27 -1.27) (end -1.27 11.43) (layer F.Fab) (width 0.1))
    (fp_line (start -1.27 11.43) (end 3.81 11.43) (layer F.Fab) (width 0.1))
    (fp_line (start 3.81 11.43) (end 3.81 -1.27) (layer F.Fab) (width 0.1))
    (fp_line (start 3.81 -1.27) (end -1.27 -1.27) (layer F.Fab) (width 0.1))
    (fp_line (start -1.39 1.27) (end -1.39 11.55) (layer F.SilkS) (width 0.12))
    (fp_line (start -1.39 11.55) (end 3.93 11.55) (layer F.SilkS) (width 0.12))
    (fp_line (start 3.93 11.55) (end 3.93 -1.39) (layer F.SilkS) (width 0.12))
    (fp_line (start 3.93 -1.39) (end 1.27 -1.39) (layer F.SilkS) (width 0.12))
    (fp_line (start 1.27 -1.39) (end 1.27 1.27) (layer F.SilkS) (width 0.12))
    (fp_line (start 1.27 1.27) (end -1.39 1.27) (layer F.SilkS) (width 0.12))
    (fp_line (start -1.39 0) (end -1.39 -1.39) (layer F.SilkS) (width 0.12))
    (fp_line (start -1.39 -1.39) (end 0 -1.39) (layer F.SilkS) (width 0.12))
    (fp_line (start -1.6 -1.6) (end -1.6 11.7) (layer F.CrtYd) (width 0.05))
    (fp_line (start -1.6 11.7) (end 4.1 11.7) (layer F.CrtYd) (width 0.05))
    (fp_line (start 4.1 11.7) (end 4.1 -1.6) (layer F.CrtYd) (width 0.05))
    (fp_line (start 4.1 -1.6) (end -1.6 -1.6) (layer F.CrtYd) (width 0.05))
    (pad 1 thru_hole rect (at 0 0 90) (size 1.7 1.7) (drill 1) (layers *.Cu *.Mask)
      (net 11 "Net-(J4-Pad1)"))
    (pad 2 thru_hole oval (at 2.54 0 90) (size 1.7 1.7) (drill 1) (layers *.Cu *.Mask)
      (net 3 GNDREF))
    (pad 3 thru_hole oval (at 0 2.54 90) (size 1.7 1.7) (drill 1) (layers *.Cu *.Mask)
      (net 12 /MAT_DATA))
    (pad 4 thru_hole oval (at 2.54 2.54 90) (size 1.7 1.7) (drill 1) (layers *.Cu *.Mask)
      (net 3 GNDREF))
    (pad 5 thru_hole oval (at 0 5.08 90) (size 1.7 1.7) (drill 1) (layers *.Cu *.Mask)
      (net 13 /MAT_CLK))
    (pad 6 thru_hole oval (at 2.54 5.08 90) (size 1.7 1.7) (drill 1) (layers *.Cu *.Mask)
      (net 3 GNDREF))
    (pad 7 thru_hole oval (at 0 7.62 90) (size 1.7 1.7) (drill 1) (layers *.Cu *.Mask)
      (net 14 /MAT_LE))
    (pad 8 thru_hole oval (at 2.54 7.62 90) (size 1.7 1.7) (drill 1) (layers *.Cu *.Mask)
      (net 3 GNDREF))
    (pad 9 thru_hole oval (at 0 10.16 90) (size 1.7 1.7) (drill 1) (layers *.Cu *.Mask)
      (net 15 /MAT_A))
    (pad 10 thru_hole oval (at 2.54 10.16 90) (size 1.7 1.7) (drill 1) (layers *.Cu *.Mask)
      (net 16 /MAT_B))
    (model Pin_Headers.3dshapes/Pin_Header_Straight_2x05_Pitch2.54mm.wrl
      (at (xyz 0.05 -0.2 0))
      (scale (xyz 1 1 1))
      (rotate (xyz 0 0 90))
    )
  )

  (module Pin_Headers:Pin_Header_Straight_1x02_Pitch2.54mm (layer F.Cu) (tedit 5862ED52) (tstamp 5B83488E)
    (at 118.11 91.52 90)
    (descr "Through hole straight pin header, 1x02, 2.54mm pitch, single row")
    (tags "Through hole pin header THT 1x02 2.54mm single row")
    (path /5B6E3EB4)
    (fp_text reference J5 (at 0 -2.39 90) (layer F.SilkS)
      (effects (font (size 1 1) (thickness 0.15)))
    )
    (fp_text value RELAY (at 0 4.93 90) (layer F.Fab)
      (effects (font (size 1 1) (thickness 0.15)))
    )
    (fp_line (start -1.27 -1.27) (end -1.27 3.81) (layer F.Fab) (width 0.1))
    (fp_line (start -1.27 3.81) (end 1.27 3.81) (layer F.Fab) (width 0.1))
    (fp_line (start 1.27 3.81) (end 1.27 -1.27) (layer F.Fab) (width 0.1))
    (fp_line (start 1.27 -1.27) (end -1.27 -1.27) (layer F.Fab) (width 0.1))
    (fp_line (start -1.39 1.27) (end -1.39 3.93) (layer F.SilkS) (width 0.12))
    (fp_line (start -1.39 3.93) (end 1.39 3.93) (layer F.SilkS) (width 0.12))
    (fp_line (start 1.39 3.93) (end 1.39 1.27) (layer F.SilkS) (width 0.12))
    (fp_line (start 1.39 1.27) (end -1.39 1.27) (layer F.SilkS) (width 0.12))
    (fp_line (start -1.39 0) (end -1.39 -1.39) (layer F.SilkS) (width 0.12))
    (fp_line (start -1.39 -1.39) (end 0 -1.39) (layer F.SilkS) (width 0.12))
    (fp_line (start -1.6 -1.6) (end -1.6 4.1) (layer F.CrtYd) (width 0.05))
    (fp_line (start -1.6 4.1) (end 1.6 4.1) (layer F.CrtYd) (width 0.05))
    (fp_line (start 1.6 4.1) (end 1.6 -1.6) (layer F.CrtYd) (width 0.05))
    (fp_line (start 1.6 -1.6) (end -1.6 -1.6) (layer F.CrtYd) (width 0.05))
    (pad 1 thru_hole rect (at 0 0 90) (size 1.7 1.7) (drill 1) (layers *.Cu *.Mask)
      (net 1 +5V))
    (pad 2 thru_hole oval (at 0 2.54 90) (size 1.7 1.7) (drill 1) (layers *.Cu *.Mask)
      (net 2 "Net-(D1-Pad2)"))
    (model Pin_Headers.3dshapes/Pin_Header_Straight_1x02_Pitch2.54mm.wrl
      (at (xyz 0 -0.05 0))
      (scale (xyz 1 1 1))
      (rotate (xyz 0 0 90))
    )
  )

  (module TO_SOT_Packages_THT:TO-92_Molded_Narrow (layer F.Cu) (tedit 58610942) (tstamp 5B83489F)
    (at 125.73 99.06 270)
    (descr "TO-92 leads molded, narrow, drill 0.6mm (see NXP sot054_po.pdf)")
    (tags "to-92 sc-43 sc-43a sot54 PA33 transistor")
    (path /5B6E4499)
    (fp_text reference Q1 (at 1.27 -3.556 270) (layer F.SilkS)
      (effects (font (size 1 1) (thickness 0.15)))
    )
    (fp_text value BC547 (at 1.27 2.794 270) (layer F.Fab)
      (effects (font (size 1 1) (thickness 0.15)))
    )
    (fp_line (start -1.65 -2.9) (end 4.15 -2.9) (layer F.CrtYd) (width 0.05))
    (fp_line (start 4.15 -2.9) (end 4.15 2.2) (layer F.CrtYd) (width 0.05))
    (fp_line (start 4.15 2.2) (end -1.65 2.2) (layer F.CrtYd) (width 0.05))
    (fp_line (start -1.65 2.2) (end -1.65 -2.9) (layer F.CrtYd) (width 0.05))
    (fp_line (start -0.53 1.85) (end 3.07 1.85) (layer F.SilkS) (width 0.12))
    (fp_line (start -0.5 1.75) (end 3 1.75) (layer F.Fab) (width 0.1))
    (fp_arc (start 1.27 0) (end 1.27 -2.48) (angle 135) (layer F.Fab) (width 0.1))
    (fp_arc (start 1.27 0) (end 1.27 -2.6) (angle -135) (layer F.SilkS) (width 0.12))
    (fp_arc (start 1.27 0) (end 1.27 -2.48) (angle -135) (layer F.Fab) (width 0.1))
    (fp_arc (start 1.27 0) (end 1.27 -2.6) (angle 135) (layer F.SilkS) (width 0.12))
    (pad 2 thru_hole circle (at 1.27 -1.27) (size 1 1) (drill 0.6) (layers *.Cu *.Mask)
      (net 17 "Net-(Q1-Pad2)"))
    (pad 3 thru_hole circle (at 2.54 0) (size 1 1) (drill 0.6) (layers *.Cu *.Mask)
      (net 3 GNDREF))
    (pad 1 thru_hole rect (at 0 0) (size 1 1) (drill 0.6) (layers *.Cu *.Mask)
      (net 2 "Net-(D1-Pad2)"))
    (model TO_SOT_Packages_THT.3dshapes/TO-92_Molded_Narrow.wrl
      (at (xyz 0.05 0 0))
      (scale (xyz 1 1 1))
      (rotate (xyz 0 0 -90))
    )
  )

  (module lib_fp:Adafruit_Feather_HUZZAH_ESP8266 (layer F.Cu) (tedit 5B795CB7) (tstamp 5B83494E)
    (at 134.7 119.46)
    (path /5B8E4C0C)
    (fp_text reference U1 (at 0 1) (layer F.Fab)
      (effects (font (size 0.6 0.6) (thickness 0.1)))
    )
    (fp_text value Adafruit_Feather_HUZZAH_ESP32 (at 0 0) (layer F.Fab)
      (effects (font (size 0.6 0.5) (thickness 0.1)))
    )
    (fp_text user %R (at 17.78 8.89 180) (layer Eco1.User)
      (effects (font (size 0.3 0.3) (thickness 0.03)))
    )
    (fp_arc (start -22.86 -8.89) (end -25.4 -8.89) (angle 90) (layer Dwgs.User) (width 0.05))
    (fp_arc (start -22.86 8.89) (end -22.86 11.43) (angle 90) (layer Dwgs.User) (width 0.05))
    (fp_arc (start 22.86 8.89) (end 22.86 11.43) (angle -88.9) (layer Dwgs.User) (width 0.05))
    (fp_arc (start 22.86 -8.89) (end 22.86 -11.43) (angle 90) (layer Dwgs.User) (width 0.05))
    (fp_line (start -25.4 -8.89) (end -25.4 8.89) (layer Dwgs.User) (width 0.05))
    (fp_line (start -22.86 11.43) (end 22.86 11.43) (layer Dwgs.User) (width 0.05))
    (fp_line (start 25.4 8.89) (end 25.4 -8.89) (layer Dwgs.User) (width 0.05))
    (fp_line (start 22.86 -11.43) (end -22.86 -11.43) (layer Dwgs.User) (width 0.05))
    (fp_circle (center 19.05 10.16) (end 19.558 10.16) (layer Cmts.User) (width 0.05))
    (fp_line (start 18.542 10.668) (end 19.558 9.652) (layer Cmts.User) (width 0.05))
    (fp_line (start 18.542 9.652) (end 19.558 10.668) (layer Cmts.User) (width 0.05))
    (fp_text user 1 (at 19.05 10.922) (layer Cmts.User)
      (effects (font (size 0.3 0.25) (thickness 0.03)))
    )
    (fp_line (start 16.002 9.652) (end 17.018 10.668) (layer Cmts.User) (width 0.05))
    (fp_line (start 13.462 9.652) (end 14.478 10.668) (layer Cmts.User) (width 0.05))
    (fp_line (start 10.922 9.652) (end 11.938 10.668) (layer Cmts.User) (width 0.05))
    (fp_line (start 8.382 9.652) (end 9.398 10.668) (layer Cmts.User) (width 0.05))
    (fp_line (start 5.842 9.652) (end 6.858 10.668) (layer Cmts.User) (width 0.05))
    (fp_line (start 3.302 9.652) (end 4.318 10.668) (layer Cmts.User) (width 0.05))
    (fp_line (start 0.762 9.652) (end 1.778 10.668) (layer Cmts.User) (width 0.05))
    (fp_line (start -1.778 9.652) (end -0.762 10.668) (layer Cmts.User) (width 0.05))
    (fp_line (start -4.318 9.652) (end -3.302 10.668) (layer Cmts.User) (width 0.05))
    (fp_line (start -6.858 9.652) (end -5.842 10.668) (layer Cmts.User) (width 0.05))
    (fp_line (start -9.398 9.652) (end -8.382 10.668) (layer Cmts.User) (width 0.05))
    (fp_line (start -11.938 9.652) (end -10.922 10.668) (layer Cmts.User) (width 0.05))
    (fp_line (start -14.478 9.652) (end -13.462 10.668) (layer Cmts.User) (width 0.05))
    (fp_line (start -17.018 9.652) (end -16.002 10.668) (layer Cmts.User) (width 0.05))
    (fp_line (start -19.558 9.652) (end -18.542 10.668) (layer Cmts.User) (width 0.05))
    (fp_line (start 18.542 -10.668) (end 19.558 -9.652) (layer Cmts.User) (width 0.05))
    (fp_line (start 16.002 -10.668) (end 17.018 -9.652) (layer Cmts.User) (width 0.05))
    (fp_line (start 13.462 -10.668) (end 14.478 -9.652) (layer Cmts.User) (width 0.05))
    (fp_line (start 10.922 -10.668) (end 11.938 -9.652) (layer Cmts.User) (width 0.05))
    (fp_line (start 8.382 -10.668) (end 9.398 -9.652) (layer Cmts.User) (width 0.05))
    (fp_line (start 5.842 -10.668) (end 6.858 -9.652) (layer Cmts.User) (width 0.05))
    (fp_line (start 3.302 -10.668) (end 4.318 -9.652) (layer Cmts.User) (width 0.05))
    (fp_line (start 0.762 -10.668) (end 1.778 -9.652) (layer Cmts.User) (width 0.05))
    (fp_line (start -1.778 -10.668) (end -0.762 -9.652) (layer Cmts.User) (width 0.05))
    (fp_line (start -4.318 -10.668) (end -3.302 -9.652) (layer Cmts.User) (width 0.05))
    (fp_line (start -6.858 -10.668) (end -5.842 -9.652) (layer Cmts.User) (width 0.05))
    (fp_line (start -9.398 -10.668) (end -8.382 -9.652) (layer Cmts.User) (width 0.05))
    (fp_line (start 16.002 10.668) (end 17.018 9.652) (layer Cmts.User) (width 0.05))
    (fp_line (start 13.462 10.668) (end 14.478 9.652) (layer Cmts.User) (width 0.05))
    (fp_line (start 10.922 10.668) (end 11.938 9.652) (layer Cmts.User) (width 0.05))
    (fp_line (start 8.382 10.668) (end 9.398 9.652) (layer Cmts.User) (width 0.05))
    (fp_line (start 5.842 10.668) (end 6.858 9.652) (layer Cmts.User) (width 0.05))
    (fp_line (start 3.302 10.668) (end 4.318 9.652) (layer Cmts.User) (width 0.05))
    (fp_line (start 0.762 10.668) (end 1.778 9.652) (layer Cmts.User) (width 0.05))
    (fp_line (start -1.778 10.668) (end -0.762 9.652) (layer Cmts.User) (width 0.05))
    (fp_line (start -4.318 10.668) (end -3.302 9.652) (layer Cmts.User) (width 0.05))
    (fp_line (start -6.858 10.668) (end -5.842 9.652) (layer Cmts.User) (width 0.05))
    (fp_line (start -9.398 10.668) (end -8.382 9.652) (layer Cmts.User) (width 0.05))
    (fp_line (start -11.938 10.668) (end -10.922 9.652) (layer Cmts.User) (width 0.05))
    (fp_line (start -14.478 10.668) (end -13.462 9.652) (layer Cmts.User) (width 0.05))
    (fp_line (start -17.018 10.668) (end -16.002 9.652) (layer Cmts.User) (width 0.05))
    (fp_line (start -19.558 10.668) (end -18.542 9.652) (layer Cmts.User) (width 0.05))
    (fp_line (start 18.542 -9.652) (end 19.558 -10.668) (layer Cmts.User) (width 0.05))
    (fp_line (start 16.002 -9.652) (end 17.018 -10.668) (layer Cmts.User) (width 0.05))
    (fp_line (start 13.462 -9.652) (end 14.478 -10.668) (layer Cmts.User) (width 0.05))
    (fp_line (start 10.922 -9.652) (end 11.938 -10.668) (layer Cmts.User) (width 0.05))
    (fp_line (start 8.382 -9.652) (end 9.398 -10.668) (layer Cmts.User) (width 0.05))
    (fp_line (start 5.842 -9.652) (end 6.858 -10.668) (layer Cmts.User) (width 0.05))
    (fp_line (start 3.302 -9.652) (end 4.318 -10.668) (layer Cmts.User) (width 0.05))
    (fp_line (start 0.762 -9.652) (end 1.778 -10.668) (layer Cmts.User) (width 0.05))
    (fp_line (start -1.778 -9.652) (end -0.762 -10.668) (layer Cmts.User) (width 0.05))
    (fp_line (start -4.318 -9.652) (end -3.302 -10.668) (layer Cmts.User) (width 0.05))
    (fp_line (start -6.858 -9.652) (end -5.842 -10.668) (layer Cmts.User) (width 0.05))
    (fp_line (start -9.398 -9.652) (end -8.382 -10.668) (layer Cmts.User) (width 0.05))
    (fp_circle (center 16.51 10.16) (end 17.018 10.16) (layer Cmts.User) (width 0.05))
    (fp_circle (center 13.97 10.16) (end 14.478 10.16) (layer Cmts.User) (width 0.05))
    (fp_circle (center 11.43 10.16) (end 11.938 10.16) (layer Cmts.User) (width 0.05))
    (fp_circle (center 8.89 10.16) (end 9.398 10.16) (layer Cmts.User) (width 0.05))
    (fp_circle (center 6.35 10.16) (end 6.858 10.16) (layer Cmts.User) (width 0.05))
    (fp_circle (center 3.81 10.16) (end 4.318 10.16) (layer Cmts.User) (width 0.05))
    (fp_circle (center 1.27 10.16) (end 1.778 10.16) (layer Cmts.User) (width 0.05))
    (fp_circle (center -1.27 10.16) (end -0.762 10.16) (layer Cmts.User) (width 0.05))
    (fp_circle (center -3.81 10.16) (end -3.302 10.16) (layer Cmts.User) (width 0.05))
    (fp_circle (center -6.35 10.16) (end -5.842 10.16) (layer Cmts.User) (width 0.05))
    (fp_circle (center -8.89 10.16) (end -8.382 10.16) (layer Cmts.User) (width 0.05))
    (fp_circle (center -11.43 10.16) (end -10.922 10.16) (layer Cmts.User) (width 0.05))
    (fp_circle (center -13.97 10.16) (end -13.462 10.16) (layer Cmts.User) (width 0.05))
    (fp_circle (center -16.51 10.16) (end -16.002 10.16) (layer Cmts.User) (width 0.05))
    (fp_circle (center -19.05 10.16) (end -18.542 10.16) (layer Cmts.User) (width 0.05))
    (fp_circle (center 19.05 -10.16) (end 19.558 -10.16) (layer Cmts.User) (width 0.05))
    (fp_circle (center 16.51 -10.16) (end 17.018 -10.16) (layer Cmts.User) (width 0.05))
    (fp_circle (center 13.97 -10.16) (end 14.478 -10.16) (layer Cmts.User) (width 0.05))
    (fp_circle (center 11.43 -10.16) (end 11.938 -10.16) (layer Cmts.User) (width 0.05))
    (fp_circle (center 8.89 -10.16) (end 9.398 -10.16) (layer Cmts.User) (width 0.05))
    (fp_circle (center 6.35 -10.16) (end 6.858 -10.16) (layer Cmts.User) (width 0.05))
    (fp_circle (center 3.81 -10.16) (end 4.318 -10.16) (layer Cmts.User) (width 0.05))
    (fp_circle (center 1.27 -10.16) (end 1.778 -10.16) (layer Cmts.User) (width 0.05))
    (fp_circle (center -1.27 -10.16) (end -0.762 -10.16) (layer Cmts.User) (width 0.05))
    (fp_circle (center -3.81 -10.16) (end -3.302 -10.16) (layer Cmts.User) (width 0.05))
    (fp_circle (center -6.35 -10.16) (end -5.842 -10.16) (layer Cmts.User) (width 0.05))
    (fp_circle (center -8.89 -10.16) (end -8.382 -10.16) (layer Cmts.User) (width 0.05))
    (fp_text user 2 (at 16.51 10.922) (layer Cmts.User)
      (effects (font (size 0.3 0.25) (thickness 0.03)))
    )
    (fp_text user 3 (at 13.97 10.922) (layer Cmts.User)
      (effects (font (size 0.3 0.25) (thickness 0.03)))
    )
    (fp_text user 4 (at 11.43 10.922) (layer Cmts.User)
      (effects (font (size 0.3 0.25) (thickness 0.03)))
    )
    (fp_text user 5 (at 8.89 10.922) (layer Cmts.User)
      (effects (font (size 0.3 0.25) (thickness 0.03)))
    )
    (fp_text user 6 (at 6.35 10.922) (layer Cmts.User)
      (effects (font (size 0.3 0.25) (thickness 0.03)))
    )
    (fp_text user 7 (at 3.81 10.922) (layer Cmts.User)
      (effects (font (size 0.3 0.25) (thickness 0.03)))
    )
    (fp_text user 8 (at 1.27 10.922) (layer Cmts.User)
      (effects (font (size 0.3 0.25) (thickness 0.03)))
    )
    (fp_text user 9 (at -1.27 10.922) (layer Cmts.User)
      (effects (font (size 0.3 0.25) (thickness 0.03)))
    )
    (fp_text user 10 (at -3.81 10.922) (layer Cmts.User)
      (effects (font (size 0.3 0.25) (thickness 0.03)))
    )
    (fp_text user 11 (at -6.35 10.922) (layer Cmts.User)
      (effects (font (size 0.3 0.25) (thickness 0.03)))
    )
    (fp_text user 12 (at -8.89 10.922) (layer Cmts.User)
      (effects (font (size 0.3 0.25) (thickness 0.03)))
    )
    (fp_text user 13 (at -11.43 10.922) (layer Cmts.User)
      (effects (font (size 0.3 0.25) (thickness 0.03)))
    )
    (fp_text user 14 (at -13.97 10.922) (layer Cmts.User)
      (effects (font (size 0.3 0.25) (thickness 0.03)))
    )
    (fp_text user 15 (at -16.51 10.922) (layer Cmts.User)
      (effects (font (size 0.3 0.25) (thickness 0.03)))
    )
    (fp_text user 16 (at -19.05 10.922) (layer Cmts.User)
      (effects (font (size 0.3 0.25) (thickness 0.03)))
    )
    (fp_text user 1 (at 19.05 -10.922) (layer Cmts.User)
      (effects (font (size 0.3 0.25) (thickness 0.03)))
    )
    (fp_text user 2 (at 16.51 -10.922) (layer Cmts.User)
      (effects (font (size 0.3 0.25) (thickness 0.03)))
    )
    (fp_text user 3 (at 13.97 -10.922) (layer Cmts.User)
      (effects (font (size 0.3 0.25) (thickness 0.03)))
    )
    (fp_text user 4 (at 11.43 -10.922) (layer Cmts.User)
      (effects (font (size 0.3 0.25) (thickness 0.03)))
    )
    (fp_text user 5 (at 8.89 -10.922) (layer Cmts.User)
      (effects (font (size 0.3 0.25) (thickness 0.03)))
    )
    (fp_text user 6 (at 6.35 -10.922) (layer Cmts.User)
      (effects (font (size 0.3 0.25) (thickness 0.03)))
    )
    (fp_text user 7 (at 3.81 -10.922) (layer Cmts.User)
      (effects (font (size 0.3 0.25) (thickness 0.03)))
    )
    (fp_text user 8 (at 1.27 -10.922) (layer Cmts.User)
      (effects (font (size 0.3 0.25) (thickness 0.03)))
    )
    (fp_text user 9 (at -1.27 -10.922) (layer Cmts.User)
      (effects (font (size 0.3 0.25) (thickness 0.03)))
    )
    (fp_text user 10 (at -3.81 -10.922) (layer Cmts.User)
      (effects (font (size 0.3 0.25) (thickness 0.03)))
    )
    (fp_text user 11 (at -6.35 -10.922) (layer Cmts.User)
      (effects (font (size 0.3 0.25) (thickness 0.03)))
    )
    (fp_text user 12 (at -8.89 -10.922) (layer Cmts.User)
      (effects (font (size 0.3 0.25) (thickness 0.03)))
    )
    (pad 1 thru_hole circle (at -19.05 10.16) (size 1.524 1.524) (drill 0.762) (layers *.Cu *.Mask)
      (net 18 "Net-(U1-Pad1)"))
    (pad 2 thru_hole circle (at -16.51 10.16) (size 1.524 1.524) (drill 0.762) (layers *.Cu *.Mask)
      (net 19 "Net-(U1-Pad2)"))
    (pad 3 thru_hole circle (at -13.97 10.16) (size 1.524 1.524) (drill 0.762) (layers *.Cu *.Mask)
      (net 20 "Net-(U1-Pad3)"))
    (pad 4 thru_hole circle (at -11.43 10.16) (size 1.524 1.524) (drill 0.762) (layers *.Cu *.Mask)
      (net 3 GNDREF))
    (pad 5 thru_hole circle (at -8.89 10.16) (size 1.524 1.524) (drill 0.762) (layers *.Cu *.Mask)
      (net 21 "Net-(U1-Pad5)"))
    (pad 6 thru_hole circle (at -6.35 10.16) (size 1.524 1.524) (drill 0.762) (layers *.Cu *.Mask)
      (net 22 "Net-(U1-Pad6)"))
    (pad 7 thru_hole circle (at -3.81 10.16) (size 1.524 1.524) (drill 0.762) (layers *.Cu *.Mask)
      (net 23 "Net-(U1-Pad7)"))
    (pad 8 thru_hole circle (at -1.27 10.16) (size 1.524 1.524) (drill 0.762) (layers *.Cu *.Mask)
      (net 24 "Net-(U1-Pad8)"))
    (pad 9 thru_hole circle (at 1.27 10.16) (size 1.524 1.524) (drill 0.762) (layers *.Cu *.Mask)
      (net 25 "Net-(U1-Pad9)"))
    (pad 10 thru_hole circle (at 3.81 10.16) (size 1.524 1.524) (drill 0.762) (layers *.Cu *.Mask)
      (net 26 "Net-(U1-Pad10)"))
    (pad 11 thru_hole circle (at 6.35 10.16) (size 1.524 1.524) (drill 0.762) (layers *.Cu *.Mask)
      (net 13 /MAT_CLK))
    (pad 12 thru_hole circle (at 8.89 10.16) (size 1.524 1.524) (drill 0.762) (layers *.Cu *.Mask)
      (net 12 /MAT_DATA))
    (pad 13 thru_hole circle (at 11.43 10.16) (size 1.524 1.524) (drill 0.762) (layers *.Cu *.Mask)
      (net 14 /MAT_LE))
    (pad 14 thru_hole circle (at 13.97 10.16) (size 1.524 1.524) (drill 0.762) (layers *.Cu *.Mask)
      (net 27 "Net-(U1-Pad14)"))
    (pad 15 thru_hole circle (at 16.51 10.16) (size 1.524 1.524) (drill 0.762) (layers *.Cu *.Mask)
      (net 33 "Net-(U1-Pad15)"))
    (pad 16 thru_hole circle (at 19.05 10.16) (size 1.524 1.524) (drill 0.762) (layers *.Cu *.Mask)
      (net 28 "Net-(U1-Pad16)"))
    (pad 17 thru_hole circle (at 19.05 -10.16) (size 1.524 1.524) (drill 0.762) (layers *.Cu *.Mask)
      (net 15 /MAT_A))
    (pad 18 thru_hole circle (at 16.51 -10.16) (size 1.524 1.524) (drill 0.762) (layers *.Cu *.Mask)
      (net 16 /MAT_B))
    (pad 19 thru_hole circle (at 13.97 -10.16) (size 1.524 1.524) (drill 0.762) (layers *.Cu *.Mask)
      (net 8 /DIG_OE))
    (pad 20 thru_hole circle (at 11.43 -10.16) (size 1.524 1.524) (drill 0.762) (layers *.Cu *.Mask)
      (net 7 /DIG_ST))
    (pad 21 thru_hole circle (at 8.89 -10.16) (size 1.524 1.524) (drill 0.762) (layers *.Cu *.Mask)
      (net 10 /DIG_DATA))
    (pad 22 thru_hole circle (at 6.35 -10.16) (size 1.524 1.524) (drill 0.762) (layers *.Cu *.Mask)
      (net 9 /DIG_CLK))
    (pad 23 thru_hole circle (at 3.81 -10.16) (size 1.524 1.524) (drill 0.762) (layers *.Cu *.Mask)
      (net 29 "Net-(U1-Pad23)"))
    (pad 24 thru_hole circle (at 1.27 -10.16) (size 1.524 1.524) (drill 0.762) (layers *.Cu *.Mask)
      (net 30 "Net-(U1-Pad24)"))
    (pad 25 thru_hole circle (at -1.27 -10.16) (size 1.524 1.524) (drill 0.762) (layers *.Cu *.Mask)
      (net 6 /RELAY))
    (pad 26 thru_hole circle (at -3.81 -10.16) (size 1.524 1.524) (drill 0.762) (layers *.Cu *.Mask)
      (net 1 +5V))
    (pad 27 thru_hole circle (at -6.35 -10.16) (size 1.524 1.524) (drill 0.762) (layers *.Cu *.Mask)
      (net 31 "Net-(U1-Pad27)"))
    (pad 28 thru_hole circle (at -8.89 -10.16) (size 1.524 1.524) (drill 0.762) (layers *.Cu *.Mask)
      (net 32 "Net-(U1-Pad28)"))
  )

  (module Diodes_THT:D_A-405_P10.16mm_Horizontal (layer F.Cu) (tedit 5877C982) (tstamp 5B8E7AD5)
    (at 110.49 96.52)
    (descr "D, A-405 series, Axial, Horizontal, pin pitch=10.16mm, , length*diameter=5.2*2.7mm^2, , http://www.diodes.com/_files/packages/A-405.pdf")
    (tags "D A-405 series Axial Horizontal pin pitch 10.16mm  length 5.2mm diameter 2.7mm")
    (path /5B6E464E)
    (fp_text reference D1 (at 5.08 -2.41) (layer F.SilkS)
      (effects (font (size 1 1) (thickness 0.15)))
    )
    (fp_text value 1N4004 (at 5.08 0) (layer F.Fab)
      (effects (font (size 1 1) (thickness 0.15)))
    )
    (fp_line (start 2.48 -1.35) (end 2.48 1.35) (layer F.Fab) (width 0.1))
    (fp_line (start 2.48 1.35) (end 7.68 1.35) (layer F.Fab) (width 0.1))
    (fp_line (start 7.68 1.35) (end 7.68 -1.35) (layer F.Fab) (width 0.1))
    (fp_line (start 7.68 -1.35) (end 2.48 -1.35) (layer F.Fab) (width 0.1))
    (fp_line (start 0 0) (end 2.48 0) (layer F.Fab) (width 0.1))
    (fp_line (start 10.16 0) (end 7.68 0) (layer F.Fab) (width 0.1))
    (fp_line (start 3.26 -1.35) (end 3.26 1.35) (layer F.Fab) (width 0.1))
    (fp_line (start 2.42 -1.41) (end 2.42 1.41) (layer F.SilkS) (width 0.12))
    (fp_line (start 2.42 1.41) (end 7.74 1.41) (layer F.SilkS) (width 0.12))
    (fp_line (start 7.74 1.41) (end 7.74 -1.41) (layer F.SilkS) (width 0.12))
    (fp_line (start 7.74 -1.41) (end 2.42 -1.41) (layer F.SilkS) (width 0.12))
    (fp_line (start 1.08 0) (end 2.42 0) (layer F.SilkS) (width 0.12))
    (fp_line (start 9.08 0) (end 7.74 0) (layer F.SilkS) (width 0.12))
    (fp_line (start 3.26 -1.41) (end 3.26 1.41) (layer F.SilkS) (width 0.12))
    (fp_line (start -1.15 -1.7) (end -1.15 1.7) (layer F.CrtYd) (width 0.05))
    (fp_line (start -1.15 1.7) (end 11.35 1.7) (layer F.CrtYd) (width 0.05))
    (fp_line (start 11.35 1.7) (end 11.35 -1.7) (layer F.CrtYd) (width 0.05))
    (fp_line (start 11.35 -1.7) (end -1.15 -1.7) (layer F.CrtYd) (width 0.05))
    (pad 1 thru_hole rect (at 0 0) (size 1.8 1.8) (drill 0.9) (layers *.Cu *.Mask)
      (net 1 +5V))
    (pad 2 thru_hole oval (at 10.16 0) (size 1.8 1.8) (drill 0.9) (layers *.Cu *.Mask)
      (net 2 "Net-(D1-Pad2)"))
    (model Diodes_THT.3dshapes/D_A-405_P10.16mm_Horizontal.wrl
      (at (xyz 0 0 0))
      (scale (xyz 0.393701 0.393701 0.393701))
      (rotate (xyz 0 0 0))
    )
  )

  (module Resistors_THT:R_Axial_DIN0207_L6.3mm_D2.5mm_P10.16mm_Horizontal (layer F.Cu) (tedit 5874F706) (tstamp 5B8E7AEC)
    (at 120.65 100.33 180)
    (descr "Resistor, Axial_DIN0207 series, Axial, Horizontal, pin pitch=10.16mm, 0.25W = 1/4W, length*diameter=6.3*2.5mm^2, http://cdn-reichelt.de/documents/datenblatt/B400/1_4W%23YAG.pdf")
    (tags "Resistor Axial_DIN0207 series Axial Horizontal pin pitch 10.16mm 0.25W = 1/4W length 6.3mm diameter 2.5mm")
    (path /5B6E4540)
    (fp_text reference R1 (at 5.08 -2.31 180) (layer F.SilkS)
      (effects (font (size 1 1) (thickness 0.15)))
    )
    (fp_text value 1k (at 5.08 0 180) (layer F.Fab)
      (effects (font (size 1 1) (thickness 0.15)))
    )
    (fp_line (start 1.93 -1.25) (end 1.93 1.25) (layer F.Fab) (width 0.1))
    (fp_line (start 1.93 1.25) (end 8.23 1.25) (layer F.Fab) (width 0.1))
    (fp_line (start 8.23 1.25) (end 8.23 -1.25) (layer F.Fab) (width 0.1))
    (fp_line (start 8.23 -1.25) (end 1.93 -1.25) (layer F.Fab) (width 0.1))
    (fp_line (start 0 0) (end 1.93 0) (layer F.Fab) (width 0.1))
    (fp_line (start 10.16 0) (end 8.23 0) (layer F.Fab) (width 0.1))
    (fp_line (start 1.87 -1.31) (end 1.87 1.31) (layer F.SilkS) (width 0.12))
    (fp_line (start 1.87 1.31) (end 8.29 1.31) (layer F.SilkS) (width 0.12))
    (fp_line (start 8.29 1.31) (end 8.29 -1.31) (layer F.SilkS) (width 0.12))
    (fp_line (start 8.29 -1.31) (end 1.87 -1.31) (layer F.SilkS) (width 0.12))
    (fp_line (start 0.98 0) (end 1.87 0) (layer F.SilkS) (width 0.12))
    (fp_line (start 9.18 0) (end 8.29 0) (layer F.SilkS) (width 0.12))
    (fp_line (start -1.05 -1.6) (end -1.05 1.6) (layer F.CrtYd) (width 0.05))
    (fp_line (start -1.05 1.6) (end 11.25 1.6) (layer F.CrtYd) (width 0.05))
    (fp_line (start 11.25 1.6) (end 11.25 -1.6) (layer F.CrtYd) (width 0.05))
    (fp_line (start 11.25 -1.6) (end -1.05 -1.6) (layer F.CrtYd) (width 0.05))
    (pad 1 thru_hole circle (at 0 0 180) (size 1.6 1.6) (drill 0.8) (layers *.Cu *.Mask)
      (net 17 "Net-(Q1-Pad2)"))
    (pad 2 thru_hole oval (at 10.16 0 180) (size 1.6 1.6) (drill 0.8) (layers *.Cu *.Mask)
      (net 6 /RELAY))
    (model Resistors_THT.3dshapes/R_Axial_DIN0207_L6.3mm_D2.5mm_P10.16mm_Horizontal.wrl
      (at (xyz 0 0 0))
      (scale (xyz 0.393701 0.393701 0.393701))
      (rotate (xyz 0 0 0))
    )
  )

  (module lib_fp:bhack-logo (layer F.Cu) (tedit 5B7BC19D) (tstamp 5B8E7CA3)
    (at 142 135)
    (descr "Imported from /home/firnsy/Downloads/bhack.svg")
    (tags svg2mod)
    (attr smd)
    (fp_text reference svg2mod (at 0 -5.790288) (layer F.SilkS) hide
      (effects (font (thickness 0.3048)))
    )
    (fp_text value G*** (at 0 5.790288) (layer F.SilkS) hide
      (effects (font (thickness 0.3048)))
    )
    (fp_poly (pts (xy 1.841978 -2.742238) (xy 1.841688 -2.741768) (xy 1.800573 -2.666258) (xy 1.721363 -2.591128)
      (xy 1.641383 -2.539359) (xy 1.547924 -2.491692) (xy 1.439338 -2.447518) (xy 1.313974 -2.406226)
      (xy 1.170186 -2.367209) (xy 1.006323 -2.329858) (xy 0.812756 -2.286621) (xy 0.656494 -2.246041)
      (xy 0.535402 -2.207339) (xy 0.447346 -2.169736) (xy 0.390193 -2.132454) (xy 0.361808 -2.094713)
      (xy 0.378088 -2.034966) (xy 0.467548 -1.971582) (xy 0.625568 -1.907823) (xy 0.689985 -1.887648)
      (xy 0.761577 -1.867489) (xy 0.844301 -1.846457) (xy 0.942113 -1.823665) (xy 1.058971 -1.798227)
      (xy 1.198832 -1.769255) (xy 1.365651 -1.735862) (xy 1.563388 -1.697163) (xy 1.678235 -1.67305)
      (xy 1.761628 -1.652463) (xy 1.835968 -1.633663) (xy 1.842187 -1.640951) (xy 1.846013 -1.678532)
      (xy 1.84797 -1.769076) (xy 1.84858 -1.935255) (xy 1.848368 -2.199743) (xy 1.847836 -2.371919)
      (xy 1.846785 -2.520537) (xy 1.845354 -2.637321) (xy 1.843685 -2.713996) (xy 1.841918 -2.742288)
      (xy 1.841958 -2.742288) (xy 1.841978 -2.742238)) (layer F.SilkS) (width 0.024233))
    (fp_poly (pts (xy 0.240588 -2.001978) (xy 0.240588 -1.007743) (xy 0.240588 -0.013513) (xy 0.284438 -0.013513)
      (xy 0.361221 -0.015185) (xy 0.476574 -0.019333) (xy 0.606717 -0.02493) (xy 0.72787 -0.030948)
      (xy 0.816253 -0.036363) (xy 0.965604 -0.049118) (xy 1.110371 -0.064875) (xy 1.250186 -0.08355)
      (xy 1.384682 -0.105056) (xy 1.513492 -0.129307) (xy 1.636249 -0.156218) (xy 1.752587 -0.185701)
      (xy 1.862137 -0.217672) (xy 1.964532 -0.252045) (xy 2.059407 -0.288733) (xy 2.146392 -0.327651)
      (xy 2.225123 -0.368713) (xy 2.338242 -0.44086) (xy 2.431218 -0.517948) (xy 2.503927 -0.599799)
      (xy 2.556243 -0.686239) (xy 2.588043 -0.777094) (xy 2.599203 -0.872188) (xy 2.587053 -0.985168)
      (xy 2.553811 -1.06116) (xy 2.502494 -1.134281) (xy 2.433404 -1.204348) (xy 2.346843 -1.271175)
      (xy 2.243115 -1.334581) (xy 2.122521 -1.394381) (xy 1.985365 -1.450391) (xy 1.831948 -1.502428)
      (xy 1.662573 -1.550308) (xy 1.556054 -1.576898) (xy 1.452468 -1.600458) (xy 1.335812 -1.624423)
      (xy 1.190088 -1.652228) (xy 1.013485 -1.687568) (xy 0.85322 -1.724638) (xy 0.709887 -1.763232)
      (xy 0.584081 -1.803143) (xy 0.476394 -1.844168) (xy 0.387422 -1.8861) (xy 0.317758 -1.928735)
      (xy 0.267998 -1.971868) (xy 0.240588 -2.001978)) (layer F.SilkS) (width 0.024233))
    (fp_poly (pts (xy 2.740488 -0.770483) (xy 2.725738 -0.713993) (xy 2.694138 -0.625957) (xy 2.646873 -0.538396)
      (xy 2.587515 -0.457015) (xy 2.519638 -0.387523) (xy 2.449599 -0.332104) (xy 2.370282 -0.279376)
      (xy 2.282003 -0.229443) (xy 2.185079 -0.182411) (xy 2.079827 -0.138388) (xy 1.966564 -0.097479)
      (xy 1.845606 -0.05979) (xy 1.717271 -0.025427) (xy 1.581875 0.005503) (xy 1.439736 0.032895)
      (xy 1.291169 0.056642) (xy 1.136493 0.076638) (xy 1.028699 0.087819) (xy 0.906074 0.098589)
      (xy 0.77593 0.108472) (xy 0.645577 0.116991) (xy 0.522327 0.12367) (xy 0.41349 0.128032)
      (xy 0.326378 0.129603) (xy 0.228688 0.132603) (xy 0.190383 0.133325) (xy 0.090181 0.135047)
      (xy -0.049848 0.137103) (xy -0.043398 0.176153) (xy -0.022529 0.296908) (xy -0.010998 0.349623)
      (xy 0.042613 0.371273) (xy 0.121718 0.403273) (xy 0.151968 0.417873) (xy 0.292313 0.311248)
      (xy 0.412515 0.222899) (xy 0.456473 0.204383) (xy 0.508187 0.226164) (xy 0.631838 0.339488)
      (xy 0.75903 0.466555) (xy 0.81565 0.540288) (xy 0.822213 0.587343) (xy 0.789612 0.637666)
      (xy 0.717858 0.733983) (xy 0.618493 0.862973) (xy 0.647093 0.922053) (xy 0.684243 1.008903)
      (xy 0.706193 1.041853) (xy 0.764267 1.052271) (xy 0.885128 1.069853) (xy 0.939693 1.077603)
      (xy 0.999118 1.010976) (xy 1.072408 0.928608) (xy 1.187897 0.799656) (xy 1.242546 0.756162)
      (xy 1.304243 0.744068) (xy 1.423188 0.722454) (xy 1.535538 0.697625) (xy 1.64227 0.669296)
      (xy 1.744358 0.637184) (xy 1.842779 0.601006) (xy 1.938508 0.560478) (xy 2.088492 0.488738)
      (xy 2.221733 0.416531) (xy 2.338685 0.343489) (xy 2.439803 0.269248) (xy 2.525539 0.19344)
      (xy 2.59635 0.115702) (xy 2.652688 0.035666) (xy 2.695008 -0.047033) (xy 2.72042 -0.116014)
      (xy 2.73432 -0.191329) (xy 2.740064 -0.305359) (xy 2.741008 -0.490483) (xy 2.740543 -0.770583)
      (xy 2.740528 -0.770583) (xy 2.740488 -0.770483)) (layer F.SilkS) (width 0.024233))
    (fp_poly (pts (xy -2.508073 0.022973) (xy -2.469973 0.059473) (xy -2.443114 0.084501) (xy -2.393341 0.130174)
      (xy -2.320958 0.196214) (xy -2.226269 0.282344) (xy -2.109577 0.388288) (xy -1.971187 0.513768)
      (xy -1.811403 0.658508) (xy -1.787043 0.67972) (xy -1.720559 0.737878) (xy -1.621841 0.824762)
      (xy -1.500782 0.93215) (xy -1.367273 1.051823) (xy -1.362273 1.050823) (xy -1.337723 0.987973)
      (xy -1.302223 0.904653) (xy -1.290523 0.882553) (xy -1.326723 0.834553) (xy -1.371768 0.777245)
      (xy -1.428938 0.706978) (xy -1.500929 0.613519) (xy -1.506373 0.572343) (xy -1.477359 0.527055)
      (xy -1.413401 0.453722) (xy -1.318378 0.356738) (xy -1.198028 0.247151) (xy -1.134918 0.217628)
      (xy -1.091909 0.234614) (xy -0.932148 0.352498) (xy -0.833033 0.427113) (xy -0.802033 0.411563)
      (xy -0.722458 0.377663) (xy -0.669798 0.355513) (xy -0.649298 0.229823) (xy -0.635948 0.135203)
      (xy -0.79385 0.129447) (xy -0.918897 0.124258) (xy -0.969763 0.122003) (xy -1.03283 0.120711)
      (xy -1.124478 0.11715) (xy -1.2392 0.111651) (xy -1.371493 0.104544) (xy -1.515849 0.096161)
      (xy -1.666764 0.086833) (xy -1.818733 0.076891) (xy -1.96625 0.066665) (xy -2.10381 0.056487)
      (xy -2.225908 0.046688) (xy -2.365436 0.0349) (xy -2.454648 0.027388) (xy -2.508073 0.022973)) (layer F.SilkS) (width 0.024233))
    (fp_poly (pts (xy 2.740963 0.622953) (xy 2.710463 0.702038) (xy 2.664046 0.809842) (xy 2.610221 0.911008)
      (xy 2.54846 1.006055) (xy 2.47823 1.095499) (xy 2.399004 1.179859) (xy 2.31025 1.259652)
      (xy 2.21144 1.335395) (xy 2.102042 1.407607) (xy 1.981528 1.476805) (xy 1.849368 1.543508)
      (xy 1.741903 1.591575) (xy 1.620444 1.640899) (xy 1.493508 1.688291) (xy 1.369612 1.730565)
      (xy 1.257273 1.764533) (xy 1.189368 1.784083) (xy 1.143904 1.753796) (xy 1.047123 1.676043)
      (xy 0.997823 1.635093) (xy 0.877258 1.654843) (xy 0.721741 1.680286) (xy 0.695938 1.697443)
      (xy 0.660688 1.780768) (xy 0.630688 1.850203) (xy 0.654288 1.883403) (xy 0.695089 1.936294)
      (xy 0.760078 2.017093) (xy 0.819221 2.09268) (xy 0.846093 2.132898) (xy 0.845633 2.162798)
      (xy 0.819727 2.204068) (xy 0.760513 2.273303) (xy 0.672648 2.364988) (xy 0.563426 2.46707)
      (xy 0.491797 2.51246) (xy 0.442723 2.510683) (xy 0.402548 2.482244) (xy 0.324063 2.423123)
      (xy 0.24238 2.361007) (xy 0.194448 2.324973) (xy 0.170398 2.307573) (xy 0.142498 2.322173)
      (xy 0.059583 2.357723) (xy 0.004778 2.378923) (xy -0.011173 2.499668) (xy -0.02451 2.596194)
      (xy -0.035973 2.665613) (xy 0.107405 2.648442) (xy 0.207969 2.63515) (xy 0.245893 2.629813)
      (xy 0.246173 2.619463) (xy 0.251173 2.630313) (xy 0.320014 2.621533) (xy 0.451619 2.60088)
      (xy 0.591658 2.576878) (xy 0.725331 2.551174) (xy 0.856213 2.523052) (xy 0.983535 2.492715)
      (xy 1.106525 2.460365) (xy 1.224412 2.426206) (xy 1.336427 2.390441) (xy 1.441798 2.353273)
      (xy 1.544537 2.312809) (xy 1.653289 2.265761) (xy 1.764989 2.213653) (xy 1.876571 2.158011)
      (xy 1.984968 2.100362) (xy 2.087116 2.04223) (xy 2.179948 1.985143) (xy 2.294225 1.906765)
      (xy 2.394271 1.827632) (xy 2.480594 1.747176) (xy 2.553708 1.664824) (xy 2.614122 1.580009)
      (xy 2.662349 1.492158) (xy 2.698898 1.400703) (xy 2.721438 1.320727) (xy 2.734398 1.232126)
      (xy 2.740269 1.106065) (xy 2.741548 0.913708) (xy 2.741258 0.623013) (xy 2.741233 0.623013)
      (xy 2.740963 0.622953)) (layer F.SilkS) (width 0.024233))
    (fp_poly (pts (xy -0.328403 0.899283) (xy -0.389633 0.903283) (xy -0.494577 0.926743) (xy -0.583221 0.971417)
      (xy -0.669123 1.044038) (xy -0.72266 1.102988) (xy -0.757043 1.163138) (xy -0.793645 1.267024)
      (xy -0.805158 1.371964) (xy -0.791612 1.476411) (xy -0.753043 1.578818) (xy -0.717308 1.638741)
      (xy -0.663218 1.697213) (xy -0.581636 1.764425) (xy -0.49611 1.808217) (xy -0.398733 1.832553)
      (xy -0.30365 1.834109) (xy -0.206933 1.821003) (xy -0.091689 1.772888) (xy 0.007072 1.695661)
      (xy 0.083058 1.595723) (xy 0.129978 1.479473) (xy 0.143262 1.372545) (xy 0.131796 1.265907)
      (xy 0.096786 1.164957) (xy 0.039438 1.075093) (xy -0.037645 0.999681) (xy -0.126438 0.944494)
      (xy -0.224203 0.91065) (xy -0.328208 0.899268) (xy -0.328403 0.899283)) (layer F.SilkS) (width 0.024233))
    (fp_poly (pts (xy -1.368678 1.689913) (xy -1.527949 1.809869) (xy -1.671379 1.917404) (xy -1.787735 2.00434)
      (xy -1.865785 2.062499) (xy -1.894298 2.083702) (xy -1.99936 2.162601) (xy -2.095232 2.234562)
      (xy -2.161158 2.284008) (xy -2.233859 2.338581) (xy -2.347541 2.423984) (xy -2.477573 2.521738)
      (xy -2.598714 2.612737) (xy -2.68905 2.680401) (xy -2.728948 2.710038) (xy -2.739648 2.724188)
      (xy -2.660979 2.7289) (xy -2.477078 2.735038) (xy -2.394492 2.736644) (xy -2.284004 2.737849)
      (xy -2.151724 2.738666) (xy -2.003763 2.739112) (xy -1.846232 2.739199) (xy -1.685241 2.738944)
      (xy -1.526902 2.73836) (xy -1.377326 2.737463) (xy -1.242622 2.736268) (xy -1.128902 2.734789)
      (xy -1.042277 2.73304) (xy -0.988858 2.731038) (xy -0.910703 2.726538) (xy -0.864613 2.724286)
      (xy -0.74752 2.718323) (xy -0.591188 2.709838) (xy -0.602763 2.647372) (xy -0.616438 2.564848)
      (xy -0.635481 2.450284) (xy -0.646688 2.394903) (xy -0.693638 2.367103) (xy -0.774883 2.335353)
      (xy -0.814933 2.318153) (xy -0.945028 2.417718) (xy -1.040379 2.490016) (xy -1.087038 2.523873)
      (xy -1.122538 2.530473) (xy -1.170499 2.508057) (xy -1.317678 2.372298) (xy -1.415289 2.275333)
      (xy -1.469046 2.210255) (xy -1.485658 2.168928) (xy -1.470194 2.122513) (xy -1.384393 2.007458)
      (xy -1.331247 1.93901) (xy -1.298618 1.896828) (xy -1.280768 1.873528) (xy -1.306718 1.819863)
      (xy -1.344368 1.729948) (xy -1.362718 1.691098) (xy -1.368668 1.690098) (xy -1.368678 1.689913)) (layer F.SilkS) (width 0.024233))
  )

  (gr_text + (at 125.73 136.398) (layer F.SilkS)
    (effects (font (size 1.5 1.5) (thickness 0.3)))
  )
  (gr_text "firnsy - 2018" (at 153.5 135.5) (layer F.SilkS)
    (effects (font (size 1.5 1.5) (thickness 0.3)))
  )
  (gr_circle (center 110 90) (end 108.5 90) (layer Edge.Cuts) (width 0.2))
  (gr_circle (center 165 137.5) (end 163.5 137.5) (layer Edge.Cuts) (width 0.2))
  (gr_line (start 107.5 140) (end 107.5 87.5) (layer Edge.Cuts) (width 0.2))
  (gr_line (start 167.5 140) (end 107.5 140) (layer Edge.Cuts) (width 0.2))
  (gr_line (start 167.5 87.5) (end 167.5 140) (layer Edge.Cuts) (width 0.2))
  (gr_line (start 107.5 87.5) (end 167.5 87.5) (layer Edge.Cuts) (width 0.2))

  (segment (start 110.49 96.52) (end 110.49 97.665357) (width 0.75) (layer B.Cu) (net 1))
  (segment (start 110.49 97.665357) (end 112.395 99.570357) (width 0.75) (layer B.Cu) (net 1))
  (segment (start 112.395 99.570357) (end 112.395 123.364844) (width 0.75) (layer B.Cu) (net 1))
  (segment (start 110.49 96.52) (end 110.49 94.87) (width 0.75) (layer B.Cu) (net 1))
  (segment (start 110.49 94.87) (end 113.84 91.52) (width 0.75) (layer B.Cu) (net 1))
  (segment (start 116.51 91.52) (end 118.11 91.52) (width 0.75) (layer B.Cu) (net 1))
  (segment (start 113.84 91.52) (end 116.51 91.52) (width 0.75) (layer B.Cu) (net 1))
  (segment (start 128.730156 115.236844) (end 130.89 113.077) (width 0.75) (layer B.Cu) (net 1))
  (segment (start 130.89 113.077) (end 130.89 109.3) (width 0.75) (layer B.Cu) (net 1))
  (segment (start 120.523 115.236844) (end 128.730156 115.236844) (width 0.75) (layer B.Cu) (net 1))
  (segment (start 112.395 123.364844) (end 120.523 115.236844) (width 0.75) (layer B.Cu) (net 1))
  (segment (start 115.5 136.5) (end 115.5 134.9) (width 0.75) (layer B.Cu) (net 1))
  (segment (start 115.5 134.9) (end 112.395 131.795) (width 0.75) (layer B.Cu) (net 1))
  (segment (start 112.395 131.795) (end 112.395 123.364844) (width 0.75) (layer B.Cu) (net 1))
  (segment (start 120.65 91.52) (end 120.65 96.52) (width 0.4) (layer B.Cu) (net 2))
  (segment (start 120.65 96.52) (end 124.09 96.52) (width 0.4) (layer B.Cu) (net 2))
  (segment (start 124.09 96.52) (end 125.73 98.16) (width 0.4) (layer B.Cu) (net 2))
  (segment (start 125.73 98.16) (end 125.73 99.06) (width 0.4) (layer B.Cu) (net 2))
  (segment (start 123.27 129.62) (end 123.27 136.35) (width 0.75) (layer B.Cu) (net 3))
  (segment (start 123.27 136.35) (end 123.12 136.5) (width 0.75) (layer B.Cu) (net 3))
  (segment (start 158.83 91.52) (end 156.31 89) (width 0.75) (layer B.Cu) (net 3))
  (segment (start 156.31 89) (end 140.14 89) (width 0.75) (layer B.Cu) (net 3))
  (segment (start 140.14 89) (end 137.62 91.52) (width 0.75) (layer B.Cu) (net 3))
  (segment (start 132.54 91.52) (end 130 91.52) (width 0.75) (layer B.Cu) (net 3))
  (segment (start 135.08 91.52) (end 132.54 91.52) (width 0.75) (layer B.Cu) (net 3))
  (segment (start 137.62 91.52) (end 135.08 91.52) (width 0.75) (layer B.Cu) (net 3))
  (segment (start 158.83 91.52) (end 158.83 94.06) (width 0.75) (layer B.Cu) (net 3))
  (segment (start 121.92 105.41) (end 129.54 105.41) (width 0.4) (layer F.Cu) (net 6))
  (segment (start 129.54 105.41) (end 133.43 109.3) (width 0.4) (layer F.Cu) (net 6))
  (segment (start 116.84 100.33) (end 121.92 105.41) (width 0.4) (layer F.Cu) (net 6))
  (segment (start 110.49 100.33) (end 116.84 100.33) (width 0.4) (layer F.Cu) (net 6))
  (segment (start 146.13 109.3) (end 146.13 101.357346) (width 0.5) (layer F.Cu) (net 7))
  (segment (start 146.13 101.357346) (end 151.21 96.277346) (width 0.5) (layer F.Cu) (net 7))
  (segment (start 151.21 96.277346) (end 151.21 94.06) (width 0.5) (layer F.Cu) (net 7))
  (segment (start 151.21 91.52) (end 151.21 94.06) (width 0.5) (layer B.Cu) (net 7))
  (segment (start 148.67 109.3) (end 148.67 102.449805) (width 0.5) (layer F.Cu) (net 8))
  (segment (start 148.67 102.449805) (end 153.75 97.369805) (width 0.5) (layer F.Cu) (net 8))
  (segment (start 153.75 97.369805) (end 153.75 94.06) (width 0.5) (layer F.Cu) (net 8))
  (segment (start 153.75 91.52) (end 153.75 94.06) (width 0.5) (layer B.Cu) (net 8))
  (segment (start 154.94 101.6) (end 156.29 100.25) (width 0.5) (layer B.Cu) (net 9))
  (segment (start 156.29 100.25) (end 156.29 94.06) (width 0.5) (layer B.Cu) (net 9))
  (segment (start 143.51 101.6) (end 154.94 101.6) (width 0.5) (layer B.Cu) (net 9))
  (segment (start 141.05 104.06) (end 143.51 101.6) (width 0.5) (layer B.Cu) (net 9))
  (segment (start 141.05 109.3) (end 141.05 104.06) (width 0.5) (layer B.Cu) (net 9))
  (segment (start 156.29 91.52) (end 156.29 94.06) (width 0.5) (layer B.Cu) (net 9))
  (segment (start 160.02 104.14) (end 161.37 102.79) (width 0.5) (layer B.Cu) (net 10))
  (segment (start 161.37 102.79) (end 161.37 94.06) (width 0.5) (layer B.Cu) (net 10))
  (segment (start 144.78 104.14) (end 160.02 104.14) (width 0.5) (layer B.Cu) (net 10))
  (segment (start 143.59 105.33) (end 144.78 104.14) (width 0.5) (layer B.Cu) (net 10))
  (segment (start 143.59 109.3) (end 143.59 105.33) (width 0.5) (layer B.Cu) (net 10))
  (segment (start 161.37 91.52) (end 161.37 94.06) (width 0.5) (layer B.Cu) (net 10))
  (segment (start 137.24 103.24) (end 132.54 98.54) (width 0.4) (layer F.Cu) (net 12))
  (segment (start 132.54 98.54) (end 132.54 94.06) (width 0.4) (layer F.Cu) (net 12))
  (segment (start 137.24 125.644373) (end 137.24 103.24) (width 0.4) (layer F.Cu) (net 12))
  (segment (start 137.24 125.644373) (end 139.102004 127.506377) (width 0.4) (layer F.Cu) (net 12))
  (segment (start 139.102004 127.506377) (end 142.808131 127.506377) (width 0.4) (layer F.Cu) (net 12))
  (segment (start 142.808131 127.506377) (end 143.571754 128.27) (width 0.4) (layer F.Cu) (net 12))
  (segment (start 143.571754 128.27) (end 143.571754 129.601754) (width 0.4) (layer F.Cu) (net 12))
  (segment (start 143.571754 129.601754) (end 143.59 129.62) (width 0.4) (layer F.Cu) (net 12))
  (segment (start 141.056649 125.845594) (end 139.665167 124.454112) (width 0.4) (layer F.Cu) (net 13))
  (segment (start 139.665167 102.165167) (end 135.08 97.58) (width 0.4) (layer F.Cu) (net 13))
  (segment (start 139.665167 124.454112) (end 139.665167 109.864595) (width 0.4) (layer F.Cu) (net 13))
  (segment (start 139.665167 108.735405) (end 139.665167 102.165167) (width 0.4) (layer F.Cu) (net 13))
  (segment (start 139.665167 109.864595) (end 139.672001 109.857761) (width 0.4) (layer F.Cu) (net 13))
  (segment (start 139.672001 109.857761) (end 139.672001 108.742239) (width 0.4) (layer F.Cu) (net 13))
  (segment (start 139.672001 108.742239) (end 139.665167 108.735405) (width 0.4) (layer F.Cu) (net 13))
  (segment (start 135.08 97.58) (end 135.08 94.06) (width 0.4) (layer F.Cu) (net 13))
  (segment (start 141.05 125.852243) (end 141.056649 125.845594) (width 0.4) (layer B.Cu) (net 13))
  (segment (start 141.05 129.62) (end 141.05 125.852243) (width 0.4) (layer B.Cu) (net 13))
  (via (at 141.056649 125.845594) (size 0.6) (drill 0.4) (layers F.Cu B.Cu) (net 13))
  (segment (start 137.62 94.06) (end 137.62 96.628591) (width 0.4) (layer F.Cu) (net 14))
  (segment (start 137.62 96.628591) (end 142.32 101.328591) (width 0.4) (layer F.Cu) (net 14))
  (segment (start 142.32 101.328591) (end 142.32 123.849835) (width 0.4) (layer F.Cu) (net 14))
  (segment (start 142.32 123.849835) (end 146.13 127.659835) (width 0.4) (layer F.Cu) (net 14))
  (segment (start 146.13 127.659835) (end 146.13 129.62) (width 0.4) (layer F.Cu) (net 14))
  (segment (start 144.86 94.06) (end 140.16 94.06) (width 0.4) (layer B.Cu) (net 15))
  (segment (start 153.67 100.33) (end 153.67 109.22) (width 0.4) (layer F.Cu) (net 15))
  (segment (start 153.67 109.22) (end 153.75 109.3) (width 0.4) (layer F.Cu) (net 15))
  (segment (start 144.86 94.06) (end 147.4 94.06) (width 0.4) (layer B.Cu) (net 15))
  (segment (start 147.4 94.06) (end 153.67 100.33) (width 0.4) (layer B.Cu) (net 15))
  (via (at 153.67 100.33) (size 0.6) (drill 0.4) (layers F.Cu B.Cu) (net 15))
  (segment (start 151.21 109.3) (end 151.210622 109.300622) (width 0.4) (layer F.Cu) (net 16))
  (segment (start 151.210622 109.300622) (end 151.210622 110.806558) (width 0.4) (layer F.Cu) (net 16))
  (segment (start 144.851414 110.701478) (end 144.851414 92.851414) (width 0.4) (layer F.Cu) (net 16))
  (segment (start 151.210622 110.806558) (end 150.559855 111.457325) (width 0.4) (layer F.Cu) (net 16))
  (segment (start 150.559855 111.457325) (end 145.607261 111.457325) (width 0.4) (layer F.Cu) (net 16))
  (segment (start 145.607261 111.457325) (end 144.851414 110.701478) (width 0.4) (layer F.Cu) (net 16))
  (segment (start 144.851414 92.851414) (end 143.52 91.52) (width 0.4) (layer F.Cu) (net 16))
  (segment (start 143.52 91.52) (end 140.16 91.52) (width 0.4) (layer F.Cu) (net 16))
  (segment (start 120.65 100.33) (end 127 100.33) (width 0.4) (layer B.Cu) (net 17))

  (zone (net 3) (net_name GNDREF) (layer B.Cu) (tstamp 0) (hatch edge 0.508)
    (connect_pads (clearance 0.508))
    (min_thickness 0.254)
    (fill yes (arc_segments 16) (thermal_gap 0.508) (thermal_bridge_width 0.508))
    (polygon
      (pts
        (xy 112.5 88.5) (xy 112.5 92.5) (xy 108.5 92.5) (xy 108.5 139) (xy 162.5 139)
        (xy 162.5 135) (xy 166.5 135) (xy 166.5 88.5)
      )
    )
    (filled_polygon
      (pts
        (xy 166.373 134.873) (xy 162.5 134.873) (xy 162.45059 134.883006) (xy 162.408965 134.911447) (xy 162.381685 134.953841)
        (xy 162.373 135) (xy 162.373 138.873) (xy 108.627 138.873) (xy 108.627 92.627) (xy 111.304644 92.627)
        (xy 109.775822 94.155822) (xy 109.556882 94.48349) (xy 109.48 94.87) (xy 109.48 94.993258) (xy 109.354683 95.016838)
        (xy 109.138559 95.15591) (xy 108.993569 95.36811) (xy 108.94256 95.62) (xy 108.94256 97.42) (xy 108.986838 97.655317)
        (xy 109.12591 97.871441) (xy 109.33811 98.016431) (xy 109.563733 98.062121) (xy 109.775822 98.379535) (xy 110.319591 98.923304)
        (xy 109.912736 99.004233) (xy 109.447189 99.315302) (xy 109.13612 99.780849) (xy 109.026887 100.33) (xy 109.13612 100.879151)
        (xy 109.447189 101.344698) (xy 109.912736 101.655767) (xy 110.461887 101.765) (xy 110.518113 101.765) (xy 111.067264 101.655767)
        (xy 111.385 101.443462) (xy 111.385 131.795) (xy 111.461882 132.18151) (xy 111.680822 132.509178) (xy 114.295302 135.123658)
        (xy 114.198559 135.18591) (xy 114.053569 135.39811) (xy 114.00256 135.65) (xy 114.00256 137.35) (xy 114.046838 137.585317)
        (xy 114.18591 137.801441) (xy 114.39811 137.946431) (xy 114.65 137.99744) (xy 116.35 137.99744) (xy 116.585317 137.953162)
        (xy 116.801441 137.81409) (xy 116.946431 137.60189) (xy 116.960086 137.534459) (xy 116.989946 137.579147) (xy 117.471715 137.901054)
        (xy 118.04 138.014093) (xy 118.608285 137.901054) (xy 119.090054 137.579147) (xy 119.31 137.249974) (xy 119.529946 137.579147)
        (xy 120.011715 137.901054) (xy 120.58 138.014093) (xy 121.148285 137.901054) (xy 121.630054 137.579147) (xy 121.857702 137.238447)
        (xy 121.924817 137.381358) (xy 122.353076 137.771645) (xy 122.76311 137.941476) (xy 122.993 137.820155) (xy 122.993 136.627)
        (xy 123.247 136.627) (xy 123.247 137.820155) (xy 123.47689 137.941476) (xy 123.886924 137.771645) (xy 124.315183 137.381358)
        (xy 124.561486 136.856892) (xy 124.440819 136.627) (xy 123.247 136.627) (xy 122.993 136.627) (xy 122.973 136.627)
        (xy 122.973 136.373) (xy 122.993 136.373) (xy 122.993 135.179845) (xy 123.247 135.179845) (xy 123.247 136.373)
        (xy 124.440819 136.373) (xy 124.561486 136.143108) (xy 124.315183 135.618642) (xy 123.886924 135.228355) (xy 123.47689 135.058524)
        (xy 123.247 135.179845) (xy 122.993 135.179845) (xy 122.76311 135.058524) (xy 122.353076 135.228355) (xy 121.924817 135.618642)
        (xy 121.857702 135.761553) (xy 121.630054 135.420853) (xy 121.148285 135.098946) (xy 120.58 134.985907) (xy 120.011715 135.098946)
        (xy 119.529946 135.420853) (xy 119.31 135.750026) (xy 119.090054 135.420853) (xy 118.608285 135.098946) (xy 118.04 134.985907)
        (xy 117.471715 135.098946) (xy 116.989946 135.420853) (xy 116.96215 135.462452) (xy 116.953162 135.414683) (xy 116.81409 135.198559)
        (xy 116.60189 135.053569) (xy 116.51 135.034961) (xy 116.51 134.9) (xy 116.433118 134.51349) (xy 116.214178 134.185822)
        (xy 113.405 131.376644) (xy 113.405 129.896661) (xy 114.252758 129.896661) (xy 114.46499 130.410303) (xy 114.85763 130.803629)
        (xy 115.3709 131.016757) (xy 115.926661 131.017242) (xy 116.440303 130.80501) (xy 116.833629 130.41237) (xy 116.919949 130.204488)
        (xy 117.00499 130.410303) (xy 117.39763 130.803629) (xy 117.9109 131.016757) (xy 118.466661 131.017242) (xy 118.980303 130.80501)
        (xy 119.373629 130.41237) (xy 119.459949 130.204488) (xy 119.54499 130.410303) (xy 119.93763 130.803629) (xy 120.4509 131.016757)
        (xy 121.006661 131.017242) (xy 121.520303 130.80501) (xy 121.725457 130.600213) (xy 122.469392 130.600213) (xy 122.538857 130.842397)
        (xy 123.062302 131.029144) (xy 123.617368 131.001362) (xy 124.001143 130.842397) (xy 124.070608 130.600213) (xy 123.27 129.799605)
        (xy 122.469392 130.600213) (xy 121.725457 130.600213) (xy 121.913629 130.41237) (xy 121.993395 130.220273) (xy 122.047603 130.351143)
        (xy 122.289787 130.420608) (xy 123.090395 129.62) (xy 123.449605 129.62) (xy 124.250213 130.420608) (xy 124.492397 130.351143)
        (xy 124.542509 130.210682) (xy 124.62499 130.410303) (xy 125.01763 130.803629) (xy 125.5309 131.016757) (xy 126.086661 131.017242)
        (xy 126.600303 130.80501) (xy 126.993629 130.41237) (xy 127.079949 130.204488) (xy 127.16499 130.410303) (xy 127.55763 130.803629)
        (xy 128.0709 131.016757) (xy 128.626661 131.017242) (xy 129.140303 130.80501) (xy 129.533629 130.41237) (xy 129.619949 130.204488)
        (xy 129.70499 130.410303) (xy 130.09763 130.803629) (xy 130.6109 131.016757) (xy 131.166661 131.017242) (xy 131.680303 130.80501)
        (xy 132.073629 130.41237) (xy 132.159949 130.204488) (xy 132.24499 130.410303) (xy 132.63763 130.803629) (xy 133.1509 131.016757)
        (xy 133.706661 131.017242) (xy 134.220303 130.80501) (xy 134.613629 130.41237) (xy 134.699949 130.204488) (xy 134.78499 130.410303)
        (xy 135.17763 130.803629) (xy 135.6909 131.016757) (xy 136.246661 131.017242) (xy 136.760303 130.80501) (xy 137.153629 130.41237)
        (xy 137.239949 130.204488) (xy 137.32499 130.410303) (xy 137.71763 130.803629) (xy 138.2309 131.016757) (xy 138.786661 131.017242)
        (xy 139.300303 130.80501) (xy 139.693629 130.41237) (xy 139.779949 130.204488) (xy 139.86499 130.410303) (xy 140.25763 130.803629)
        (xy 140.7709 131.016757) (xy 141.326661 131.017242) (xy 141.840303 130.80501) (xy 142.233629 130.41237) (xy 142.319949 130.204488)
        (xy 142.40499 130.410303) (xy 142.79763 130.803629) (xy 143.3109 131.016757) (xy 143.866661 131.017242) (xy 144.380303 130.80501)
        (xy 144.773629 130.41237) (xy 144.859949 130.204488) (xy 144.94499 130.410303) (xy 145.33763 130.803629) (xy 145.8509 131.016757)
        (xy 146.406661 131.017242) (xy 146.920303 130.80501) (xy 147.313629 130.41237) (xy 147.399949 130.204488) (xy 147.48499 130.410303)
        (xy 147.87763 130.803629) (xy 148.3909 131.016757) (xy 148.946661 131.017242) (xy 149.460303 130.80501) (xy 149.853629 130.41237)
        (xy 149.939949 130.204488) (xy 150.02499 130.410303) (xy 150.41763 130.803629) (xy 150.9309 131.016757) (xy 151.486661 131.017242)
        (xy 152.000303 130.80501) (xy 152.393629 130.41237) (xy 152.479949 130.204488) (xy 152.56499 130.410303) (xy 152.95763 130.803629)
        (xy 153.4709 131.016757) (xy 154.026661 131.017242) (xy 154.540303 130.80501) (xy 154.933629 130.41237) (xy 155.146757 129.8991)
        (xy 155.147242 129.343339) (xy 154.93501 128.829697) (xy 154.54237 128.436371) (xy 154.0291 128.223243) (xy 153.473339 128.222758)
        (xy 152.959697 128.43499) (xy 152.566371 128.82763) (xy 152.480051 129.035512) (xy 152.39501 128.829697) (xy 152.00237 128.436371)
        (xy 151.4891 128.223243) (xy 150.933339 128.222758) (xy 150.419697 128.43499) (xy 150.026371 128.82763) (xy 149.940051 129.035512)
        (xy 149.85501 128.829697) (xy 149.46237 128.436371) (xy 148.9491 128.223243) (xy 148.393339 128.222758) (xy 147.879697 128.43499)
        (xy 147.486371 128.82763) (xy 147.400051 129.035512) (xy 147.31501 128.829697) (xy 146.92237 128.436371) (xy 146.4091 128.223243)
        (xy 145.853339 128.222758) (xy 145.339697 128.43499) (xy 144.946371 128.82763) (xy 144.860051 129.035512) (xy 144.77501 128.829697)
        (xy 144.38237 128.436371) (xy 143.8691 128.223243) (xy 143.313339 128.222758) (xy 142.799697 128.43499) (xy 142.406371 128.82763)
        (xy 142.320051 129.035512) (xy 142.23501 128.829697) (xy 141.885 128.479075) (xy 141.885 126.288841) (xy 141.991487 126.032393)
        (xy 141.991811 125.660427) (xy 141.849766 125.316651) (xy 141.586976 125.053402) (xy 141.243448 124.910756) (xy 140.871482 124.910432)
        (xy 140.527706 125.052477) (xy 140.264457 125.315267) (xy 140.121811 125.658795) (xy 140.121487 126.030761) (xy 140.215 126.25708)
        (xy 140.215 128.479609) (xy 139.866371 128.82763) (xy 139.780051 129.035512) (xy 139.69501 128.829697) (xy 139.30237 128.436371)
        (xy 138.7891 128.223243) (xy 138.233339 128.222758) (xy 137.719697 128.43499) (xy 137.326371 128.82763) (xy 137.240051 129.035512)
        (xy 137.15501 128.829697) (xy 136.76237 128.436371) (xy 136.2491 128.223243) (xy 135.693339 128.222758) (xy 135.179697 128.43499)
        (xy 134.786371 128.82763) (xy 134.700051 129.035512) (xy 134.61501 128.829697) (xy 134.22237 128.436371) (xy 133.7091 128.223243)
        (xy 133.153339 128.222758) (xy 132.639697 128.43499) (xy 132.246371 128.82763) (xy 132.160051 129.035512) (xy 132.07501 128.829697)
        (xy 131.68237 128.436371) (xy 131.1691 128.223243) (xy 130.613339 128.222758) (xy 130.099697 128.43499) (xy 129.706371 128.82763)
        (xy 129.620051 129.035512) (xy 129.53501 128.829697) (xy 129.14237 128.436371) (xy 128.6291 128.223243) (xy 128.073339 128.222758)
        (xy 127.559697 128.43499) (xy 127.166371 128.82763) (xy 127.080051 129.035512) (xy 126.99501 128.829697) (xy 126.60237 128.436371)
        (xy 126.0891 128.223243) (xy 125.533339 128.222758) (xy 125.019697 128.43499) (xy 124.626371 128.82763) (xy 124.546605 129.019727)
        (xy 124.492397 128.888857) (xy 124.250213 128.819392) (xy 123.449605 129.62) (xy 123.090395 129.62) (xy 122.289787 128.819392)
        (xy 122.047603 128.888857) (xy 121.997491 129.029318) (xy 121.91501 128.829697) (xy 121.725432 128.639787) (xy 122.469392 128.639787)
        (xy 123.27 129.440395) (xy 124.070608 128.639787) (xy 124.001143 128.397603) (xy 123.477698 128.210856) (xy 122.922632 128.238638)
        (xy 122.538857 128.397603) (xy 122.469392 128.639787) (xy 121.725432 128.639787) (xy 121.52237 128.436371) (xy 121.0091 128.223243)
        (xy 120.453339 128.222758) (xy 119.939697 128.43499) (xy 119.546371 128.82763) (xy 119.460051 129.035512) (xy 119.37501 128.829697)
        (xy 118.98237 128.436371) (xy 118.4691 128.223243) (xy 117.913339 128.222758) (xy 117.399697 128.43499) (xy 117.006371 128.82763)
        (xy 116.920051 129.035512) (xy 116.83501 128.829697) (xy 116.44237 128.436371) (xy 115.9291 128.223243) (xy 115.373339 128.222758)
        (xy 114.859697 128.43499) (xy 114.466371 128.82763) (xy 114.253243 129.3409) (xy 114.252758 129.896661) (xy 113.405 129.896661)
        (xy 113.405 123.7832) (xy 120.941356 116.246844) (xy 128.730156 116.246844) (xy 129.116666 116.169962) (xy 129.444334 115.951022)
        (xy 131.604178 113.791178) (xy 131.823118 113.46351) (xy 131.9 113.077) (xy 131.9 110.265696) (xy 132.073629 110.09237)
        (xy 132.159949 109.884488) (xy 132.24499 110.090303) (xy 132.63763 110.483629) (xy 133.1509 110.696757) (xy 133.706661 110.697242)
        (xy 134.220303 110.48501) (xy 134.613629 110.09237) (xy 134.699949 109.884488) (xy 134.78499 110.090303) (xy 135.17763 110.483629)
        (xy 135.6909 110.696757) (xy 136.246661 110.697242) (xy 136.760303 110.48501) (xy 137.153629 110.09237) (xy 137.239949 109.884488)
        (xy 137.32499 110.090303) (xy 137.71763 110.483629) (xy 138.2309 110.696757) (xy 138.786661 110.697242) (xy 139.300303 110.48501)
        (xy 139.693629 110.09237) (xy 139.779949 109.884488) (xy 139.86499 110.090303) (xy 140.25763 110.483629) (xy 140.7709 110.696757)
        (xy 141.326661 110.697242) (xy 141.840303 110.48501) (xy 142.233629 110.09237) (xy 142.319949 109.884488) (xy 142.40499 110.090303)
        (xy 142.79763 110.483629) (xy 143.3109 110.696757) (xy 143.866661 110.697242) (xy 144.380303 110.48501) (xy 144.773629 110.09237)
        (xy 144.859949 109.884488) (xy 144.94499 110.090303) (xy 145.33763 110.483629) (xy 145.8509 110.696757) (xy 146.406661 110.697242)
        (xy 146.920303 110.48501) (xy 147.313629 110.09237) (xy 147.399949 109.884488) (xy 147.48499 110.090303) (xy 147.87763 110.483629)
        (xy 148.3909 110.696757) (xy 148.946661 110.697242) (xy 149.460303 110.48501) (xy 149.853629 110.09237) (xy 149.939949 109.884488)
        (xy 150.02499 110.090303) (xy 150.41763 110.483629) (xy 150.9309 110.696757) (xy 151.486661 110.697242) (xy 152.000303 110.48501)
        (xy 152.393629 110.09237) (xy 152.479949 109.884488) (xy 152.56499 110.090303) (xy 152.95763 110.483629) (xy 153.4709 110.696757)
        (xy 154.026661 110.697242) (xy 154.540303 110.48501) (xy 154.933629 110.09237) (xy 155.146757 109.5791) (xy 155.147242 109.023339)
        (xy 154.93501 108.509697) (xy 154.54237 108.116371) (xy 154.0291 107.903243) (xy 153.473339 107.902758) (xy 152.959697 108.11499)
        (xy 152.566371 108.50763) (xy 152.480051 108.715512) (xy 152.39501 108.509697) (xy 152.00237 108.116371) (xy 151.4891 107.903243)
        (xy 150.933339 107.902758) (xy 150.419697 108.11499) (xy 150.026371 108.50763) (xy 149.940051 108.715512) (xy 149.85501 108.509697)
        (xy 149.46237 108.116371) (xy 148.9491 107.903243) (xy 148.393339 107.902758) (xy 147.879697 108.11499) (xy 147.486371 108.50763)
        (xy 147.400051 108.715512) (xy 147.31501 108.509697) (xy 146.92237 108.116371) (xy 146.4091 107.903243) (xy 145.853339 107.902758)
        (xy 145.339697 108.11499) (xy 144.946371 108.50763) (xy 144.860051 108.715512) (xy 144.77501 108.509697) (xy 144.475 108.209163)
        (xy 144.475 105.69658) (xy 145.146579 105.025) (xy 160.019995 105.025) (xy 160.02 105.025001) (xy 160.302484 104.96881)
        (xy 160.358675 104.957633) (xy 160.64579 104.76579) (xy 161.995787 103.415792) (xy 161.99579 103.41579) (xy 162.187633 103.128675)
        (xy 162.255 102.79) (xy 162.255 95.249432) (xy 162.420054 95.139147) (xy 162.741961 94.657378) (xy 162.855 94.089093)
        (xy 162.855 94.030907) (xy 162.741961 93.462622) (xy 162.420054 92.980853) (xy 162.255 92.870568) (xy 162.255 92.709432)
        (xy 162.420054 92.599147) (xy 162.741961 92.117378) (xy 162.855 91.549093) (xy 162.855 91.490907) (xy 162.741961 90.922622)
        (xy 162.420054 90.440853) (xy 161.938285 90.118946) (xy 161.37 90.005907) (xy 160.801715 90.118946) (xy 160.319946 90.440853)
        (xy 160.092298 90.781553) (xy 160.025183 90.638642) (xy 159.596924 90.248355) (xy 159.18689 90.078524) (xy 158.957 90.199845)
        (xy 158.957 91.393) (xy 158.977 91.393) (xy 158.977 91.647) (xy 158.957 91.647) (xy 158.957 93.933)
        (xy 158.977 93.933) (xy 158.977 94.187) (xy 158.957 94.187) (xy 158.957 95.380155) (xy 159.18689 95.501476)
        (xy 159.596924 95.331645) (xy 160.025183 94.941358) (xy 160.092298 94.798447) (xy 160.319946 95.139147) (xy 160.485 95.249432)
        (xy 160.485 102.423421) (xy 159.65342 103.255) (xy 144.780005 103.255) (xy 144.78 103.254999) (xy 144.441325 103.322367)
        (xy 144.15421 103.51421) (xy 144.154208 103.514213) (xy 142.96421 104.70421) (xy 142.772367 104.991325) (xy 142.772367 104.991326)
        (xy 142.704999 105.33) (xy 142.705 105.330005) (xy 142.705 108.209522) (xy 142.406371 108.50763) (xy 142.320051 108.715512)
        (xy 142.23501 108.509697) (xy 141.935 108.209163) (xy 141.935 104.42658) (xy 143.876579 102.485) (xy 154.939995 102.485)
        (xy 154.94 102.485001) (xy 155.222484 102.42881) (xy 155.278675 102.417633) (xy 155.56579 102.22579) (xy 156.915787 100.875792)
        (xy 156.91579 100.87579) (xy 157.107633 100.588675) (xy 157.175 100.25) (xy 157.175 95.249432) (xy 157.340054 95.139147)
        (xy 157.567702 94.798447) (xy 157.634817 94.941358) (xy 158.063076 95.331645) (xy 158.47311 95.501476) (xy 158.703 95.380155)
        (xy 158.703 94.187) (xy 158.683 94.187) (xy 158.683 93.933) (xy 158.703 93.933) (xy 158.703 91.647)
        (xy 158.683 91.647) (xy 158.683 91.393) (xy 158.703 91.393) (xy 158.703 90.199845) (xy 158.47311 90.078524)
        (xy 158.063076 90.248355) (xy 157.634817 90.638642) (xy 157.567702 90.781553) (xy 157.340054 90.440853) (xy 156.858285 90.118946)
        (xy 156.29 90.005907) (xy 155.721715 90.118946) (xy 155.239946 90.440853) (xy 155.02 90.770026) (xy 154.800054 90.440853)
        (xy 154.318285 90.118946) (xy 153.75 90.005907) (xy 153.181715 90.118946) (xy 152.699946 90.440853) (xy 152.48 90.770026)
        (xy 152.260054 90.440853) (xy 151.778285 90.118946) (xy 151.21 90.005907) (xy 150.641715 90.118946) (xy 150.159946 90.440853)
        (xy 149.838039 90.922622) (xy 149.725 91.490907) (xy 149.725 91.549093) (xy 149.838039 92.117378) (xy 150.159946 92.599147)
        (xy 150.161179 92.599971) (xy 150.124683 92.606838) (xy 149.908559 92.74591) (xy 149.763569 92.95811) (xy 149.71256 93.21)
        (xy 149.71256 94.91) (xy 149.756838 95.145317) (xy 149.89591 95.361441) (xy 150.10811 95.506431) (xy 150.36 95.55744)
        (xy 152.06 95.55744) (xy 152.295317 95.513162) (xy 152.511441 95.37409) (xy 152.656431 95.16189) (xy 152.670086 95.094459)
        (xy 152.699946 95.139147) (xy 153.181715 95.461054) (xy 153.75 95.574093) (xy 154.318285 95.461054) (xy 154.800054 95.139147)
        (xy 155.02 94.809974) (xy 155.239946 95.139147) (xy 155.405 95.249432) (xy 155.405 99.883421) (xy 154.57342 100.715)
        (xy 154.522537 100.715) (xy 154.604838 100.516799) (xy 154.605162 100.144833) (xy 154.463117 99.801057) (xy 154.200327 99.537808)
        (xy 153.95809 99.437222) (xy 147.990434 93.469566) (xy 147.93752 93.43421) (xy 147.719541 93.288561) (xy 147.4 93.225)
        (xy 141.373187 93.225) (xy 141.210054 92.980853) (xy 140.924422 92.79) (xy 141.210054 92.599147) (xy 141.531961 92.117378)
        (xy 141.645 91.549093) (xy 141.645 91.490907) (xy 141.531961 90.922622) (xy 141.210054 90.440853) (xy 140.728285 90.118946)
        (xy 140.16 90.005907) (xy 139.591715 90.118946) (xy 139.109946 90.440853) (xy 138.882298 90.781553) (xy 138.815183 90.638642)
        (xy 138.386924 90.248355) (xy 137.97689 90.078524) (xy 137.747 90.199845) (xy 137.747 91.393) (xy 137.767 91.393)
        (xy 137.767 91.647) (xy 137.747 91.647) (xy 137.747 91.667) (xy 137.493 91.667) (xy 137.493 91.647)
        (xy 135.207 91.647) (xy 135.207 91.667) (xy 134.953 91.667) (xy 134.953 91.647) (xy 132.667 91.647)
        (xy 132.667 91.667) (xy 132.413 91.667) (xy 132.413 91.647) (xy 130.127 91.647) (xy 130.127 91.667)
        (xy 129.873 91.667) (xy 129.873 91.647) (xy 128.679181 91.647) (xy 128.558514 91.876892) (xy 128.804817 92.401358)
        (xy 129.010504 92.588808) (xy 128.914683 92.606838) (xy 128.698559 92.74591) (xy 128.553569 92.95811) (xy 128.50256 93.21)
        (xy 128.50256 94.91) (xy 128.546838 95.145317) (xy 128.68591 95.361441) (xy 128.89811 95.506431) (xy 129.15 95.55744)
        (xy 130.85 95.55744) (xy 131.085317 95.513162) (xy 131.301441 95.37409) (xy 131.446431 95.16189) (xy 131.460086 95.094459)
        (xy 131.489946 95.139147) (xy 131.971715 95.461054) (xy 132.54 95.574093) (xy 133.108285 95.461054) (xy 133.590054 95.139147)
        (xy 133.81 94.809974) (xy 134.029946 95.139147) (xy 134.511715 95.461054) (xy 135.08 95.574093) (xy 135.648285 95.461054)
        (xy 136.130054 95.139147) (xy 136.35 94.809974) (xy 136.569946 95.139147) (xy 137.051715 95.461054) (xy 137.62 95.574093)
        (xy 138.188285 95.461054) (xy 138.670054 95.139147) (xy 138.89 94.809974) (xy 139.109946 95.139147) (xy 139.591715 95.461054)
        (xy 140.16 95.574093) (xy 140.728285 95.461054) (xy 141.210054 95.139147) (xy 141.373187 94.895) (xy 147.054132 94.895)
        (xy 152.777465 100.618333) (xy 152.817407 100.715) (xy 143.51 100.715) (xy 143.171325 100.782367) (xy 142.88421 100.97421)
        (xy 142.884208 100.974213) (xy 140.42421 103.43421) (xy 140.232367 103.721325) (xy 140.232367 103.721326) (xy 140.164999 104.06)
        (xy 140.165 104.060005) (xy 140.165 108.209522) (xy 139.866371 108.50763) (xy 139.780051 108.715512) (xy 139.69501 108.509697)
        (xy 139.30237 108.116371) (xy 138.7891 107.903243) (xy 138.233339 107.902758) (xy 137.719697 108.11499) (xy 137.326371 108.50763)
        (xy 137.240051 108.715512) (xy 137.15501 108.509697) (xy 136.76237 108.116371) (xy 136.2491 107.903243) (xy 135.693339 107.902758)
        (xy 135.179697 108.11499) (xy 134.786371 108.50763) (xy 134.700051 108.715512) (xy 134.61501 108.509697) (xy 134.22237 108.116371)
        (xy 133.7091 107.903243) (xy 133.153339 107.902758) (xy 132.639697 108.11499) (xy 132.246371 108.50763) (xy 132.160051 108.715512)
        (xy 132.07501 108.509697) (xy 131.68237 108.116371) (xy 131.1691 107.903243) (xy 130.613339 107.902758) (xy 130.099697 108.11499)
        (xy 129.706371 108.50763) (xy 129.620051 108.715512) (xy 129.53501 108.509697) (xy 129.14237 108.116371) (xy 128.6291 107.903243)
        (xy 128.073339 107.902758) (xy 127.559697 108.11499) (xy 127.166371 108.50763) (xy 127.080051 108.715512) (xy 126.99501 108.509697)
        (xy 126.60237 108.116371) (xy 126.0891 107.903243) (xy 125.533339 107.902758) (xy 125.019697 108.11499) (xy 124.626371 108.50763)
        (xy 124.413243 109.0209) (xy 124.412758 109.576661) (xy 124.62499 110.090303) (xy 125.01763 110.483629) (xy 125.5309 110.696757)
        (xy 126.086661 110.697242) (xy 126.600303 110.48501) (xy 126.993629 110.09237) (xy 127.079949 109.884488) (xy 127.16499 110.090303)
        (xy 127.55763 110.483629) (xy 128.0709 110.696757) (xy 128.626661 110.697242) (xy 129.140303 110.48501) (xy 129.533629 110.09237)
        (xy 129.619949 109.884488) (xy 129.70499 110.090303) (xy 129.88 110.265619) (xy 129.88 112.658644) (xy 128.3118 114.226844)
        (xy 120.523 114.226844) (xy 120.13649 114.303726) (xy 119.808822 114.522666) (xy 113.405 120.926488) (xy 113.405 102.390104)
        (xy 125.119501 102.390104) (xy 125.156648 102.605217) (xy 125.584972 102.748112) (xy 126.035375 102.716217) (xy 126.303352 102.605217)
        (xy 126.340499 102.390104) (xy 125.73 101.779605) (xy 125.119501 102.390104) (xy 113.405 102.390104) (xy 113.405 99.570357)
        (xy 113.328118 99.183847) (xy 113.109178 98.856179) (xy 111.96145 97.708451) (xy 111.986431 97.67189) (xy 112.03744 97.42)
        (xy 112.03744 95.62) (xy 111.993162 95.384683) (xy 111.85409 95.168559) (xy 111.714901 95.073455) (xy 114.258356 92.53)
        (xy 116.642666 92.53) (xy 116.656838 92.605317) (xy 116.79591 92.821441) (xy 117.00811 92.966431) (xy 117.26 93.01744)
        (xy 118.96 93.01744) (xy 119.195317 92.973162) (xy 119.411441 92.83409) (xy 119.556431 92.62189) (xy 119.570086 92.554459)
        (xy 119.599946 92.599147) (xy 119.815 92.742841) (xy 119.815 95.24718) (xy 119.534519 95.434591) (xy 119.201773 95.932581)
        (xy 119.084928 96.52) (xy 119.201773 97.107419) (xy 119.534519 97.605409) (xy 120.032509 97.938155) (xy 120.619928 98.055)
        (xy 120.680072 98.055) (xy 121.267491 97.938155) (xy 121.765481 97.605409) (xy 121.932799 97.355) (xy 123.744132 97.355)
        (xy 124.659415 98.270283) (xy 124.633569 98.30811) (xy 124.58256 98.56) (xy 124.58256 99.495) (xy 121.844083 99.495)
        (xy 121.463923 99.114176) (xy 120.936691 98.89525) (xy 120.365813 98.894752) (xy 119.8382 99.112757) (xy 119.434176 99.516077)
        (xy 119.21525 100.043309) (xy 119.214752 100.614187) (xy 119.432757 101.1418) (xy 119.836077 101.545824) (xy 120.363309 101.76475)
        (xy 120.934187 101.765248) (xy 121.4618 101.547243) (xy 121.84471 101.165) (xy 124.678627 101.165) (xy 124.581888 101.454972)
        (xy 124.613783 101.905375) (xy 124.724783 102.173352) (xy 124.939896 102.210499) (xy 125.550395 101.6) (xy 125.536253 101.585858)
        (xy 125.715858 101.406253) (xy 125.73 101.420395) (xy 125.744143 101.406253) (xy 125.923748 101.585858) (xy 125.909605 101.6)
        (xy 126.520104 102.210499) (xy 126.735217 102.173352) (xy 126.878112 101.745028) (xy 126.858273 101.464877) (xy 127.224775 101.465197)
        (xy 127.642086 101.292767) (xy 127.961645 100.973765) (xy 128.134803 100.556756) (xy 128.135197 100.105225) (xy 127.962767 99.687914)
        (xy 127.643765 99.368355) (xy 127.226756 99.195197) (xy 126.87744 99.194892) (xy 126.87744 98.56) (xy 126.833162 98.324683)
        (xy 126.69409 98.108559) (xy 126.532854 97.998391) (xy 126.501439 97.840459) (xy 126.320434 97.569566) (xy 124.680434 95.929566)
        (xy 124.606253 95.88) (xy 124.409541 95.748561) (xy 124.09 95.685) (xy 121.932799 95.685) (xy 121.765481 95.434591)
        (xy 121.485 95.24718) (xy 121.485 92.742841) (xy 121.700054 92.599147) (xy 122.021961 92.117378) (xy 122.135 91.549093)
        (xy 122.135 91.490907) (xy 122.069797 91.163108) (xy 128.558514 91.163108) (xy 128.679181 91.393) (xy 129.873 91.393)
        (xy 129.873 90.199845) (xy 130.127 90.199845) (xy 130.127 91.393) (xy 132.413 91.393) (xy 132.413 90.199845)
        (xy 132.667 90.199845) (xy 132.667 91.393) (xy 134.953 91.393) (xy 134.953 90.199845) (xy 135.207 90.199845)
        (xy 135.207 91.393) (xy 137.493 91.393) (xy 137.493 90.199845) (xy 137.26311 90.078524) (xy 136.853076 90.248355)
        (xy 136.424817 90.638642) (xy 136.35 90.797954) (xy 136.275183 90.638642) (xy 135.846924 90.248355) (xy 135.43689 90.078524)
        (xy 135.207 90.199845) (xy 134.953 90.199845) (xy 134.72311 90.078524) (xy 134.313076 90.248355) (xy 133.884817 90.638642)
        (xy 133.81 90.797954) (xy 133.735183 90.638642) (xy 133.306924 90.248355) (xy 132.89689 90.078524) (xy 132.667 90.199845)
        (xy 132.413 90.199845) (xy 132.18311 90.078524) (xy 131.773076 90.248355) (xy 131.344817 90.638642) (xy 131.27 90.797954)
        (xy 131.195183 90.638642) (xy 130.766924 90.248355) (xy 130.35689 90.078524) (xy 130.127 90.199845) (xy 129.873 90.199845)
        (xy 129.64311 90.078524) (xy 129.233076 90.248355) (xy 128.804817 90.638642) (xy 128.558514 91.163108) (xy 122.069797 91.163108)
        (xy 122.021961 90.922622) (xy 121.700054 90.440853) (xy 121.218285 90.118946) (xy 120.65 90.005907) (xy 120.081715 90.118946)
        (xy 119.599946 90.440853) (xy 119.57215 90.482452) (xy 119.563162 90.434683) (xy 119.42409 90.218559) (xy 119.21189 90.073569)
        (xy 118.96 90.02256) (xy 117.26 90.02256) (xy 117.024683 90.066838) (xy 116.808559 90.20591) (xy 116.663569 90.41811)
        (xy 116.644961 90.51) (xy 113.84 90.51) (xy 113.453489 90.586882) (xy 113.125822 90.805822) (xy 112.627 91.304644)
        (xy 112.627 88.627) (xy 166.373 88.627)
      )
    )
  )
)
