EESchema Schematic File Version 2
LIBS:power
LIBS:device
LIBS:transistors
LIBS:conn
LIBS:linear
LIBS:regul
LIBS:74xx
LIBS:cmos4000
LIBS:adc-dac
LIBS:memory
LIBS:xilinx
LIBS:microcontrollers
LIBS:dsp
LIBS:microchip
LIBS:analog_switches
LIBS:motorola
LIBS:texas
LIBS:intel
LIBS:audio
LIBS:interface
LIBS:digital-audio
LIBS:philips
LIBS:display
LIBS:cypress
LIBS:siliconi
LIBS:opto
LIBS:atmel
LIBS:contrib
LIBS:valves
LIBS:adafruit_feather_huzzah_esp8266
LIBS:adafruit_feather_huzzah_esp32
LIBS:iot-fidgeter-cache
EELAYER 25 0
EELAYER END
$Descr A4 11693 8268
encoding utf-8
Sheet 1 1
Title "Scoreboard"
Date ""
Rev "1"
Comp "firnsy"
Comment1 ""
Comment2 ""
Comment3 ""
Comment4 ""
$EndDescr
$Comp
L GNDREF #PWR03
U 1 1 5B6E4167
P 4600 2950
F 0 "#PWR03" H 4600 2700 50  0001 C CNN
F 1 "GNDREF" H 4600 2800 50  0001 C CNN
F 2 "" H 4600 2950 50  0001 C CNN
F 3 "" H 4600 2950 50  0001 C CNN
	1    4600 2950
	1    0    0    -1  
$EndComp
$Comp
L +5V #PWR04
U 1 1 5B6E4181
P 6400 2850
F 0 "#PWR04" H 6400 2700 50  0001 C CNN
F 1 "+5V" H 6400 2990 50  0000 C CNN
F 2 "" H 6400 2850 50  0001 C CNN
F 3 "" H 6400 2850 50  0001 C CNN
	1    6400 2850
	1    0    0    -1  
$EndComp
Text Label 6300 3250 0    60   ~ 0
RELAY
NoConn ~ 4900 2550
Text Label 3800 3900 0    60   ~ 0
ROT_SW
Text Label 4900 3650 2    60   ~ 0
MAT_DATA
Text Label 4900 3750 2    60   ~ 0
MAT_LE
Text Label 6300 4050 0    60   ~ 0
MAT_A
Text Label 6300 3950 0    60   ~ 0
MAT_B
NoConn ~ 6300 3350
NoConn ~ 6300 3450
Text Label 7950 2500 2    60   ~ 0
SERVO1
Text Label 7950 4100 2    60   ~ 0
PIXELS
Text Label 6300 3750 0    60   ~ 0
DIG_ST
Text Label 6300 3850 0    60   ~ 0
DIG_OE
NoConn ~ 4900 3850
NoConn ~ 4900 2950
NoConn ~ 4900 4050
NoConn ~ 6300 2950
NoConn ~ 6300 3050
$Comp
L Adafruit_Feather_HUZZAH_ESP32 U1
U 1 1 5B8E4C0C
P 5600 3300
F 0 "U1" H 5600 3300 60  0000 C CNN
F 1 "Adafruit_Feather_HUZZAH_ESP32" H 5600 4250 60  0000 C CNN
F 2 "lib_fp:Adafruit_Feather_HUZZAH_ESP8266" H 5550 3400 60  0001 C CNN
F 3 "" H 5550 3400 60  0001 C CNN
	1    5600 3300
	1    0    0    -1  
$EndComp
NoConn ~ 4900 3050
NoConn ~ 4900 3150
NoConn ~ 4900 3250
NoConn ~ 4900 3350
NoConn ~ 4900 3450
NoConn ~ 4900 3950
$Comp
L CONN_01X03 J?
U 1 1 5BB333BD
P 8350 2600
F 0 "J?" H 8350 2800 50  0000 C CNN
F 1 "SERVO1" V 8450 2600 50  0000 C CNN
F 2 "" H 8350 2600 50  0001 C CNN
F 3 "" H 8350 2600 50  0001 C CNN
	1    8350 2600
	1    0    0    -1  
$EndComp
$Comp
L +5V #PWR?
U 1 1 5BB33434
P 8050 2400
F 0 "#PWR?" H 8050 2250 50  0001 C CNN
F 1 "+5V" H 8050 2540 50  0000 C CNN
F 2 "" H 8050 2400 50  0001 C CNN
F 3 "" H 8050 2400 50  0001 C CNN
	1    8050 2400
	1    0    0    -1  
$EndComp
$Comp
L GNDREF #PWR?
U 1 1 5BB33445
P 8050 2800
F 0 "#PWR?" H 8050 2550 50  0001 C CNN
F 1 "GNDREF" H 8050 2650 50  0001 C CNN
F 2 "" H 8050 2800 50  0001 C CNN
F 3 "" H 8050 2800 50  0001 C CNN
	1    8050 2800
	1    0    0    -1  
$EndComp
$Comp
L CONN_01X03 J?
U 1 1 5BB33674
P 8350 4200
F 0 "J?" H 8350 4400 50  0000 C CNN
F 1 "NEOPIXELS" V 8450 4200 50  0000 C CNN
F 2 "" H 8350 4200 50  0001 C CNN
F 3 "" H 8350 4200 50  0001 C CNN
	1    8350 4200
	1    0    0    -1  
$EndComp
$Comp
L +5V #PWR?
U 1 1 5BB3367A
P 8050 4000
F 0 "#PWR?" H 8050 3850 50  0001 C CNN
F 1 "+5V" H 8050 4140 50  0000 C CNN
F 2 "" H 8050 4000 50  0001 C CNN
F 3 "" H 8050 4000 50  0001 C CNN
	1    8050 4000
	1    0    0    -1  
$EndComp
$Comp
L GNDREF #PWR?
U 1 1 5BB33680
P 8050 4400
F 0 "#PWR?" H 8050 4150 50  0001 C CNN
F 1 "GNDREF" H 8050 4250 50  0001 C CNN
F 2 "" H 8050 4400 50  0001 C CNN
F 3 "" H 8050 4400 50  0001 C CNN
	1    8050 4400
	1    0    0    -1  
$EndComp
$Comp
L Rotary_Encoder_Switch SW?
U 1 1 5BB336C2
P 3500 4000
F 0 "SW?" H 3500 4260 50  0000 C CNN
F 1 "ENCODER" H 3500 3740 50  0000 C CNN
F 2 "" H 3400 4160 50  0001 C CNN
F 3 "" H 3500 4260 50  0001 C CNN
	1    3500 4000
	1    0    0    -1  
$EndComp
$Comp
L GNDREF #PWR?
U 1 1 5BB339D7
P 3900 4200
F 0 "#PWR?" H 3900 3950 50  0001 C CNN
F 1 "GNDREF" H 3900 4050 50  0001 C CNN
F 2 "" H 3900 4200 50  0001 C CNN
F 3 "" H 3900 4200 50  0001 C CNN
	1    3900 4200
	1    0    0    -1  
$EndComp
$Comp
L C_Small C?
U 1 1 5BB33A27
P 3000 3700
F 0 "C?" H 2900 3600 50  0000 L CNN
F 1 "10n" H 2850 3800 50  0000 L CNN
F 2 "" H 3000 3700 50  0001 C CNN
F 3 "" H 3000 3700 50  0001 C CNN
	1    3000 3700
	-1   0    0    1   
$EndComp
$Comp
L C_Small C?
U 1 1 5BB33AAD
P 3000 4300
F 0 "C?" H 2900 4200 50  0000 L CNN
F 1 "10n" H 2850 4400 50  0000 L CNN
F 2 "" H 3000 4300 50  0001 C CNN
F 3 "" H 3000 4300 50  0001 C CNN
	1    3000 4300
	-1   0    0    1   
$EndComp
$Comp
L R_Small R?
U 1 1 5BB33B9F
P 2800 3700
F 0 "R?" H 2700 3800 50  0000 L CNN
F 1 "10k" H 2830 3660 50  0000 L CNN
F 2 "" H 2800 3700 50  0001 C CNN
F 3 "" H 2800 3700 50  0001 C CNN
	1    2800 3700
	1    0    0    -1  
$EndComp
$Comp
L R_Small R?
U 1 1 5BB33C25
P 2800 4300
F 0 "R?" H 2650 4350 50  0000 L CNN
F 1 "10k" H 2650 4200 50  0000 L CNN
F 2 "" H 2800 4300 50  0001 C CNN
F 3 "" H 2800 4300 50  0001 C CNN
	1    2800 4300
	1    0    0    -1  
$EndComp
$Comp
L R_Small R?
U 1 1 5BB33C57
P 2600 3900
F 0 "R?" V 2650 3900 50  0000 L CNN
F 1 "10k" H 2630 3860 50  0000 L CNN
F 2 "" H 2600 3900 50  0001 C CNN
F 3 "" H 2600 3900 50  0001 C CNN
	1    2600 3900
	0    -1   -1   0   
$EndComp
$Comp
L R_Small R?
U 1 1 5BB33C8C
P 2600 4100
F 0 "R?" V 2650 4100 50  0000 L CNN
F 1 "10k" H 2630 4060 50  0000 L CNN
F 2 "" H 2600 4100 50  0001 C CNN
F 3 "" H 2600 4100 50  0001 C CNN
	1    2600 4100
	0    -1   -1   0   
$EndComp
Wire Wire Line
	6300 3150 6400 3150
Wire Wire Line
	6400 3150 6400 2850
Wire Wire Line
	4900 2850 4600 2850
Wire Wire Line
	4600 2850 4600 2950
Wire Wire Line
	8150 2700 8050 2700
Wire Wire Line
	8050 2700 8050 2800
Wire Wire Line
	8150 2600 8050 2600
Wire Wire Line
	8050 2600 8050 2400
Wire Wire Line
	7950 2500 8150 2500
Wire Wire Line
	8150 4300 8050 4300
Wire Wire Line
	8050 4300 8050 4400
Wire Wire Line
	8150 4200 8050 4200
Wire Wire Line
	8050 4200 8050 4000
Wire Wire Line
	7950 4100 8150 4100
Wire Wire Line
	3900 4200 3900 4100
Wire Wire Line
	3900 4100 3800 4100
Wire Wire Line
	2800 3500 3000 3500
Wire Wire Line
	2800 4500 3000 4500
Wire Wire Line
	2800 3500 2800 3600
Wire Wire Line
	2800 3900 2800 3800
Wire Wire Line
	2800 4400 2800 4500
Wire Wire Line
	2800 4200 2800 4100
Connection ~ 2800 4100
Connection ~ 2800 3900
Wire Wire Line
	2500 3900 2400 3900
Wire Wire Line
	2400 3800 2400 4100
Wire Wire Line
	2400 4100 2500 4100
Wire Wire Line
	3000 4500 3000 4400
Wire Wire Line
	3000 3500 3000 3600
Wire Wire Line
	3000 3800 3000 4200
Wire Wire Line
	2700 4100 3200 4100
Wire Wire Line
	2700 3900 3200 3900
Wire Wire Line
	3000 4000 3200 4000
Connection ~ 3000 4000
Text Label 3000 3500 0    60   ~ 0
ROT_A
Text Label 3000 4500 0    60   ~ 0
ROT_B
Wire Wire Line
	4900 2650 4600 2650
Wire Wire Line
	4600 2650 4600 2550
$Comp
L +3V3 #PWR?
U 1 1 5BB34D6B
P 4600 2550
F 0 "#PWR?" H 4600 2400 50  0001 C CNN
F 1 "+3V3" H 4600 2690 50  0000 C CNN
F 2 "" H 4600 2550 50  0001 C CNN
F 3 "" H 4600 2550 50  0001 C CNN
	1    4600 2550
	1    0    0    -1  
$EndComp
$Comp
L +3V3 #PWR?
U 1 1 5BB34DCE
P 2400 3800
F 0 "#PWR?" H 2400 3650 50  0001 C CNN
F 1 "+3V3" H 2400 3940 50  0000 C CNN
F 2 "" H 2400 3800 50  0001 C CNN
F 3 "" H 2400 3800 50  0001 C CNN
	1    2400 3800
	1    0    0    -1  
$EndComp
Connection ~ 2400 3900
Text Label 7950 3300 2    60   ~ 0
SERVO2
$Comp
L CONN_01X03 J?
U 1 1 5BB354A6
P 8350 3400
F 0 "J?" H 8350 3600 50  0000 C CNN
F 1 "SERVO2" V 8450 3400 50  0000 C CNN
F 2 "" H 8350 3400 50  0001 C CNN
F 3 "" H 8350 3400 50  0001 C CNN
	1    8350 3400
	1    0    0    -1  
$EndComp
$Comp
L +5V #PWR?
U 1 1 5BB354AC
P 8050 3200
F 0 "#PWR?" H 8050 3050 50  0001 C CNN
F 1 "+5V" H 8050 3340 50  0000 C CNN
F 2 "" H 8050 3200 50  0001 C CNN
F 3 "" H 8050 3200 50  0001 C CNN
	1    8050 3200
	1    0    0    -1  
$EndComp
$Comp
L GNDREF #PWR?
U 1 1 5BB354B2
P 8050 3600
F 0 "#PWR?" H 8050 3350 50  0001 C CNN
F 1 "GNDREF" H 8050 3450 50  0001 C CNN
F 2 "" H 8050 3600 50  0001 C CNN
F 3 "" H 8050 3600 50  0001 C CNN
	1    8050 3600
	1    0    0    -1  
$EndComp
Wire Wire Line
	8150 3500 8050 3500
Wire Wire Line
	8050 3500 8050 3600
Wire Wire Line
	8150 3400 8050 3400
Wire Wire Line
	8050 3400 8050 3200
Wire Wire Line
	7950 3300 8150 3300
$EndSCHEMATC
