EESchema Schematic File Version 4
LIBS:frigiot-cache
EELAYER 30 0
EELAYER END
$Descr A3 16535 11693
encoding utf-8
Sheet 1 1
Title "frigiot"
Date "2019-05-17"
Rev "1"
Comp ""
Comment1 ""
Comment2 ""
Comment3 ""
Comment4 ""
$EndDescr
$Comp
L ESP32_MH-ET_LIVE_mini:MH-ET_LIVE_mini U1
U 1 1 5C9C6F9F
P 5100 5700
F 0 "U1" H 4500 6850 50  0000 C CNN
F 1 "MH-ET_LIVE_mini" H 5450 6850 50  0000 C CNN
F 2 "lib_fp:mh-et-live-esp32-minikit" H 6200 6050 50  0001 C CNN
F 3 "" H 6200 6050 50  0001 C CNN
	1    5100 5700
	1    0    0    -1  
$EndComp
Text Label 6100 6150 0    50   ~ 0
ROOM
Text Label 6100 6250 0    50   ~ 0
EVAP
$Comp
L power:GNDREF #PWR018
U 1 1 5C9C721C
P 4200 6850
F 0 "#PWR018" H 4200 6600 50  0001 C CNN
F 1 "GNDREF" H 4205 6677 50  0001 C CNN
F 2 "" H 4200 6850 50  0001 C CNN
F 3 "" H 4200 6850 50  0001 C CNN
	1    4200 6850
	1    0    0    -1  
$EndComp
Wire Wire Line
	5900 5050 6000 5050
Wire Wire Line
	6000 5050 6000 6650
Wire Wire Line
	4300 5650 4200 5650
Wire Wire Line
	4200 5650 4200 6850
Text Label 6100 5150 0    50   ~ 0
DOOR
Wire Wire Line
	5900 5150 6100 5150
Text Label 6100 4850 0    50   ~ 0
RELAY
Wire Wire Line
	6100 4850 5900 4850
$Comp
L power:+5V #PWR012
U 1 1 5C9CA10E
P 6000 4550
F 0 "#PWR012" H 6000 4400 50  0001 C CNN
F 1 "+5V" H 6015 4723 50  0000 C CNN
F 2 "" H 6000 4550 50  0001 C CNN
F 3 "" H 6000 4550 50  0001 C CNN
	1    6000 4550
	1    0    0    -1  
$EndComp
Wire Wire Line
	5900 4950 6000 4950
Wire Wire Line
	6000 4950 6000 4550
Text Notes 4700 2700 0    100  ~ 20
DC Power
Text Notes 5100 4200 0    100  ~ 20
MCU
$Comp
L Device:Speaker LS1
U 1 1 5C9DD452
P 8750 4800
F 0 "LS1" H 8920 4796 50  0000 L CNN
F 1 "Speaker" H 8920 4705 50  0000 L CNN
F 2 "lib_fp:cmt-8540s-smt" H 8750 4600 50  0001 C CNN
F 3 "https://www.cui.com/product/resource/digikeypdf/cmt-8540s-smt.pdf" H 8740 4750 50  0001 C CNN
F 4 "102-3746-1-ND" H 8750 4800 50  0001 C CNN "DigiKey"
	1    8750 4800
	1    0    0    -1  
$EndComp
$Comp
L Device:D_Small D1
U 1 1 5C9DD53B
P 8350 4850
F 0 "D1" V 8350 4650 50  0000 L CNN
F 1 "D_Small" V 8395 4918 50  0001 L CNN
F 2 "Diode_SMD:D_SOD-323_HandSoldering" V 8350 4850 50  0001 C CNN
F 3 "http://www.onsemi.com/pub/Collateral/BAS16HT1-D.PDF" V 8350 4850 50  0001 C CNN
F 4 "BAS16HT1GOSCT-ND" V 8350 4850 50  0001 C CNN "DigiKey"
	1    8350 4850
	0    1    1    0   
$EndComp
$Comp
L Device:Q_NPN_BEC Q1
U 1 1 5C9DD618
P 8350 5400
F 0 "Q1" H 8541 5446 50  0000 L CNN
F 1 "Q_NPN_BEC" H 8541 5355 50  0000 L CNN
F 2 "Package_TO_SOT_SMD:SOT-23_Handsoldering" H 8550 5500 50  0001 C CNN
F 3 "http://www.onsemi.com/pub/Collateral/MMBT2222LT1-D.PDF" H 8350 5400 50  0001 C CNN
F 4 "MMBT2222LT1GOSCT-ND" H 8350 5400 50  0001 C CNN "DigiKey"
F 5 "793-0753" H 8350 5400 50  0001 C CNN "RS Components"
	1    8350 5400
	1    0    0    -1  
$EndComp
$Comp
L Device:R_Small R3
U 1 1 5C9DD68C
P 7950 5400
F 0 "R3" V 8146 5400 50  0000 C CNN
F 1 "10k" V 8055 5400 50  0000 C CNN
F 2 "Resistor_SMD:R_1206_3216Metric_Pad1.42x1.75mm_HandSolder" H 7950 5400 50  0001 C CNN
F 3 "~" H 7950 5400 50  0001 C CNN
F 4 "CR1206-JW-103ELFCT-ND‎" V 7950 5400 50  0001 C CNN "DigiKey"
F 5 "117-391" V 7950 5400 50  0001 C CNN "RS Components"
	1    7950 5400
	0    -1   -1   0   
$EndComp
$Comp
L power:GNDREF #PWR022
U 1 1 5C9DE61D
P 8450 5700
F 0 "#PWR022" H 8450 5450 50  0001 C CNN
F 1 "GNDREF" H 8455 5527 50  0001 C CNN
F 2 "" H 8450 5700 50  0001 C CNN
F 3 "" H 8450 5700 50  0001 C CNN
	1    8450 5700
	1    0    0    -1  
$EndComp
Text Notes 8100 4200 0    100  ~ 20
Buzzer
NoConn ~ 5900 4750
NoConn ~ 5900 5550
NoConn ~ 5900 5650
NoConn ~ 4300 5050
NoConn ~ 4300 5550
NoConn ~ 4300 4850
NoConn ~ 4300 4750
NoConn ~ 4300 5350
$Comp
L power:+5V #PWR020
U 1 1 5C9F5647
P 8450 4600
F 0 "#PWR020" H 8450 4450 50  0001 C CNN
F 1 "+5V" H 8465 4773 50  0000 C CNN
F 2 "" H 8450 4600 50  0001 C CNN
F 3 "" H 8450 4600 50  0001 C CNN
	1    8450 4600
	1    0    0    -1  
$EndComp
Wire Wire Line
	8350 4750 8350 4700
Wire Wire Line
	8350 4700 8450 4700
Wire Wire Line
	8550 4700 8550 4800
Wire Wire Line
	8350 4950 8350 5000
Wire Wire Line
	8350 5000 8450 5000
Wire Wire Line
	8550 5000 8550 4900
Connection ~ 8450 5000
Wire Wire Line
	8450 5000 8550 5000
Wire Wire Line
	8450 4600 8450 4700
Connection ~ 8450 4700
Wire Wire Line
	8450 4700 8550 4700
Wire Wire Line
	8050 5400 8150 5400
Wire Wire Line
	8450 5600 8450 5700
Text Label 7750 5400 2    50   ~ 0
BUZZER
$Comp
L power:GNDREF #PWR0102
U 1 1 5CB13343
P 4800 3550
F 0 "#PWR0102" H 4800 3300 50  0001 C CNN
F 1 "GNDREF" H 4805 3377 50  0001 C CNN
F 2 "" H 4800 3550 50  0001 C CNN
F 3 "" H 4800 3550 50  0001 C CNN
	1    4800 3550
	1    0    0    -1  
$EndComp
NoConn ~ 5900 6550
$Comp
L Connector_Generic:Conn_01x02 J3
U 1 1 5CDF0A04
P 4500 3150
F 0 "J3" H 4500 3250 50  0000 C CNN
F 1 "CABLE" H 4500 3300 50  0001 C CNN
F 2 "TerminalBlock:TerminalBlock_bornier-2_P5.08mm" H 4500 3150 50  0001 C CNN
F 3 "~" H 4500 3150 50  0001 C CNN
	1    4500 3150
	-1   0    0    -1  
$EndComp
Wire Wire Line
	4700 3250 4800 3250
Wire Wire Line
	4800 3250 4800 3550
$Comp
L Connector_Generic:Conn_01x02 J2
U 1 1 5CB130E8
P 2150 5000
F 0 "J2" H 2230 4992 50  0000 L CNN
F 1 "ROOM" H 2230 4901 50  0000 L CNN
F 2 "Connector_PinHeader_2.54mm:PinHeader_1x02_P2.54mm_Vertical" H 2150 5000 50  0001 C CNN
F 3 "~" H 2150 5000 50  0001 C CNN
	1    2150 5000
	-1   0    0    -1  
$EndComp
$Comp
L Connector_Generic:Conn_01x02 J5
U 1 1 5CE41514
P 2150 6100
F 0 "J5" H 2230 6092 50  0000 L CNN
F 1 "EVAP" H 2230 6001 50  0000 L CNN
F 2 "Connector_PinHeader_2.54mm:PinHeader_1x02_P2.54mm_Vertical" H 2150 6100 50  0001 C CNN
F 3 "~" H 2150 6100 50  0001 C CNN
	1    2150 6100
	-1   0    0    -1  
$EndComp
$Comp
L power:GNDREF #PWR021
U 1 1 5CE4AE78
P 2450 6300
F 0 "#PWR021" H 2450 6050 50  0001 C CNN
F 1 "GNDREF" H 2455 6127 50  0001 C CNN
F 2 "" H 2450 6300 50  0001 C CNN
F 3 "" H 2450 6300 50  0001 C CNN
	1    2450 6300
	1    0    0    -1  
$EndComp
$Comp
L power:GNDREF #PWR017
U 1 1 5CE4B468
P 2450 5200
F 0 "#PWR017" H 2450 4950 50  0001 C CNN
F 1 "GNDREF" H 2455 5027 50  0001 C CNN
F 2 "" H 2450 5200 50  0001 C CNN
F 3 "" H 2450 5200 50  0001 C CNN
	1    2450 5200
	1    0    0    -1  
$EndComp
Wire Wire Line
	2350 5100 2450 5100
Wire Wire Line
	2450 5100 2450 5200
Wire Wire Line
	2350 6200 2450 6200
Wire Wire Line
	2450 6200 2450 6300
$Comp
L power:+3V3 #PWR015
U 1 1 5CE56F0C
P 2450 4600
F 0 "#PWR015" H 2450 4450 50  0001 C CNN
F 1 "+3V3" H 2465 4773 50  0000 C CNN
F 2 "" H 2450 4600 50  0001 C CNN
F 3 "" H 2450 4600 50  0001 C CNN
	1    2450 4600
	1    0    0    -1  
$EndComp
$Comp
L Device:R_Small R4
U 1 1 5CE564C1
P 2450 4800
F 0 "R4" H 2509 4846 50  0000 L CNN
F 1 "10k" H 2509 4755 50  0000 L CNN
F 2 "Resistor_SMD:R_1206_3216Metric_Pad1.42x1.75mm_HandSolder" H 2450 4800 50  0001 C CNN
F 3 "~" H 2450 4800 50  0001 C CNN
F 4 "CR1206-JW-103ELFCT-ND‎" H 2450 4800 50  0001 C CNN "DigiKey"
F 5 "117-391" H 2450 4800 50  0001 C CNN "RS Components"
	1    2450 4800
	1    0    0    -1  
$EndComp
$Comp
L Device:R_Small R5
U 1 1 5CE79D25
P 2450 5900
F 0 "R5" H 2509 5946 50  0000 L CNN
F 1 "10k" H 2509 5855 50  0000 L CNN
F 2 "Resistor_SMD:R_1206_3216Metric_Pad1.42x1.75mm_HandSolder" H 2450 5900 50  0001 C CNN
F 3 "~" H 2450 5900 50  0001 C CNN
F 4 "CR1206-JW-103ELFCT-ND‎" H 2450 5900 50  0001 C CNN "DigiKey"
F 5 "117-391" H 2450 5900 50  0001 C CNN "RS Components"
	1    2450 5900
	1    0    0    -1  
$EndComp
$Comp
L power:+3V3 #PWR019
U 1 1 5CE7C133
P 2450 5700
F 0 "#PWR019" H 2450 5550 50  0001 C CNN
F 1 "+3V3" H 2465 5873 50  0000 C CNN
F 2 "" H 2450 5700 50  0001 C CNN
F 3 "" H 2450 5700 50  0001 C CNN
	1    2450 5700
	1    0    0    -1  
$EndComp
Wire Wire Line
	2350 5000 2450 5000
Wire Wire Line
	2450 5000 2450 4900
Wire Wire Line
	2450 4600 2450 4700
Wire Wire Line
	2450 5700 2450 5800
Wire Wire Line
	2350 6100 2450 6100
Wire Wire Line
	2450 6100 2450 6000
Text Label 2650 6100 0    50   ~ 0
EVAP
Text Label 2650 5000 0    50   ~ 0
ROOM
Wire Wire Line
	2450 5000 2650 5000
Connection ~ 2450 5000
Wire Wire Line
	2450 6100 2650 6100
Connection ~ 2450 6100
Wire Wire Line
	8450 5000 8450 5200
$Comp
L Device:C_Small C2
U 1 1 5CF063BE
P 5400 3350
F 0 "C2" H 5492 3396 50  0000 L CNN
F 1 "100n" H 5492 3305 50  0000 L CNN
F 2 "Capacitor_SMD:C_1206_3216Metric_Pad1.42x1.75mm_HandSolder" H 5400 3350 50  0001 C CNN
F 3 "~" H 5400 3350 50  0001 C CNN
	1    5400 3350
	1    0    0    -1  
$EndComp
$Comp
L power:GNDREF #PWR010
U 1 1 5CF06B95
P 5400 3550
F 0 "#PWR010" H 5400 3300 50  0001 C CNN
F 1 "GNDREF" H 5405 3377 50  0001 C CNN
F 2 "" H 5400 3550 50  0001 C CNN
F 3 "" H 5400 3550 50  0001 C CNN
	1    5400 3550
	1    0    0    -1  
$EndComp
$Comp
L Device:CP_Small C1
U 1 1 5CF076D0
P 5200 3350
F 0 "C1" H 5000 3400 50  0000 L CNN
F 1 "100u" H 4900 3300 50  0000 L CNN
F 2 "Capacitor_THT:CP_Radial_D10.0mm_P5.00mm" H 5200 3350 50  0001 C CNN
F 3 "~" H 5200 3350 50  0001 C CNN
	1    5200 3350
	1    0    0    -1  
$EndComp
$Comp
L power:GNDREF #PWR07
U 1 1 5CF07FB6
P 5200 3550
F 0 "#PWR07" H 5200 3300 50  0001 C CNN
F 1 "GNDREF" H 5205 3377 50  0001 C CNN
F 2 "" H 5200 3550 50  0001 C CNN
F 3 "" H 5200 3550 50  0001 C CNN
	1    5200 3550
	1    0    0    -1  
$EndComp
Wire Wire Line
	5200 3550 5200 3450
Wire Wire Line
	5400 3550 5400 3450
$Comp
L power:+5V #PWR03
U 1 1 5CF323D5
P 5200 3050
F 0 "#PWR03" H 5200 2900 50  0001 C CNN
F 1 "+5V" H 5215 3223 50  0000 C CNN
F 2 "" H 5200 3050 50  0001 C CNN
F 3 "" H 5200 3050 50  0001 C CNN
	1    5200 3050
	1    0    0    -1  
$EndComp
$Comp
L power:+3V3 #PWR06
U 1 1 5C9C8A76
P 3750 5850
F 0 "#PWR06" H 3750 5700 50  0001 C CNN
F 1 "+3V3" H 3765 6023 50  0000 C CNN
F 2 "" H 3750 5850 50  0001 C CNN
F 3 "" H 3750 5850 50  0001 C CNN
	1    3750 5850
	1    0    0    -1  
$EndComp
$Comp
L power:GNDREF #PWR09
U 1 1 5C9C71E0
P 6000 6850
F 0 "#PWR09" H 6000 6600 50  0001 C CNN
F 1 "GNDREF" H 6005 6677 50  0001 C CNN
F 2 "" H 6000 6850 50  0001 C CNN
F 3 "" H 6000 6850 50  0001 C CNN
	1    6000 6850
	1    0    0    -1  
$EndComp
Wire Wire Line
	5900 6650 6000 6650
Wire Wire Line
	6000 6650 6000 6850
Wire Wire Line
	3750 5850 3750 5950
Wire Wire Line
	3750 5950 4300 5950
Text Notes 2000 4200 0    100  ~ 20
Temperature
$Comp
L Connector_Generic:Conn_01x04 J1
U 1 1 5CFD1931
P 8600 3300
F 0 "J1" H 8680 3342 50  0000 L CNN
F 1 "DAUGHTER" H 8680 3251 50  0000 L CNN
F 2 "Connector_PinHeader_2.54mm:PinHeader_1x04_P2.54mm_Vertical" H 8600 3300 50  0001 C CNN
F 3 "~" H 8600 3300 50  0001 C CNN
	1    8600 3300
	1    0    0    -1  
$EndComp
Text Label 8150 3300 2    50   ~ 0
PIXELS
Text Label 4100 5250 2    50   ~ 0
PIXELS
$Comp
L power:+5V #PWR04
U 1 1 5CFD36F8
P 8300 3100
F 0 "#PWR04" H 8300 2950 50  0001 C CNN
F 1 "+5V" H 8315 3273 50  0000 C CNN
F 2 "" H 8300 3100 50  0001 C CNN
F 3 "" H 8300 3100 50  0001 C CNN
	1    8300 3100
	1    0    0    -1  
$EndComp
$Comp
L power:GNDREF #PWR05
U 1 1 5CFD3ED4
P 8300 3600
F 0 "#PWR05" H 8300 3350 50  0001 C CNN
F 1 "GNDREF" H 8305 3427 50  0001 C CNN
F 2 "" H 8300 3600 50  0001 C CNN
F 3 "" H 8300 3600 50  0001 C CNN
	1    8300 3600
	1    0    0    -1  
$EndComp
Wire Wire Line
	8300 3100 8300 3200
Wire Wire Line
	8300 3200 8400 3200
Wire Wire Line
	8400 3500 8300 3500
Wire Wire Line
	8300 3500 8300 3600
Wire Wire Line
	8400 3300 8150 3300
Text Notes 8000 2700 0    100  ~ 20
DOOR/LEDS
Text Label 4100 6450 2    50   ~ 0
BUZZER
Wire Wire Line
	4100 6450 4300 6450
NoConn ~ 4300 5150
NoConn ~ 4300 5750
NoConn ~ 4300 5850
NoConn ~ 4300 6050
NoConn ~ 4300 6150
NoConn ~ 4300 6250
NoConn ~ 4300 6350
NoConn ~ 4300 6550
NoConn ~ 4300 6650
NoConn ~ 5900 5850
NoConn ~ 5900 5750
Wire Wire Line
	4100 5250 4300 5250
Connection ~ 6000 6650
Wire Wire Line
	7750 5400 7850 5400
$Comp
L Device:D_Small D2
U 1 1 5D1EBC9C
P 11000 4000
F 0 "D2" V 11000 3800 50  0000 L CNN
F 1 "D_Small" V 11045 4068 50  0001 L CNN
F 2 "Diode_SMD:D_SOD-323_HandSoldering" V 11000 4000 50  0001 C CNN
F 3 "http://www.onsemi.com/pub/Collateral/BAS16HT1-D.PDF" V 11000 4000 50  0001 C CNN
F 4 "BAS16HT1GOSCT-ND" V 11000 4000 50  0001 C CNN "DigiKey"
	1    11000 4000
	0    1    1    0   
$EndComp
$Comp
L Device:Q_NPN_BEC Q2
U 1 1 5D1EBCA8
P 11200 4750
F 0 "Q2" H 11391 4796 50  0000 L CNN
F 1 "Q_NPN_BEC" H 11391 4705 50  0000 L CNN
F 2 "Package_TO_SOT_SMD:SOT-23_Handsoldering" H 11400 4850 50  0001 C CNN
F 3 "http://www.onsemi.com/pub/Collateral/MMBT2222LT1-D.PDF" H 11200 4750 50  0001 C CNN
F 4 "MMBT2222LT1GOSCT-ND" H 11200 4750 50  0001 C CNN "DigiKey"
F 5 "793-0753" H 11200 4750 50  0001 C CNN "RS Components"
	1    11200 4750
	1    0    0    -1  
$EndComp
$Comp
L Device:R_Small R6
U 1 1 5D1EBCB4
P 10800 4750
F 0 "R6" V 10996 4750 50  0000 C CNN
F 1 "10k" V 10905 4750 50  0000 C CNN
F 2 "Resistor_SMD:R_1206_3216Metric_Pad1.42x1.75mm_HandSolder" H 10800 4750 50  0001 C CNN
F 3 "~" H 10800 4750 50  0001 C CNN
F 4 "CR1206-JW-103ELFCT-ND‎" V 10800 4750 50  0001 C CNN "DigiKey"
F 5 "117-391" V 10800 4750 50  0001 C CNN "RS Components"
	1    10800 4750
	0    -1   -1   0   
$EndComp
$Comp
L power:GNDREF #PWR02
U 1 1 5D1EBCBE
P 11300 5050
F 0 "#PWR02" H 11300 4800 50  0001 C CNN
F 1 "GNDREF" H 11305 4877 50  0001 C CNN
F 2 "" H 11300 5050 50  0001 C CNN
F 3 "" H 11300 5050 50  0001 C CNN
	1    11300 5050
	1    0    0    -1  
$EndComp
$Comp
L power:+5V #PWR01
U 1 1 5D1EBCC8
P 11300 3550
F 0 "#PWR01" H 11300 3400 50  0001 C CNN
F 1 "+5V" H 11315 3723 50  0000 C CNN
F 2 "" H 11300 3550 50  0001 C CNN
F 3 "" H 11300 3550 50  0001 C CNN
	1    11300 3550
	1    0    0    -1  
$EndComp
Wire Wire Line
	10900 4750 11000 4750
Wire Wire Line
	11300 4950 11300 5050
Text Label 10600 4750 2    50   ~ 0
RELAY
Wire Wire Line
	11300 4350 11300 4450
Wire Wire Line
	10600 4750 10700 4750
Wire Wire Line
	11300 3550 11300 3650
Wire Wire Line
	11300 3650 11000 3650
Wire Wire Line
	11000 3650 11000 3900
Connection ~ 11300 3650
Wire Wire Line
	11300 3650 11300 3750
Wire Wire Line
	11000 4100 11000 4450
Wire Wire Line
	11000 4450 11300 4450
Connection ~ 11300 4450
Wire Wire Line
	11300 4450 11300 4550
Wire Wire Line
	5200 3050 5200 3150
Wire Wire Line
	5400 3250 5400 3150
Wire Wire Line
	5400 3150 5200 3150
Connection ~ 5200 3150
Wire Wire Line
	5200 3150 5200 3250
$Comp
L Connector_Generic:Conn_01x01 J6
U 1 1 5D250AF6
P 12850 3250
F 0 "J6" H 12768 3117 50  0000 C CNN
F 1 "LIVE" H 12768 3116 50  0001 C CNN
F 2 "lib_fp:PCBTab_W6.35mm_H0.81mm" H 12850 3250 50  0001 C CNN
F 3 "~" H 12850 3250 50  0001 C CNN
F 4 "https://au.element14.com/amp-te-connectivity/62409-1/terminal-pcb-tab-vertical-pk10/dp/892609" H 12850 3250 50  0001 C CNN "E14"
	1    12850 3250
	-1   0    0    1   
$EndComp
$Comp
L Connector_Generic:Conn_01x01 J11
U 1 1 5D251469
P 13450 3250
F 0 "J11" H 13530 3292 50  0000 L CNN
F 1 "PSU_L" H 13530 3201 50  0000 L CNN
F 2 "lib_fp:PCBTab_W6.35mm_H0.81mm" H 13450 3250 50  0001 C CNN
F 3 "~" H 13450 3250 50  0001 C CNN
	1    13450 3250
	1    0    0    -1  
$EndComp
$Comp
L Connector_Generic:Conn_01x01 J12
U 1 1 5D25229E
P 13450 3450
F 0 "J12" H 13530 3492 50  0000 L CNN
F 1 "FAN_L" H 13530 3401 50  0000 L CNN
F 2 "lib_fp:PCBTab_W6.35mm_H0.81mm" H 13450 3450 50  0001 C CNN
F 3 "~" H 13450 3450 50  0001 C CNN
	1    13450 3450
	1    0    0    -1  
$EndComp
$Comp
L Connector_Generic:Conn_01x01 J13
U 1 1 5D252E83
P 13450 3650
F 0 "J13" H 13530 3692 50  0000 L CNN
F 1 "CON_L" H 13530 3601 50  0000 L CNN
F 2 "lib_fp:PCBTab_W6.35mm_H0.81mm" H 13450 3650 50  0001 C CNN
F 3 "~" H 13450 3650 50  0001 C CNN
	1    13450 3650
	1    0    0    -1  
$EndComp
$Comp
L Connector_Generic:Conn_01x01 J7
U 1 1 5D254C9F
P 12850 4200
F 0 "J7" H 12768 4067 50  0000 C CNN
F 1 "NEAUTRAL" H 12768 4066 50  0001 C CNN
F 2 "lib_fp:PCBTab_W6.35mm_H0.81mm" H 12850 4200 50  0001 C CNN
F 3 "~" H 12850 4200 50  0001 C CNN
	1    12850 4200
	-1   0    0    1   
$EndComp
$Comp
L Connector_Generic:Conn_01x01 J14
U 1 1 5D254CA9
P 13450 4200
F 0 "J14" H 13530 4242 50  0000 L CNN
F 1 "PSU_N" H 13530 4151 50  0000 L CNN
F 2 "lib_fp:PCBTab_W6.35mm_H0.81mm" H 13450 4200 50  0001 C CNN
F 3 "~" H 13450 4200 50  0001 C CNN
	1    13450 4200
	1    0    0    -1  
$EndComp
$Comp
L Connector_Generic:Conn_01x01 J15
U 1 1 5D254CB3
P 13450 4400
F 0 "J15" H 13530 4442 50  0000 L CNN
F 1 "FAN_N" H 13530 4351 50  0000 L CNN
F 2 "lib_fp:PCBTab_W6.35mm_H0.81mm" H 13450 4400 50  0001 C CNN
F 3 "~" H 13450 4400 50  0001 C CNN
	1    13450 4400
	1    0    0    -1  
$EndComp
$Comp
L Connector_Generic:Conn_01x01 J16
U 1 1 5D25A67D
P 13450 4600
F 0 "J16" H 13530 4642 50  0000 L CNN
F 1 "CON_N" H 13530 4551 50  0000 L CNN
F 2 "lib_fp:PCBTab_W6.35mm_H0.81mm" H 13450 4600 50  0001 C CNN
F 3 "~" H 13450 4600 50  0001 C CNN
	1    13450 4600
	1    0    0    -1  
$EndComp
Wire Wire Line
	13050 4200 13150 4200
Wire Wire Line
	13150 4200 13150 4400
Wire Wire Line
	13150 4400 13250 4400
Connection ~ 13150 4200
Wire Wire Line
	13150 4200 13250 4200
Wire Wire Line
	13150 4400 13150 4600
Wire Wire Line
	13150 4600 13250 4600
Connection ~ 13150 4400
$Comp
L power:NEUT #PWR013
U 1 1 5D26CB98
P 13150 4100
F 0 "#PWR013" H 13150 3950 50  0001 C CNN
F 1 "NEUT" H 13167 4273 50  0000 C CNN
F 2 "" H 13150 4100 50  0001 C CNN
F 3 "" H 13150 4100 50  0001 C CNN
	1    13150 4100
	1    0    0    -1  
$EndComp
Wire Wire Line
	13050 3250 13150 3250
Wire Wire Line
	13150 3250 13150 3450
Wire Wire Line
	13150 3450 13250 3450
Connection ~ 13150 3250
Wire Wire Line
	13150 3250 13250 3250
Wire Wire Line
	13150 4100 13150 4200
$Comp
L power:LINE #PWR011
U 1 1 5D276CC8
P 13150 3150
F 0 "#PWR011" H 13150 3000 50  0001 C CNN
F 1 "LINE" H 13167 3323 50  0000 C CNN
F 2 "" H 13150 3150 50  0001 C CNN
F 3 "" H 13150 3150 50  0001 C CNN
	1    13150 3150
	1    0    0    -1  
$EndComp
Wire Wire Line
	13150 3150 13150 3250
$Comp
L power:LINE #PWR08
U 1 1 5D27A2C3
P 11900 3650
F 0 "#PWR08" H 11900 3500 50  0001 C CNN
F 1 "LINE" H 11917 3823 50  0000 C CNN
F 2 "" H 11900 3650 50  0001 C CNN
F 3 "" H 11900 3650 50  0001 C CNN
	1    11900 3650
	1    0    0    -1  
$EndComp
Wire Wire Line
	11900 3750 11900 3650
NoConn ~ 11700 3750
Wire Wire Line
	4700 3150 5200 3150
Text Notes 11100 2700 0    100  ~ 20
AC Power / Condensor Control
Text Label 8150 3400 2    50   ~ 0
DOOR
Wire Wire Line
	8150 3400 8400 3400
$Comp
L Connector_Generic:Conn_01x02 J10
U 1 1 5D39088A
P 13800 7850
F 0 "J10" H 13880 7842 50  0000 L CNN
F 1 "DOOR" H 13880 7751 50  0000 L CNN
F 2 "Connector_PinHeader_2.54mm:PinHeader_1x02_P2.54mm_Vertical" H 13800 7850 50  0001 C CNN
F 3 "~" H 13800 7850 50  0001 C CNN
	1    13800 7850
	1    0    0    -1  
$EndComp
$Comp
L Connector_Generic:Conn_01x03 J9
U 1 1 5D39DBAE
P 13800 7200
F 0 "J9" H 13880 7192 50  0000 L CNN
F 1 "PIXELS" H 13880 7101 50  0000 L CNN
F 2 "Connector_PinHeader_2.54mm:PinHeader_1x03_P2.54mm_Vertical" H 13800 7200 50  0001 C CNN
F 3 "~" H 13800 7200 50  0001 C CNN
	1    13800 7200
	1    0    0    -1  
$EndComp
Wire Wire Line
	12100 7300 12100 7850
Wire Wire Line
	12100 7850 13600 7850
Text Notes 11150 7200 0    50   ~ 0
PIXELS
Text Notes 11150 7300 0    50   ~ 0
DOOR
$Comp
L Connector_Generic:Conn_01x04 J4
U 1 1 5D37AE0C
P 10950 7200
F 0 "J4" H 11030 7242 50  0000 L CNN
F 1 "DAUGHTER" H 11030 7151 50  0000 L CNN
F 2 "Connector_PinHeader_2.54mm:PinHeader_1x04_P2.54mm_Vertical" H 10950 7200 50  0001 C CNN
F 3 "~" H 10950 7200 50  0001 C CNN
	1    10950 7200
	-1   0    0    -1  
$EndComp
Text Notes 11150 7100 0    50   ~ 0
5V
Text Notes 11150 7400 0    50   ~ 0
GND
Wire Wire Line
	11150 7400 11300 7400
Text Notes 11200 6350 0    100  ~ 20
DOOR/LEDS Daughter Board
$Comp
L Device:R_Small R7
U 1 1 5D453FF2
P 12100 7200
F 0 "R7" V 12296 7200 50  0000 C CNN
F 1 "10k" V 12205 7200 50  0000 C CNN
F 2 "Resistor_SMD:R_1206_3216Metric_Pad1.42x1.75mm_HandSolder" H 12100 7200 50  0001 C CNN
F 3 "~" H 12100 7200 50  0001 C CNN
F 4 "CR1206-JW-103ELFCT-ND‎" V 12100 7200 50  0001 C CNN "DigiKey"
F 5 "117-391" V 12100 7200 50  0001 C CNN "RS Components"
	1    12100 7200
	0    -1   -1   0   
$EndComp
Wire Wire Line
	11150 7200 12000 7200
Wire Wire Line
	11150 7300 12100 7300
Wire Wire Line
	11150 7100 11300 7100
NoConn ~ 5900 5250
NoConn ~ 5900 5350
NoConn ~ 5900 5450
NoConn ~ 5900 6050
NoConn ~ 5900 6350
NoConn ~ 5900 6450
$Comp
L G2R-1-E:G2R-1-E K1
U 1 1 5D88ED6D
P 11600 4050
F 0 "K1" H 12230 4096 50  0000 L CNN
F 1 "G2R-1-E" H 12230 4005 50  0000 L CNN
F 2 "lib_fp:Relay_SPDT_Omron-G2R-1" H 11600 4050 50  0001 C CNN
F 3 "" H 11600 4050 50  0001 C CNN
	1    11600 4050
	1    0    0    -1  
$EndComp
NoConn ~ 11700 4350
$Comp
L Device:Varistor RV1
U 1 1 5D8CC179
P 12000 4550
F 0 "RV1" V 11850 4550 50  0000 C CNN
F 1 "Varistor" V 12250 4550 50  0001 C CNN
F 2 "Varistor:RV_Disc_D12mm_W5.1mm_P7.5mm" V 11930 4550 50  0001 C CNN
F 3 "~" H 12000 4550 50  0001 C CNN
	1    12000 4550
	0    -1   -1   0   
$EndComp
Wire Wire Line
	12100 3750 12100 3650
Wire Wire Line
	12100 3650 13250 3650
Wire Wire Line
	11900 4350 11900 4450
Wire Wire Line
	11900 4450 11800 4450
Wire Wire Line
	11800 4450 11800 4550
Wire Wire Line
	11800 4550 11850 4550
Wire Wire Line
	12100 4350 12100 4450
Wire Wire Line
	12100 4450 12200 4450
Wire Wire Line
	12200 4450 12200 4550
Wire Wire Line
	12200 4550 12150 4550
$Comp
L LED:WS2812B D4
U 1 1 5D8E723A
P 13000 7200
F 0 "D4" H 13344 7246 50  0000 L CNN
F 1 "WS2812B" H 13344 7155 50  0000 L CNN
F 2 "LED_SMD:LED_WS2812B_PLCC4_5.0x5.0mm_P3.2mm" H 13050 6900 50  0001 L TNN
F 3 "https://cdn-shop.adafruit.com/datasheets/WS2812B.pdf" H 13100 6825 50  0001 L TNN
	1    13000 7200
	1    0    0    -1  
$EndComp
Wire Wire Line
	13000 7500 13000 7600
Wire Wire Line
	13000 7600 13500 7600
Wire Wire Line
	13500 7600 13500 7300
Wire Wire Line
	13500 7300 13600 7300
Wire Wire Line
	12400 6800 12400 6900
Wire Wire Line
	12400 6800 13500 6800
Wire Wire Line
	13500 6800 13500 7100
Wire Wire Line
	13500 7100 13600 7100
$Comp
L Device:D_Small D3
U 1 1 5D938A9D
P 12700 6900
F 0 "D3" H 12750 6950 50  0000 L CNN
F 1 "D_Small" V 12745 6968 50  0001 L CNN
F 2 "Diode_SMD:D_SOD-323_HandSoldering" V 12700 6900 50  0001 C CNN
F 3 "http://www.onsemi.com/pub/Collateral/BAS16HT1-D.PDF" V 12700 6900 50  0001 C CNN
F 4 "BAS16HT1GOSCT-ND" V 12700 6900 50  0001 C CNN "DigiKey"
	1    12700 6900
	-1   0    0    1   
$EndComp
Wire Wire Line
	12800 6900 13000 6900
Wire Wire Line
	12200 7200 12700 7200
Wire Wire Line
	13300 7200 13600 7200
Connection ~ 11700 7950
Wire Wire Line
	11700 7950 13000 7950
Wire Wire Line
	13000 7600 13000 7950
Connection ~ 13000 7600
Connection ~ 13000 7950
Wire Wire Line
	13000 7950 13600 7950
Wire Wire Line
	11300 7400 11300 7950
Wire Wire Line
	11300 7950 11700 7950
$Comp
L power:GNDREF #PWR?
U 1 1 5D98DD29
P 11700 8050
F 0 "#PWR?" H 11700 7800 50  0001 C CNN
F 1 "GNDREF" H 11705 7877 50  0001 C CNN
F 2 "" H 11700 8050 50  0001 C CNN
F 3 "" H 11700 8050 50  0001 C CNN
	1    11700 8050
	1    0    0    -1  
$EndComp
Wire Wire Line
	11700 7950 11700 8050
$Comp
L power:+5V #PWR?
U 1 1 5D998B87
P 12400 6700
F 0 "#PWR?" H 12400 6550 50  0001 C CNN
F 1 "+5V" H 12415 6873 50  0000 C CNN
F 2 "" H 12400 6700 50  0001 C CNN
F 3 "" H 12400 6700 50  0001 C CNN
	1    12400 6700
	1    0    0    -1  
$EndComp
Wire Wire Line
	12400 6800 11700 6800
Wire Wire Line
	11300 6800 11300 7100
Connection ~ 12400 6800
Wire Wire Line
	12400 6700 12400 6800
Wire Wire Line
	12600 6900 12400 6900
Connection ~ 11700 6800
Wire Wire Line
	11700 6800 11300 6800
Wire Wire Line
	11700 7400 11700 6800
$Comp
L Device:CP_Small C3
U 1 1 5D45F54B
P 11700 7500
F 0 "C3" H 11500 7550 50  0000 L CNN
F 1 "1500u" H 11400 7450 50  0000 L CNN
F 2 "Capacitor_THT:CP_Radial_D10.0mm_P5.00mm" H 11700 7500 50  0001 C CNN
F 3 "~" H 11700 7500 50  0001 C CNN
	1    11700 7500
	1    0    0    -1  
$EndComp
Wire Wire Line
	11700 7950 11700 7600
Wire Wire Line
	5900 6150 6100 6150
Wire Wire Line
	6100 6250 5900 6250
$EndSCHEMATC
