<?xml version="1.0" encoding="UTF-8" standalone="no"?>
<svg
   xmlns:dc="http://purl.org/dc/elements/1.1/"
   xmlns:cc="http://creativecommons.org/ns#"
   xmlns:rdf="http://www.w3.org/1999/02/22-rdf-syntax-ns#"
   xmlns:svg="http://www.w3.org/2000/svg"
   xmlns="http://www.w3.org/2000/svg"
   xmlns:sodipodi="http://sodipodi.sourceforge.net/DTD/sodipodi-0.dtd"
   xmlns:inkscape="http://www.inkscape.org/namespaces/inkscape"
   width="676.42mm"
   height="503.28mm"
   viewBox="0 0 676.42 503.28"
   version="1.1"
   preserveAspectRatio="xMidYMid meet"
   id="svg887"
   sodipodi:docname="box.svg"
   inkscape:version="0.92.4 (f8dce91, 2019-08-02)">
  <metadata
     id="metadata893">
    <rdf:RDF>
      <cc:Work
         rdf:about="">
        <dc:format>image/svg+xml</dc:format>
        <dc:type
           rdf:resource="http://purl.org/dc/dcmitype/StillImage" />
      </cc:Work>
    </rdf:RDF>
  </metadata>
  <defs
     id="defs891" />
  <sodipodi:namedview
     pagecolor="#ffffff"
     bordercolor="#666666"
     borderopacity="1"
     objecttolerance="10"
     gridtolerance="10"
     guidetolerance="10"
     inkscape:pageopacity="0"
     inkscape:pageshadow="2"
     inkscape:window-width="1850"
     inkscape:window-height="1016"
     id="namedview889"
     showgrid="false"
     inkscape:zoom="0.4216258"
     inkscape:cx="1278.274"
     inkscape:cy="951.08031"
     inkscape:window-x="70"
     inkscape:window-y="27"
     inkscape:window-maximized="1"
     inkscape:current-layer="svg887" />
  <g
     id="svgGroup"
     stroke-linecap="round"
     fill-rule="evenodd"
     font-size="9pt"
     stroke="#000"
     stroke-width="0.25mm"
     fill="none"
     style="stroke:#000;stroke-width:0.94500003;fill:none;stroke-miterlimit:4;stroke-dasharray:none">
    <path
       d="M 51.14 503.239 L 51.14 500.28 L 87 500.28 L 87 503.239 L 87.041 503.28 L 123.099 503.28 L 123.14 503.239 L 123.14 500.28 L 159 500.28 L 159 503.239 L 159.041 503.28 L 210.099 503.28 L 210.14 503.239 L 210.14 482.181 L 210.099 482.14 L 207.14 482.14 L 207.14 446.28 L 210.099 446.28 L 210.14 446.239 L 210.14 410.181 L 210.099 410.14 L 207.14 410.14 L 207.14 374.28 L 210.099 374.28 L 210.14 374.239 L 210.14 353.181 L 210.099 353.14 L 159.041 353.14 L 159 353.181 L 159 356.14 L 123.14 356.14 L 123.14 353.181 L 123.099 353.14 L 87.041 353.14 L 87 353.181 L 87 356.14 L 51.14 356.14 L 51.14 353.181 L 51.099 353.14 L 0.041 353.14 L 0 353.181 L 0 374.239 L 0.041 374.28 L 3 374.28 L 3 410.14 L 0.041 410.14 L 0 410.181 L 0 446.239 L 0.041 446.28 L 3 446.28 L 3 482.14 L 0.041 482.14 L 0 482.181 L 0 503.239 L 0.041 503.28 L 51.099 503.28 L 51.14 503.239 Z"
       id="front_outsideCutPath"
       stroke="#FF0000"
       stroke-width="0.1"
       style="stroke:#FF0000;stroke-width:0.94500003;stroke-miterlimit:4;stroke-dasharray:none"
       vector-effect="non-scaling-stroke" />
    <path
       d="M 126.953 439.551 L 124.519 439.551 L 124.519 429.155 A 6.88 6.88 0 0 0 124.44 428.077 Q 124.254 426.903 123.625 426.223 Q 122.901 425.44 121.514 425.29 A 6.452 6.452 0 0 0 120.824 425.255 A 7.366 7.366 0 0 0 119.446 425.375 Q 117.954 425.66 117.13 426.619 A 3.979 3.979 0 0 0 116.438 427.828 Q 116.021 428.937 115.965 430.592 A 15.592 15.592 0 0 0 115.957 431.12 L 115.957 439.551 L 113.523 439.551 L 113.523 423.481 L 115.502 423.481 L 115.898 425.68 L 116.015 425.68 A 4.928 4.928 0 0 1 117.946 423.924 A 5.927 5.927 0 0 1 118.112 423.84 A 6.591 6.591 0 0 1 120.457 423.215 A 7.97 7.97 0 0 1 121.118 423.188 Q 124.021 423.188 125.487 424.588 Q 126.953 425.988 126.953 429.067 L 126.953 439.551 Z M 80.196 423.481 L 80.196 425.373 L 76.105 425.373 L 76.105 439.551 L 73.671 439.551 L 73.671 425.373 L 70.797 425.373 L 70.797 424.273 L 73.671 423.393 L 73.671 422.499 Q 73.671 417.385 77.528 416.686 A 7.398 7.398 0 0 1 78.847 416.575 A 7.838 7.838 0 0 1 79.956 416.66 Q 80.496 416.737 81.096 416.885 A 15.755 15.755 0 0 1 81.838 417.088 L 81.207 419.039 Q 79.8 418.584 78.803 418.584 A 3.282 3.282 0 0 0 78.012 418.673 A 2.108 2.108 0 0 0 76.765 419.5 A 2.816 2.816 0 0 0 76.393 420.251 Q 76.145 420.984 76.111 422.074 A 11.491 11.491 0 0 0 76.105 422.44 L 76.105 423.481 L 80.196 423.481 Z M 139.343 437.542 L 139.343 439.404 A 2.394 2.394 0 0 1 139.059 439.517 Q 138.756 439.617 138.322 439.695 A 9.102 9.102 0 0 1 138.177 439.719 Q 137.407 439.844 136.791 439.844 Q 132.129 439.844 132.129 434.932 L 132.129 425.373 L 129.827 425.373 L 129.827 424.2 L 132.129 423.188 L 133.155 419.757 L 134.563 419.757 L 134.563 423.481 L 139.225 423.481 L 139.225 425.373 L 134.563 425.373 L 134.563 434.83 A 4.901 4.901 0 0 0 134.634 435.69 Q 134.718 436.163 134.903 436.536 A 2.361 2.361 0 0 0 135.252 437.058 A 2.261 2.261 0 0 0 136.642 437.798 A 3.253 3.253 0 0 0 137.143 437.835 A 7.993 7.993 0 0 0 138.314 437.752 A 7.365 7.365 0 0 0 138.39 437.74 A 13.166 13.166 0 0 0 138.741 437.68 Q 139.077 437.617 139.31 437.551 A 3.656 3.656 0 0 0 139.343 437.542 Z M 92.38 423.364 L 92.043 425.622 Q 91.212 425.439 90.544 425.408 A 5.709 5.709 0 0 0 90.283 425.402 A 4.217 4.217 0 0 0 87.168 426.748 A 5.77 5.77 0 0 0 86.948 426.985 A 5.558 5.558 0 0 0 85.607 430.106 A 7.388 7.388 0 0 0 85.562 430.93 L 85.562 439.551 L 83.128 439.551 L 83.128 423.481 L 85.137 423.481 L 85.415 426.458 L 85.533 426.458 A 8.219 8.219 0 0 1 86.452 425.145 A 6.279 6.279 0 0 1 87.688 424.038 A 4.852 4.852 0 0 1 90.459 423.188 A 11.174 11.174 0 0 1 91.46 423.231 A 8.155 8.155 0 0 1 92.38 423.364 Z M 109.033 433.947 A 12.572 12.572 0 0 0 109.256 431.501 Q 109.256 427.675 107.269 425.431 A 6.372 6.372 0 0 0 104.311 423.523 A 8.179 8.179 0 0 0 101.91 423.188 A 9.453 9.453 0 0 0 100.212 423.334 A 6.438 6.438 0 0 0 96.456 425.38 A 6.724 6.724 0 0 0 95.63 426.525 Q 94.994 427.634 94.713 429.057 A 12.637 12.637 0 0 0 94.491 431.501 A 12.176 12.176 0 0 0 94.644 433.474 A 9.004 9.004 0 0 0 95.4 435.929 A 8 8 0 0 0 95.577 436.276 A 6.589 6.589 0 0 0 97.981 438.832 Q 99.652 439.844 101.808 439.844 A 9.451 9.451 0 0 0 103.458 439.706 A 6.489 6.489 0 0 0 107.277 437.637 A 6.79 6.79 0 0 0 108.085 436.527 Q 108.745 435.399 109.033 433.947 Z M 97.013 431.501 A 12.325 12.325 0 0 0 97.13 433.262 Q 97.393 435.078 98.245 436.193 A 3.989 3.989 0 0 0 100.843 437.723 A 6.045 6.045 0 0 0 101.866 437.806 Q 104.256 437.806 105.495 436.201 A 5.225 5.225 0 0 0 106.309 434.616 Q 106.548 433.884 106.653 432.99 A 12.821 12.821 0 0 0 106.734 431.501 A 12.144 12.144 0 0 0 106.619 429.771 Q 106.492 428.89 106.224 428.176 A 5.011 5.011 0 0 0 105.495 426.846 A 4.004 4.004 0 0 0 103.006 425.361 A 6.139 6.139 0 0 0 101.837 425.255 A 5.792 5.792 0 0 0 100.395 425.424 A 3.876 3.876 0 0 0 98.23 426.824 A 5.032 5.032 0 0 0 97.448 428.336 Q 97.217 429.031 97.109 429.881 A 12.861 12.861 0 0 0 97.013 431.501 Z"
       id="front_labelLayer"
       stroke="#777777"
       fill="#777777"
       style="stroke:#777777;fill:#777777;stroke-width:0.94500003;stroke-miterlimit:4;stroke-dasharray:none"
       vector-effect="non-scaling-stroke" />
    <path
       d="M 248.28 503.239 L 248.28 500.28 L 284.14 500.28 L 284.14 503.239 L 284.181 503.28 L 320.239 503.28 L 320.28 503.239 L 320.28 500.28 L 356.14 500.28 L 356.14 503.239 L 356.181 503.28 L 392.239 503.28 L 392.28 503.239 L 392.28 500.28 L 428.14 500.28 L 428.14 503.239 L 428.181 503.28 L 460.239 503.28 L 460.28 503.239 L 460.28 482.28 L 463.239 482.28 L 463.28 482.239 L 463.28 446.181 L 463.239 446.14 L 460.28 446.14 L 460.28 410.28 L 463.239 410.28 L 463.28 410.239 L 463.28 374.181 L 463.239 374.14 L 460.28 374.14 L 460.28 353.181 L 460.239 353.14 L 428.181 353.14 L 428.14 353.181 L 428.14 356.14 L 392.28 356.14 L 392.28 353.181 L 392.239 353.14 L 356.181 353.14 L 356.14 353.181 L 356.14 356.14 L 320.28 356.14 L 320.28 353.181 L 320.239 353.14 L 284.181 353.14 L 284.14 353.181 L 284.14 356.14 L 248.28 356.14 L 248.28 353.181 L 248.239 353.14 L 216.181 353.14 L 216.14 353.181 L 216.14 374.14 L 213.181 374.14 L 213.14 374.181 L 213.14 410.239 L 213.181 410.28 L 216.14 410.28 L 216.14 446.14 L 213.181 446.14 L 213.14 446.181 L 213.14 482.239 L 213.181 482.28 L 216.14 482.28 L 216.14 503.239 L 216.181 503.28 L 248.239 503.28 L 248.28 503.239 Z"
       id="left_outsideCutPath"
       stroke="#FF0000"
       stroke-width="0.1"
       style="stroke:#FF0000;stroke-width:0.94500003;stroke-miterlimit:4;stroke-dasharray:none"
       vector-effect="non-scaling-stroke" />
    <path
       d="M 348.891 423.481 L 348.891 425.373 L 344.801 425.373 L 344.801 439.551 L 342.367 439.551 L 342.367 425.373 L 339.493 425.373 L 339.493 424.273 L 342.367 423.393 L 342.367 422.499 Q 342.367 417.385 346.224 416.686 A 7.398 7.398 0 0 1 347.542 416.575 A 7.838 7.838 0 0 1 348.651 416.66 Q 349.191 416.737 349.791 416.885 A 15.755 15.755 0 0 1 350.534 417.088 L 349.903 419.039 Q 348.495 418.584 347.498 418.584 A 3.282 3.282 0 0 0 346.707 418.673 A 2.108 2.108 0 0 0 345.46 419.5 A 2.816 2.816 0 0 0 345.088 420.251 Q 344.841 420.984 344.806 422.074 A 11.491 11.491 0 0 0 344.801 422.44 L 344.801 423.481 L 348.891 423.481 Z M 337.499 430.416 L 337.499 431.956 L 326.429 431.956 A 9.769 9.769 0 0 0 326.6 433.591 Q 326.926 435.244 327.859 436.252 A 4.423 4.423 0 0 0 330.181 437.56 A 6.701 6.701 0 0 0 331.678 437.718 A 12.855 12.855 0 0 0 336.492 436.764 A 14.731 14.731 0 0 0 336.81 436.633 L 336.81 438.803 A 14.612 14.612 0 0 1 335.478 439.306 A 11.174 11.174 0 0 1 334.369 439.602 A 10.217 10.217 0 0 1 333.355 439.759 Q 332.556 439.844 331.59 439.844 A 9.458 9.458 0 0 1 329.223 439.564 A 6.697 6.697 0 0 1 325.967 437.674 A 7.163 7.163 0 0 1 324.254 434.528 Q 323.956 433.412 323.914 432.087 A 13.903 13.903 0 0 1 323.907 431.648 Q 323.907 428.481 325.178 426.376 A 7.207 7.207 0 0 1 325.821 425.475 A 6.237 6.237 0 0 1 330.366 423.208 A 8.604 8.604 0 0 1 330.96 423.188 A 7.415 7.415 0 0 1 333.048 423.467 A 5.642 5.642 0 0 1 335.739 425.175 A 6.805 6.805 0 0 1 337.281 428.284 A 9.906 9.906 0 0 1 337.499 430.416 Z M 359.213 437.542 L 359.213 439.404 A 2.394 2.394 0 0 1 358.93 439.517 Q 358.627 439.617 358.193 439.695 A 9.102 9.102 0 0 1 358.048 439.719 Q 357.278 439.844 356.662 439.844 Q 352 439.844 352 434.932 L 352 425.373 L 349.698 425.373 L 349.698 424.2 L 352 423.188 L 353.026 419.757 L 354.434 419.757 L 354.434 423.481 L 359.096 423.481 L 359.096 425.373 L 354.434 425.373 L 354.434 434.83 A 4.901 4.901 0 0 0 354.504 435.69 Q 354.589 436.163 354.774 436.536 A 2.361 2.361 0 0 0 355.123 437.058 A 2.261 2.261 0 0 0 356.513 437.798 A 3.253 3.253 0 0 0 357.014 437.835 A 7.993 7.993 0 0 0 358.185 437.752 A 7.365 7.365 0 0 0 358.26 437.74 A 13.166 13.166 0 0 0 358.612 437.68 Q 358.948 437.617 359.181 437.551 A 3.656 3.656 0 0 0 359.213 437.542 Z M 319.64 416.737 L 319.64 439.551 L 317.207 439.551 L 317.207 416.737 L 319.64 416.737 Z M 326.488 429.976 L 334.889 429.976 A 8.294 8.294 0 0 0 334.789 428.643 Q 334.672 427.928 334.419 427.355 A 3.766 3.766 0 0 0 333.863 426.45 A 3.334 3.334 0 0 0 331.855 425.307 A 5.002 5.002 0 0 0 330.93 425.226 A 4.798 4.798 0 0 0 329.544 425.416 A 3.707 3.707 0 0 0 327.844 426.487 Q 326.803 427.628 326.535 429.561 A 9.195 9.195 0 0 0 326.488 429.976 Z"
       id="left_labelLayer"
       stroke="#777777"
       fill="#777777"
       style="stroke:#777777;fill:#777777;stroke-width:0.94500003;stroke-miterlimit:4;stroke-dasharray:none"
       vector-effect="non-scaling-stroke" />
    <path
       d="M 553.42 503.239 L 553.42 500.28 L 589.28 500.28 L 589.28 503.239 L 589.321 503.28 L 625.379 503.28 L 625.42 503.239 L 625.42 500.28 L 673.379 500.28 L 673.42 500.239 L 673.42 468.28 L 676.379 468.28 L 676.42 468.239 L 676.42 432.181 L 676.379 432.14 L 673.42 432.14 L 673.42 396.28 L 676.379 396.28 L 676.42 396.239 L 676.42 360.181 L 676.379 360.14 L 673.42 360.14 L 673.42 324.28 L 676.379 324.28 L 676.42 324.239 L 676.42 288.181 L 676.379 288.14 L 673.42 288.14 L 673.42 256.181 L 673.379 256.14 L 625.42 256.14 L 625.42 253.181 L 625.379 253.14 L 589.321 253.14 L 589.28 253.181 L 589.28 256.14 L 553.42 256.14 L 553.42 253.181 L 553.379 253.14 L 517.321 253.14 L 517.28 253.181 L 517.28 256.14 L 469.321 256.14 L 469.28 256.181 L 469.28 288.14 L 466.321 288.14 L 466.28 288.181 L 466.28 324.239 L 466.321 324.28 L 469.28 324.28 L 469.28 360.14 L 466.321 360.14 L 466.28 360.181 L 466.28 396.239 L 466.321 396.28 L 469.28 396.28 L 469.28 432.14 L 466.321 432.14 L 466.28 432.181 L 466.28 468.239 L 466.321 468.28 L 469.28 468.28 L 469.28 500.239 L 469.321 500.28 L 517.28 500.28 L 517.28 503.239 L 517.321 503.28 L 553.379 503.28 L 553.42 503.239 Z"
       id="top_outsideCutPath"
       stroke="#FF0000"
       stroke-width="0.1"
       style="stroke:#FF0000;stroke-width:0.94500003;stroke-miterlimit:4;stroke-dasharray:none"
       vector-effect="non-scaling-stroke" />
    <path
       d="M 586.454 384.12 L 586.207 384.12 A 32.239 32.239 0 0 1 586.419 386.503 A 27.015 27.015 0 0 1 586.454 387.855 L 586.454 397.11 L 583.047 397.11 L 583.047 364.522 L 585.817 364.522 L 586.289 367.6 L 586.454 367.6 A 9.17 9.17 0 0 1 587.78 366.094 A 7.091 7.091 0 0 1 589.511 364.933 A 8.531 8.531 0 0 1 591.957 364.218 A 11.042 11.042 0 0 1 593.513 364.112 A 10.442 10.442 0 0 1 596.463 364.506 A 7.718 7.718 0 0 1 600.419 367.169 A 10.229 10.229 0 0 1 602.164 370.577 Q 602.614 372.046 602.769 373.813 A 22.183 22.183 0 0 1 602.85 375.747 A 19.973 19.973 0 0 1 602.586 379.108 Q 602.041 382.292 600.377 384.356 A 8.065 8.065 0 0 1 594.646 387.37 A 11.554 11.554 0 0 1 593.513 387.424 A 10.333 10.333 0 0 1 590.917 387.108 A 8.991 8.991 0 0 1 589.501 386.614 A 7.545 7.545 0 0 1 586.454 384.12 Z M 553.168 384.202 L 553.168 386.809 Q 552.667 387.049 551.74 387.215 A 12.74 12.74 0 0 1 551.536 387.25 A 14.765 14.765 0 0 1 550.574 387.375 Q 550.12 387.418 549.712 387.423 A 8.732 8.732 0 0 1 549.597 387.424 A 8.897 8.897 0 0 1 546.975 387.071 Q 544.093 386.182 543.339 383.051 A 10.708 10.708 0 0 1 543.071 380.549 L 543.071 367.169 L 539.849 367.169 L 539.849 365.528 L 543.071 364.112 L 544.508 359.31 L 546.478 359.31 L 546.478 364.522 L 553.004 364.522 L 553.004 367.169 L 546.478 367.169 L 546.478 380.406 A 6.86 6.86 0 0 0 546.577 381.61 Q 546.695 382.272 546.954 382.795 A 3.304 3.304 0 0 0 547.442 383.525 A 3.165 3.165 0 0 0 549.388 384.561 A 4.553 4.553 0 0 0 550.09 384.613 Q 550.993 384.613 551.834 384.479 Q 552.637 384.352 553.122 384.215 A 5.11 5.11 0 0 0 553.168 384.202 Z M 576.763 379.17 A 17.596 17.596 0 0 0 577.075 375.747 A 19.993 19.993 0 0 0 577.068 375.207 Q 577.017 373.334 576.612 371.744 A 10.607 10.607 0 0 0 574.295 367.252 A 8.918 8.918 0 0 0 570.155 364.581 A 11.447 11.447 0 0 0 566.794 364.112 A 13.231 13.231 0 0 0 564.418 364.316 A 9.011 9.011 0 0 0 559.16 367.18 A 9.411 9.411 0 0 0 558.004 368.783 Q 557.114 370.335 556.721 372.327 A 17.688 17.688 0 0 0 556.41 375.747 A 17.042 17.042 0 0 0 556.624 378.508 A 12.602 12.602 0 0 0 557.683 381.945 A 11.196 11.196 0 0 0 557.93 382.43 A 9.222 9.222 0 0 0 561.294 386.008 A 9.485 9.485 0 0 0 563.472 386.976 A 10.939 10.939 0 0 0 566.65 387.424 Q 571.535 387.424 574.305 384.336 Q 576.145 382.285 576.763 379.17 Z M 559.94 375.747 A 17.251 17.251 0 0 0 560.104 378.212 Q 560.285 379.463 560.666 380.476 A 7.147 7.147 0 0 0 561.664 382.314 A 5.583 5.583 0 0 0 565.3 384.456 A 8.461 8.461 0 0 0 566.732 384.572 A 7.913 7.913 0 0 0 568.82 384.312 A 5.507 5.507 0 0 0 571.812 382.325 A 7.313 7.313 0 0 0 572.95 380.107 Q 573.546 378.285 573.546 375.747 Q 573.546 371.458 571.812 369.232 A 5.604 5.604 0 0 0 568.328 367.153 A 8.592 8.592 0 0 0 566.691 367.005 A 8.107 8.107 0 0 0 564.673 367.242 A 5.426 5.426 0 0 0 561.643 369.201 Q 559.94 371.397 559.94 375.747 Z M 586.454 374.988 L 586.454 375.747 Q 586.454 379.774 587.594 381.854 A 5.138 5.138 0 0 0 588.034 382.53 A 4.942 4.942 0 0 0 590.541 384.222 Q 591.658 384.572 593.103 384.572 A 5.74 5.74 0 0 0 595.334 384.153 Q 596.621 383.615 597.54 382.39 A 6.788 6.788 0 0 0 597.669 382.212 Q 599.321 379.852 599.321 375.706 A 17.191 17.191 0 0 0 599.159 373.268 Q 598.982 372.033 598.609 371.029 A 7.222 7.222 0 0 0 597.669 369.252 A 5.299 5.299 0 0 0 593.793 367.045 A 7.329 7.329 0 0 0 593.021 367.005 Q 589.573 367.005 588.034 368.914 Q 586.495 370.822 586.454 374.988 Z"
       id="top_labelLayer"
       stroke="#777777"
       fill="#777777"
       style="stroke:#777777;fill:#777777;stroke-width:0.94500003;stroke-miterlimit:4;stroke-dasharray:none"
       vector-effect="non-scaling-stroke" />
    <path
       d="M 51.14 350.099 L 51.14 347.14 L 87 347.14 L 87 350.099 L 87.041 350.14 L 123.099 350.14 L 123.14 350.099 L 123.14 347.14 L 159 347.14 L 159 350.099 L 159.041 350.14 L 210.099 350.14 L 210.14 350.099 L 210.14 329.041 L 210.099 329 L 207.14 329 L 207.14 293.14 L 210.099 293.14 L 210.14 293.099 L 210.14 257.041 L 210.099 257 L 207.14 257 L 207.14 221.14 L 210.099 221.14 L 210.14 221.099 L 210.14 200.041 L 210.099 200 L 159.041 200 L 159 200.041 L 159 203 L 123.14 203 L 123.14 200.041 L 123.099 200 L 87.041 200 L 87 200.041 L 87 203 L 51.14 203 L 51.14 200.041 L 51.099 200 L 0.041 200 L 0 200.041 L 0 221.099 L 0.041 221.14 L 3 221.14 L 3 257 L 0.041 257 L 0 257.041 L 0 293.099 L 0.041 293.14 L 3 293.14 L 3 329 L 0.041 329 L 0 329.041 L 0 350.099 L 0.041 350.14 L 51.099 350.14 L 51.14 350.099 Z"
       id="back_outsideCutPath"
       stroke="#FF0000"
       stroke-width="0.1"
       style="stroke:#FF0000;stroke-width:0.94500003;stroke-miterlimit:4;stroke-dasharray:none"
       vector-effect="non-scaling-stroke" />
    <path
       d="M 125.626 278.105 L 125.744 278.105 A 14.408 14.408 0 0 1 126.1 277.623 Q 126.51 277.09 127.096 276.409 A 52.296 52.296 0 0 1 127.664 275.759 L 132.855 270.261 L 135.743 270.261 L 129.233 277.108 L 136.198 286.33 L 133.251 286.33 L 127.576 278.735 L 125.744 280.319 L 125.744 286.33 L 123.339 286.33 L 123.339 263.516 L 125.744 263.516 L 125.744 275.612 Q 125.744 276.419 125.626 278.105 Z M 76.376 284.263 L 76.2 284.263 L 75.687 286.33 L 73.942 286.33 L 73.942 263.516 L 76.376 263.516 L 76.376 269.058 Q 76.376 270.86 76.266 272.305 A 30.423 30.423 0 0 1 76.259 272.401 L 76.376 272.401 A 5.534 5.534 0 0 1 80.415 270.055 A 8.313 8.313 0 0 1 81.42 269.997 A 7.439 7.439 0 0 1 83.514 270.276 A 5.569 5.569 0 0 1 86.339 272.159 A 7.172 7.172 0 0 1 87.597 274.582 Q 88.091 276.178 88.091 278.281 Q 88.091 282.24 86.324 284.432 A 5.762 5.762 0 0 1 82.229 286.585 A 8.255 8.255 0 0 1 81.42 286.624 A 7.383 7.383 0 0 1 79.565 286.397 A 6.424 6.424 0 0 1 78.554 286.044 Q 77.256 285.465 76.376 284.263 Z M 104.029 286.33 L 102.226 286.33 L 101.742 284.043 L 101.624 284.043 A 10.09 10.09 0 0 1 100.808 284.957 Q 100.016 285.735 99.227 286.088 Q 98.032 286.624 96.243 286.624 A 7.469 7.469 0 0 1 94.723 286.478 Q 93.795 286.285 93.081 285.835 A 4.191 4.191 0 0 1 92.497 285.392 A 4.001 4.001 0 0 1 91.291 283.282 A 6.124 6.124 0 0 1 91.141 281.888 A 4.211 4.211 0 0 1 93.536 277.913 Q 95.32 276.964 98.432 276.805 A 23.774 23.774 0 0 1 98.927 276.785 L 101.654 276.697 L 101.654 275.7 Q 101.654 274.544 101.35 273.758 A 2.716 2.716 0 0 0 100.84 272.907 Q 100.026 272.005 98.237 272.005 Q 96.623 272.005 94.666 272.802 A 16.3 16.3 0 0 0 93.692 273.237 L 92.944 271.375 A 11.222 11.222 0 0 1 95.11 270.485 A 12.774 12.774 0 0 1 95.547 270.363 A 11.272 11.272 0 0 1 98.384 269.997 Q 101.258 269.997 102.643 271.272 Q 104.029 272.548 104.029 275.363 L 104.029 286.33 Z M 119.761 270.803 L 119.014 272.871 A 10.828 10.828 0 0 0 117.839 272.48 A 12.932 12.932 0 0 0 117.254 272.335 Q 116.301 272.123 115.568 272.123 Q 110.671 272.123 110.671 278.369 Q 110.671 281.331 111.866 282.914 A 3.866 3.866 0 0 0 114.37 284.411 A 5.888 5.888 0 0 0 115.407 284.498 A 10.189 10.189 0 0 0 118.217 284.089 A 12.58 12.58 0 0 0 119.527 283.633 L 119.527 285.788 A 6.923 6.923 0 0 1 117.833 286.387 Q 116.767 286.624 115.465 286.624 A 9.096 9.096 0 0 1 113.253 286.37 A 6.168 6.168 0 0 1 110.062 284.476 A 7.04 7.04 0 0 1 108.598 281.787 Q 108.149 280.301 108.149 278.398 A 13.429 13.429 0 0 1 108.357 275.956 Q 108.609 274.594 109.167 273.52 A 6.71 6.71 0 0 1 110.092 272.167 A 6.302 6.302 0 0 1 113.543 270.182 A 9.554 9.554 0 0 1 115.627 269.967 A 10.984 10.984 0 0 1 117.943 270.217 A 12.148 12.148 0 0 1 118.619 270.381 Q 119.297 270.568 119.747 270.796 A 3.629 3.629 0 0 1 119.761 270.803 Z M 81.068 272.035 A 6.839 6.839 0 0 0 79.744 272.154 Q 78.258 272.448 77.476 273.464 Q 76.376 274.894 76.376 278.281 A 16.093 16.093 0 0 0 76.456 279.944 Q 76.676 282.055 77.505 283.127 Q 78.634 284.586 81.127 284.586 A 4.852 4.852 0 0 0 82.505 284.401 A 3.5 3.5 0 0 0 84.47 282.951 Q 85.569 281.316 85.569 278.252 A 14.38 14.38 0 0 0 85.482 276.613 Q 85.276 274.821 84.581 273.739 A 4.038 4.038 0 0 0 84.47 273.574 A 3.549 3.549 0 0 0 82.21 272.144 A 5.629 5.629 0 0 0 81.068 272.035 Z M 101.595 279.879 L 101.595 278.427 L 99.161 278.53 A 17.871 17.871 0 0 0 97.733 278.634 Q 96.325 278.798 95.442 279.187 A 3.738 3.738 0 0 0 94.975 279.432 A 2.597 2.597 0 0 0 93.737 281.316 A 3.844 3.844 0 0 0 93.692 281.917 A 3.478 3.478 0 0 0 93.778 282.715 Q 93.923 283.328 94.31 283.75 A 2.168 2.168 0 0 0 94.491 283.926 A 2.649 2.649 0 0 0 95.484 284.453 Q 96.031 284.615 96.727 284.615 A 6.701 6.701 0 0 0 98.174 284.468 Q 99.183 284.245 99.927 283.684 A 4.064 4.064 0 0 0 100.297 283.369 A 4.076 4.076 0 0 0 101.435 281.333 Q 101.593 280.678 101.595 279.904 A 7.719 7.719 0 0 0 101.595 279.879 Z"
       id="back_labelLayer"
       stroke="#777777"
       fill="#777777"
       style="stroke:#777777;fill:#777777;stroke-width:0.94500003;stroke-miterlimit:4;stroke-dasharray:none"
       vector-effect="non-scaling-stroke" />
    <path
       d="M 248.28 350.099 L 248.28 347.14 L 284.14 347.14 L 284.14 350.099 L 284.181 350.14 L 320.239 350.14 L 320.28 350.099 L 320.28 347.14 L 356.14 347.14 L 356.14 350.099 L 356.181 350.14 L 392.239 350.14 L 392.28 350.099 L 392.28 347.14 L 428.14 347.14 L 428.14 350.099 L 428.181 350.14 L 460.239 350.14 L 460.28 350.099 L 460.28 329.14 L 463.239 329.14 L 463.28 329.099 L 463.28 293.041 L 463.239 293 L 460.28 293 L 460.28 257.14 L 463.239 257.14 L 463.28 257.099 L 463.28 221.041 L 463.239 221 L 460.28 221 L 460.28 200.041 L 460.239 200 L 428.181 200 L 428.14 200.041 L 428.14 203 L 392.28 203 L 392.28 200.041 L 392.239 200 L 356.181 200 L 356.14 200.041 L 356.14 203 L 320.28 203 L 320.28 200.041 L 320.239 200 L 284.181 200 L 284.14 200.041 L 284.14 203 L 248.28 203 L 248.28 200.041 L 248.239 200 L 216.181 200 L 216.14 200.041 L 216.14 221 L 213.181 221 L 213.14 221.041 L 213.14 257.099 L 213.181 257.14 L 216.14 257.14 L 216.14 293 L 213.181 293 L 213.14 293.041 L 213.14 329.099 L 213.181 329.14 L 216.14 329.14 L 216.14 350.099 L 216.181 350.14 L 248.239 350.14 L 248.28 350.099 Z"
       id="right_outsideCutPath"
       stroke="#FF0000"
       stroke-width="0.1"
       style="stroke:#FF0000;stroke-width:0.94500003;stroke-miterlimit:4;stroke-dasharray:none"
       vector-effect="non-scaling-stroke" />
    <path
       d="M 356.882 282.87 L 354.448 282.87 L 354.448 272.475 A 6.88 6.88 0 0 0 354.369 271.396 Q 354.183 270.223 353.554 269.542 Q 352.83 268.759 351.443 268.61 A 6.452 6.452 0 0 0 350.753 268.575 A 7.365 7.365 0 0 0 349.377 268.694 Q 348.613 268.84 348.025 269.162 A 3.408 3.408 0 0 0 347.051 269.953 A 4.05 4.05 0 0 0 346.364 271.171 Q 345.95 272.286 345.894 273.944 A 15.708 15.708 0 0 0 345.886 274.469 L 345.886 282.87 L 343.452 282.87 L 343.452 260.056 L 345.886 260.056 L 345.886 266.962 A 21.894 21.894 0 0 1 345.87 267.803 Q 345.855 268.197 345.825 268.535 A 9.521 9.521 0 0 1 345.768 269.029 L 345.915 269.029 A 4.863 4.863 0 0 1 347.619 267.39 A 5.941 5.941 0 0 1 347.96 267.204 A 6.248 6.248 0 0 1 350.011 266.595 A 7.899 7.899 0 0 1 350.988 266.537 Q 353.935 266.537 355.409 267.937 Q 356.553 269.024 356.809 271.107 A 10.525 10.525 0 0 1 356.882 272.387 L 356.882 282.87 Z M 334.596 266.8 L 340.153 266.8 L 340.153 268.34 L 337.176 268.692 A 3.955 3.955 0 0 1 337.519 269.201 Q 337.728 269.567 337.909 270.033 A 4.683 4.683 0 0 1 338.187 271.152 A 6.013 6.013 0 0 1 338.232 271.903 Q 338.232 274.263 336.619 275.671 Q 335.166 276.939 332.737 277.065 A 10.571 10.571 0 0 1 332.191 277.079 A 7.822 7.822 0 0 1 331.286 277.028 A 6.605 6.605 0 0 1 330.842 276.961 A 4.331 4.331 0 0 0 330.144 277.413 Q 329.783 277.704 329.574 278.037 A 1.831 1.831 0 0 0 329.288 279.029 A 1.261 1.261 0 0 0 329.352 279.442 Q 329.475 279.797 329.831 280.004 A 1.707 1.707 0 0 0 330.209 280.16 Q 330.755 280.319 331.693 280.319 L 334.537 280.319 A 9.963 9.963 0 0 1 336.05 280.426 Q 337.585 280.663 338.547 281.419 A 3.561 3.561 0 0 1 339.871 283.687 A 5.348 5.348 0 0 1 339.947 284.615 Q 339.947 287.231 337.89 288.628 A 5.785 5.785 0 0 1 337.807 288.684 A 7.299 7.299 0 0 1 335.925 289.537 Q 334.998 289.819 333.866 289.956 A 19.291 19.291 0 0 1 331.561 290.084 A 13.637 13.637 0 0 1 329.732 289.969 Q 328.803 289.843 328.045 289.579 A 5.656 5.656 0 0 1 326.7 288.911 A 3.879 3.879 0 0 1 325.45 287.554 Q 324.992 286.705 324.992 285.597 Q 324.992 284.131 325.93 283.061 A 4.25 4.25 0 0 1 327.39 281.997 A 6.024 6.024 0 0 1 328.57 281.609 A 2.526 2.526 0 0 1 327.589 280.816 A 2.999 2.999 0 0 1 327.536 280.744 A 2.256 2.256 0 0 1 327.122 279.525 A 2.795 2.795 0 0 1 327.118 279.381 A 2.783 2.783 0 0 1 327.258 278.484 A 2.467 2.467 0 0 1 327.587 277.841 Q 328.056 277.181 329.068 276.565 A 4.267 4.267 0 0 1 327.215 275.081 A 5.289 5.289 0 0 1 327.037 274.821 A 5.031 5.031 0 0 1 326.265 272.396 A 6.141 6.141 0 0 1 326.253 272.006 A 7.032 7.032 0 0 1 326.438 270.343 A 4.627 4.627 0 0 1 327.837 267.937 Q 329.204 266.702 331.557 266.534 A 10.75 10.75 0 0 1 332.323 266.507 Q 333.584 266.507 334.596 266.8 Z M 369.272 280.861 L 369.272 282.724 A 2.394 2.394 0 0 1 368.988 282.836 Q 368.685 282.937 368.251 283.014 A 9.102 9.102 0 0 1 368.106 283.039 Q 367.336 283.163 366.72 283.163 Q 362.058 283.163 362.058 278.252 L 362.058 268.692 L 359.756 268.692 L 359.756 267.519 L 362.058 266.507 L 363.084 263.076 L 364.492 263.076 L 364.492 266.8 L 369.154 266.8 L 369.154 268.692 L 364.492 268.692 L 364.492 278.149 A 4.901 4.901 0 0 0 364.563 279.01 Q 364.647 279.482 364.832 279.856 A 2.361 2.361 0 0 0 365.181 280.378 A 2.261 2.261 0 0 0 366.571 281.118 A 3.253 3.253 0 0 0 367.072 281.155 A 7.993 7.993 0 0 0 368.243 281.071 A 7.365 7.365 0 0 0 368.319 281.059 A 13.166 13.166 0 0 0 368.67 280.999 Q 369.006 280.936 369.239 280.871 A 3.656 3.656 0 0 0 369.272 280.861 Z M 316.4 266.683 L 316.063 268.941 Q 315.232 268.758 314.565 268.727 A 5.709 5.709 0 0 0 314.303 268.721 A 4.217 4.217 0 0 0 311.188 270.067 A 5.77 5.77 0 0 0 310.968 270.305 A 5.558 5.558 0 0 0 309.627 273.426 A 7.388 7.388 0 0 0 309.582 274.249 L 309.582 282.87 L 307.148 282.87 L 307.148 266.8 L 309.157 266.8 L 309.436 269.777 L 309.553 269.777 A 8.219 8.219 0 0 1 310.472 268.464 A 6.279 6.279 0 0 1 311.708 267.358 A 4.852 4.852 0 0 1 314.479 266.507 A 11.174 11.174 0 0 1 315.48 266.55 A 8.155 8.155 0 0 1 316.4 266.683 Z M 321.84 266.8 L 321.84 282.87 L 319.406 282.87 L 319.406 266.8 L 321.84 266.8 Z M 333.76 282.504 L 330.842 282.504 Q 329.629 282.504 328.809 282.928 A 2.851 2.851 0 0 0 328.262 283.295 Q 327.338 284.087 327.338 285.568 A 2.444 2.444 0 0 0 327.499 286.475 Q 327.731 287.059 328.294 287.453 A 2.856 2.856 0 0 0 328.438 287.547 Q 329.537 288.222 331.59 288.222 A 16.362 16.362 0 0 0 333.188 288.149 Q 334.79 287.992 335.795 287.491 A 4.042 4.042 0 0 0 336.128 287.305 A 3.55 3.55 0 0 0 336.952 286.616 A 2.661 2.661 0 0 0 337.602 284.82 Q 337.602 284.012 337.292 283.51 A 1.534 1.534 0 0 0 336.795 283.009 A 2.309 2.309 0 0 0 336.248 282.771 Q 335.664 282.591 334.742 282.532 A 15.487 15.487 0 0 0 333.76 282.504 Z M 328.658 271.947 A 4.751 4.751 0 0 0 328.755 272.943 Q 328.888 273.561 329.2 274.024 A 2.604 2.604 0 0 0 329.611 274.498 A 3.146 3.146 0 0 0 330.877 275.186 Q 331.359 275.324 331.935 275.355 A 6.267 6.267 0 0 0 332.265 275.363 A 5.302 5.302 0 0 0 333.653 275.198 Q 335.241 274.766 335.669 273.207 A 4.93 4.93 0 0 0 335.827 271.903 A 5.233 5.233 0 0 0 335.649 270.47 Q 335.19 268.863 333.556 268.436 A 5.294 5.294 0 0 0 332.221 268.281 A 5.107 5.107 0 0 0 331.18 268.381 Q 330.542 268.514 330.056 268.824 A 2.801 2.801 0 0 0 329.581 269.205 A 2.921 2.921 0 0 0 328.874 270.395 Q 328.725 270.857 328.679 271.417 A 6.403 6.403 0 0 0 328.658 271.947 Z M 319.201 262.446 Q 319.201 261.61 319.611 261.222 A 1.407 1.407 0 0 1 320.514 260.837 A 1.858 1.858 0 0 1 320.637 260.833 Q 321.224 260.833 321.649 261.229 Q 322.074 261.625 322.074 262.446 Q 322.074 263.267 321.649 263.67 Q 321.224 264.073 320.637 264.073 A 1.546 1.546 0 0 1 320.105 263.985 A 1.366 1.366 0 0 1 319.611 263.67 A 1.257 1.257 0 0 1 319.305 263.167 Q 319.237 262.967 319.213 262.721 A 2.874 2.874 0 0 1 319.201 262.446 Z"
       id="right_labelLayer"
       stroke="#777777"
       fill="#777777"
       style="stroke:#777777;fill:#777777;stroke-width:0.94500003;stroke-miterlimit:4;stroke-dasharray:none"
       vector-effect="non-scaling-stroke" />
    <path
       d="M 553.42 250.099 L 553.42 247.14 L 589.28 247.14 L 589.28 250.099 L 589.321 250.14 L 625.379 250.14 L 625.42 250.099 L 625.42 247.14 L 673.379 247.14 L 673.42 247.099 L 673.42 215.14 L 676.379 215.14 L 676.42 215.099 L 676.42 179.041 L 676.379 179 L 673.42 179 L 673.42 143.14 L 676.379 143.14 L 676.42 143.099 L 676.42 107.041 L 676.379 107 L 673.42 107 L 673.42 71.14 L 676.379 71.14 L 676.42 71.099 L 676.42 35.041 L 676.379 35 L 673.42 35 L 673.42 3.041 L 673.379 3 L 625.42 3 L 625.42 0.041 L 625.379 0 L 589.321 0 L 589.28 0.041 L 589.28 3 L 553.42 3 L 553.42 0.041 L 553.379 0 L 517.321 0 L 517.28 0.041 L 517.28 3 L 469.321 3 L 469.28 3.041 L 469.28 35 L 466.321 35 L 466.28 35.041 L 466.28 71.099 L 466.321 71.14 L 469.28 71.14 L 469.28 107 L 466.321 107 L 466.28 107.041 L 466.28 143.099 L 466.321 143.14 L 469.28 143.14 L 469.28 179 L 466.321 179 L 466.28 179.041 L 466.28 215.099 L 466.321 215.14 L 469.28 215.14 L 469.28 247.099 L 469.321 247.14 L 517.28 247.14 L 517.28 250.099 L 517.321 250.14 L 553.379 250.14 L 553.42 250.099 Z"
       id="bottom_outsideCutPath"
       stroke="#FF0000"
       stroke-width="0.1"
       style="stroke:#FF0000;stroke-width:0.94500003;stroke-miterlimit:4;stroke-dasharray:none"
       vector-effect="non-scaling-stroke" />
    <path
       d="M 640.487 140.83 L 637.08 140.83 L 637.08 126.198 A 10.05 10.05 0 0 0 636.979 124.72 Q 636.866 123.966 636.629 123.357 A 4.117 4.117 0 0 0 635.931 122.166 Q 634.782 120.822 632.36 120.822 A 8.766 8.766 0 0 0 630.576 120.991 Q 628.717 121.378 627.661 122.648 A 5.629 5.629 0 0 0 626.706 124.375 Q 626.147 125.945 626.142 128.236 A 18.857 18.857 0 0 0 626.142 128.271 L 626.142 140.83 L 622.736 140.83 L 622.736 126.198 A 10.05 10.05 0 0 0 622.634 124.72 Q 622.522 123.966 622.285 123.357 A 4.117 4.117 0 0 0 621.586 122.166 A 3.573 3.573 0 0 0 619.943 121.098 Q 619.351 120.903 618.629 120.846 A 7.977 7.977 0 0 0 617.995 120.822 Q 615.761 120.822 614.361 121.756 A 4.465 4.465 0 0 0 613.306 122.74 A 5.713 5.713 0 0 0 612.459 124.349 Q 611.91 125.903 611.831 128.232 A 23.718 23.718 0 0 0 611.818 129.03 L 611.818 140.83 L 608.412 140.83 L 608.412 118.338 L 611.182 118.338 L 611.736 121.417 L 611.9 121.417 A 6.695 6.695 0 0 1 614.619 118.851 A 8.088 8.088 0 0 1 617.814 117.955 A 9.768 9.768 0 0 1 618.549 117.928 A 11.153 11.153 0 0 1 621.06 118.189 Q 622.604 118.547 623.681 119.392 A 5.816 5.816 0 0 1 625.445 121.745 L 625.609 121.745 A 7.113 7.113 0 0 1 628.288 119.085 A 8.545 8.545 0 0 1 628.523 118.954 Q 630.431 117.928 632.873 117.928 A 11.841 11.841 0 0 1 635.021 118.11 Q 637.269 118.525 638.589 119.888 A 5.866 5.866 0 0 1 639.848 121.948 Q 640.187 122.856 640.346 123.987 A 15.625 15.625 0 0 1 640.487 126.157 L 640.487 140.83 Z M 505.62 137.936 L 505.373 137.936 L 504.655 140.83 L 502.213 140.83 L 502.213 108.899 L 505.62 108.899 L 505.62 116.656 A 71.024 71.024 0 0 1 505.581 119.055 Q 505.543 120.19 505.466 121.2 A 42.544 42.544 0 0 1 505.455 121.335 L 505.62 121.335 A 7.745 7.745 0 0 1 511.273 118.051 A 11.635 11.635 0 0 1 512.679 117.969 A 10.412 10.412 0 0 1 515.609 118.36 A 7.794 7.794 0 0 1 519.564 120.996 Q 521.528 123.42 521.919 127.456 A 21.866 21.866 0 0 1 522.016 129.564 A 19.973 19.973 0 0 1 521.752 132.924 Q 521.207 136.108 519.543 138.172 A 8.065 8.065 0 0 1 513.812 141.186 A 11.554 11.554 0 0 1 512.679 141.24 A 10.333 10.333 0 0 1 510.083 140.924 A 8.991 8.991 0 0 1 508.667 140.43 A 7.545 7.545 0 0 1 505.62 137.936 Z M 563.695 138.019 L 563.695 140.625 Q 563.195 140.866 562.267 141.031 A 12.74 12.74 0 0 1 562.064 141.066 A 14.765 14.765 0 0 1 561.101 141.191 Q 560.647 141.234 560.24 141.24 A 8.732 8.732 0 0 1 560.125 141.24 A 8.897 8.897 0 0 1 557.503 140.888 Q 554.621 139.998 553.866 136.867 A 10.708 10.708 0 0 1 553.599 134.366 L 553.599 120.986 L 550.377 120.986 L 550.377 119.344 L 553.599 117.928 L 555.035 113.126 L 557.005 113.126 L 557.005 118.338 L 563.531 118.338 L 563.531 120.986 L 557.005 120.986 L 557.005 134.222 A 6.86 6.86 0 0 0 557.104 135.427 Q 557.222 136.088 557.482 136.611 A 3.304 3.304 0 0 0 557.97 137.341 A 3.165 3.165 0 0 0 559.915 138.377 A 4.553 4.553 0 0 0 560.617 138.429 Q 561.52 138.429 562.361 138.296 Q 563.164 138.168 563.65 138.032 A 5.11 5.11 0 0 0 563.695 138.019 Z M 578.532 138.019 L 578.532 140.625 Q 578.032 140.866 577.104 141.031 A 12.74 12.74 0 0 1 576.901 141.066 A 14.765 14.765 0 0 1 575.938 141.191 Q 575.484 141.234 575.077 141.24 A 8.732 8.732 0 0 1 574.962 141.24 A 8.897 8.897 0 0 1 572.34 140.888 Q 569.458 139.998 568.703 136.867 A 10.708 10.708 0 0 1 568.436 134.366 L 568.436 120.986 L 565.214 120.986 L 565.214 119.344 L 568.436 117.928 L 569.872 113.126 L 571.842 113.126 L 571.842 118.338 L 578.368 118.338 L 578.368 120.986 L 571.842 120.986 L 571.842 134.222 A 6.86 6.86 0 0 0 571.941 135.427 Q 572.059 136.088 572.319 136.611 A 3.304 3.304 0 0 0 572.807 137.341 A 3.165 3.165 0 0 0 574.752 138.377 A 4.553 4.553 0 0 0 575.454 138.429 Q 576.357 138.429 577.199 138.296 Q 578.001 138.168 578.487 138.032 A 5.11 5.11 0 0 0 578.532 138.019 Z M 547.068 132.987 A 17.596 17.596 0 0 0 547.381 129.564 A 19.993 19.993 0 0 0 547.374 129.023 Q 547.323 127.15 546.917 125.56 A 10.607 10.607 0 0 0 544.6 121.068 A 8.918 8.918 0 0 0 540.46 118.398 A 11.447 11.447 0 0 0 537.1 117.928 A 13.231 13.231 0 0 0 534.723 118.132 A 9.011 9.011 0 0 0 529.466 120.996 A 9.411 9.411 0 0 0 528.31 122.599 Q 527.419 124.151 527.026 126.143 A 17.688 17.688 0 0 0 526.716 129.564 A 17.042 17.042 0 0 0 526.93 132.324 A 12.602 12.602 0 0 0 527.988 135.761 A 11.196 11.196 0 0 0 528.236 136.247 A 9.222 9.222 0 0 0 531.6 139.824 A 9.485 9.485 0 0 0 533.777 140.793 A 10.939 10.939 0 0 0 536.956 141.24 Q 541.84 141.24 544.61 138.152 Q 546.45 136.101 547.068 132.987 Z M 602.127 132.987 A 17.596 17.596 0 0 0 602.44 129.564 A 19.993 19.993 0 0 0 602.433 129.023 Q 602.382 127.15 601.977 125.56 A 10.607 10.607 0 0 0 599.659 121.068 A 8.918 8.918 0 0 0 595.519 118.398 A 11.447 11.447 0 0 0 592.159 117.928 A 13.231 13.231 0 0 0 589.782 118.132 A 9.011 9.011 0 0 0 584.525 120.996 A 9.411 9.411 0 0 0 583.369 122.599 Q 582.478 124.151 582.085 126.143 A 17.688 17.688 0 0 0 581.775 129.564 A 17.042 17.042 0 0 0 581.989 132.324 A 12.602 12.602 0 0 0 583.047 135.761 A 11.196 11.196 0 0 0 583.295 136.247 A 9.222 9.222 0 0 0 586.659 139.824 A 9.485 9.485 0 0 0 588.836 140.793 A 10.939 10.939 0 0 0 592.015 141.24 Q 596.899 141.24 599.67 138.152 Q 601.509 136.101 602.127 132.987 Z M 530.245 129.564 A 17.251 17.251 0 0 0 530.41 132.028 Q 530.591 133.279 530.971 134.292 A 7.147 7.147 0 0 0 531.969 136.131 A 5.583 5.583 0 0 0 535.605 138.272 A 8.461 8.461 0 0 0 537.038 138.388 A 7.913 7.913 0 0 0 539.125 138.128 A 5.507 5.507 0 0 0 542.117 136.141 A 7.313 7.313 0 0 0 543.256 133.923 Q 543.851 132.101 543.851 129.564 Q 543.851 125.275 542.117 123.048 A 5.604 5.604 0 0 0 538.633 120.97 A 8.592 8.592 0 0 0 536.997 120.822 A 8.107 8.107 0 0 0 534.979 121.058 A 5.426 5.426 0 0 0 531.949 123.017 Q 530.245 125.213 530.245 129.564 Z M 585.305 129.564 A 17.251 17.251 0 0 0 585.469 132.028 Q 585.65 133.279 586.03 134.292 A 7.147 7.147 0 0 0 587.028 136.131 A 5.583 5.583 0 0 0 590.665 138.272 A 8.461 8.461 0 0 0 592.097 138.388 A 7.913 7.913 0 0 0 594.185 138.128 A 5.507 5.507 0 0 0 597.176 136.141 A 7.313 7.313 0 0 0 598.315 133.923 Q 598.91 132.101 598.91 129.564 Q 598.91 125.275 597.176 123.048 A 5.604 5.604 0 0 0 593.692 120.97 A 8.592 8.592 0 0 0 592.056 120.822 A 8.107 8.107 0 0 0 590.038 121.058 A 5.426 5.426 0 0 0 587.008 123.017 Q 585.305 125.213 585.305 129.564 Z M 508.475 121.667 A 4.53 4.53 0 0 0 507.159 122.822 A 5.831 5.831 0 0 0 506.314 124.43 Q 505.745 126.027 505.642 128.453 A 26.246 26.246 0 0 0 505.62 129.564 Q 505.62 133.59 506.76 135.67 A 5.138 5.138 0 0 0 507.2 136.346 A 4.942 4.942 0 0 0 509.707 138.038 Q 510.824 138.388 512.269 138.388 A 6.791 6.791 0 0 0 514.197 138.13 A 4.899 4.899 0 0 0 516.947 136.1 Q 518.047 134.465 518.361 131.81 A 19.519 19.519 0 0 0 518.487 129.523 Q 518.487 125.36 517.103 123.207 A 5.651 5.651 0 0 0 516.947 122.976 A 4.968 4.968 0 0 0 513.785 120.975 A 7.879 7.879 0 0 0 512.186 120.822 Q 509.919 120.822 508.475 121.667 Z"
       id="bottom_labelLayer"
       stroke="#777777"
       fill="#777777"
       style="stroke:#777777;fill:#777777;stroke-width:0.94500003;stroke-miterlimit:4;stroke-dasharray:none"
       vector-effect="non-scaling-stroke" />
  </g>
</svg>
