EESchema Schematic File Version 4
EELAYER 26 0
EELAYER END
$Descr A4 11693 8268
encoding utf-8
Sheet 1 1
Title "BHack Beacon"
Date "2018-10-12"
Rev "2"
Comp ""
Comment1 ""
Comment2 ""
Comment3 ""
Comment4 ""
$EndDescr
$Comp
L Device:Speaker LS1
U 1 1 5BBFFAD5
P 7450 2700
F 0 "LS1" H 7620 2696 50  0000 L CNN
F 1 "Speaker" H 7620 2605 50  0000 L CNN
F 2 "Local:pcb-speaker" H 7450 2500 50  0001 C CNN
F 3 "~" H 7440 2650 50  0001 C CNN
	1    7450 2700
	1    0    0    -1  
$EndComp
$Comp
L LED:WS2812B D1
U 1 1 5BBFFB83
P 4450 4350
F 0 "D1" H 4250 4600 50  0000 L CNN
F 1 "WS2812B" H 4500 4100 50  0000 L CNN
F 2 "LED_SMD:LED_WS2812B_PLCC4_5.0x5.0mm_P3.2mm" H 4500 4050 50  0001 L TNN
F 3 "https://cdn-shop.adafruit.com/datasheets/WS2812B.pdf" H 4550 3975 50  0001 L TNN
	1    4450 4350
	1    0    0    -1  
$EndComp
$Comp
L LED:WS2812B D2
U 1 1 5BC0021A
P 5150 4350
F 0 "D2" H 4950 4600 50  0000 L CNN
F 1 "WS2812B" H 5200 4100 50  0000 L CNN
F 2 "LED_SMD:LED_WS2812B_PLCC4_5.0x5.0mm_P3.2mm" H 5200 4050 50  0001 L TNN
F 3 "https://cdn-shop.adafruit.com/datasheets/WS2812B.pdf" H 5250 3975 50  0001 L TNN
	1    5150 4350
	1    0    0    -1  
$EndComp
$Comp
L LED:WS2812B D3
U 1 1 5BC0024E
P 5850 4350
F 0 "D3" H 5650 4600 50  0000 L CNN
F 1 "WS2812B" H 5900 4100 50  0000 L CNN
F 2 "LED_SMD:LED_WS2812B_PLCC4_5.0x5.0mm_P3.2mm" H 5900 4050 50  0001 L TNN
F 3 "https://cdn-shop.adafruit.com/datasheets/WS2812B.pdf" H 5950 3975 50  0001 L TNN
	1    5850 4350
	1    0    0    -1  
$EndComp
$Comp
L LED:WS2812B D4
U 1 1 5BC002DE
P 6550 4350
F 0 "D4" H 6350 4600 50  0000 L CNN
F 1 "WS2812B" H 6600 4100 50  0000 L CNN
F 2 "LED_SMD:LED_WS2812B_PLCC4_5.0x5.0mm_P3.2mm" H 6600 4050 50  0001 L TNN
F 3 "https://cdn-shop.adafruit.com/datasheets/WS2812B.pdf" H 6650 3975 50  0001 L TNN
	1    6550 4350
	1    0    0    -1  
$EndComp
$Comp
L power:+3.3V #PWR0101
U 1 1 5BC00399
P 4450 3850
F 0 "#PWR0101" H 4450 3700 50  0001 C CNN
F 1 "+3.3V" H 4465 4023 50  0000 C CNN
F 2 "" H 4450 3850 50  0001 C CNN
F 3 "" H 4450 3850 50  0001 C CNN
	1    4450 3850
	1    0    0    -1  
$EndComp
$Comp
L power:GNDREF #PWR0102
U 1 1 5BC00482
P 4450 4850
F 0 "#PWR0102" H 4450 4600 50  0001 C CNN
F 1 "GNDREF" H 4455 4677 50  0000 C CNN
F 2 "" H 4450 4850 50  0001 C CNN
F 3 "" H 4450 4850 50  0001 C CNN
	1    4450 4850
	1    0    0    -1  
$EndComp
Wire Wire Line
	4750 4350 4850 4350
Wire Wire Line
	5450 4350 5550 4350
Wire Wire Line
	6150 4350 6250 4350
Wire Wire Line
	4450 4850 4450 4750
Wire Wire Line
	4450 4750 5150 4750
Wire Wire Line
	6550 4750 6550 4650
Connection ~ 4450 4750
Wire Wire Line
	4450 4750 4450 4650
Wire Wire Line
	5150 4650 5150 4750
Connection ~ 5150 4750
Wire Wire Line
	5150 4750 5850 4750
Wire Wire Line
	5850 4650 5850 4750
Connection ~ 5850 4750
Wire Wire Line
	5850 4750 6550 4750
Wire Wire Line
	4450 3850 4450 3950
Wire Wire Line
	4450 3950 5150 3950
Wire Wire Line
	6550 3950 6550 4050
Connection ~ 4450 3950
Wire Wire Line
	4450 3950 4450 4050
Wire Wire Line
	5150 4050 5150 3950
Connection ~ 5150 3950
Wire Wire Line
	5150 3950 5850 3950
Wire Wire Line
	5850 4050 5850 3950
Connection ~ 5850 3950
Wire Wire Line
	5850 3950 6550 3950
Text Label 4150 4350 2    50   ~ 0
PXL
Wire Wire Line
	7150 2800 7250 2800
Wire Wire Line
	7250 2700 7150 2700
$Comp
L power:GNDREF #PWR0104
U 1 1 5BC01569
P 7150 2900
F 0 "#PWR0104" H 7150 2650 50  0001 C CNN
F 1 "GNDREF" H 7155 2727 50  0000 C CNN
F 2 "" H 7150 2900 50  0001 C CNN
F 3 "" H 7150 2900 50  0001 C CNN
	1    7150 2900
	1    0    0    -1  
$EndComp
Wire Wire Line
	7150 2800 7150 2900
$Comp
L power:GNDREF #PWR0105
U 1 1 5BC01BE2
P 4050 2900
F 0 "#PWR0105" H 4050 2650 50  0001 C CNN
F 1 "GNDREF" H 4055 2727 50  0000 C CNN
F 2 "" H 4050 2900 50  0001 C CNN
F 3 "" H 4050 2900 50  0001 C CNN
	1    4050 2900
	1    0    0    -1  
$EndComp
Wire Wire Line
	3450 2700 3550 2700
Wire Wire Line
	3950 2700 4050 2700
Wire Wire Line
	4050 2700 4050 2900
Text Label 6950 2700 2    50   ~ 0
SND
Text Label 3450 2700 2    50   ~ 0
BTN
$Comp
L power:+3.3V #PWR0106
U 1 1 5BC01788
P 6100 2450
F 0 "#PWR0106" H 6100 2300 50  0001 C CNN
F 1 "+3.3V" H 6115 2623 50  0000 C CNN
F 2 "" H 6100 2450 50  0001 C CNN
F 3 "" H 6100 2450 50  0001 C CNN
	1    6100 2450
	1    0    0    -1  
$EndComp
$Comp
L power:+5V #PWR0107
U 1 1 5BC017B7
P 4900 2450
F 0 "#PWR0107" H 4900 2300 50  0001 C CNN
F 1 "+5V" H 4915 2623 50  0000 C CNN
F 2 "" H 4900 2450 50  0001 C CNN
F 3 "" H 4900 2450 50  0001 C CNN
	1    4900 2450
	1    0    0    -1  
$EndComp
Wire Wire Line
	5000 2550 4900 2550
Wire Wire Line
	4900 2550 4900 2450
Wire Wire Line
	6000 2550 6100 2550
Wire Wire Line
	6100 2550 6100 2450
Text Label 6000 2950 0    50   ~ 0
SND
Text Label 6000 2750 0    50   ~ 0
PXL
Text Label 4800 2750 2    50   ~ 0
BTN
NoConn ~ 5000 3250
NoConn ~ 5000 3050
NoConn ~ 5000 2950
NoConn ~ 5000 2850
NoConn ~ 6000 2650
NoConn ~ 6000 3050
NoConn ~ 6000 2850
NoConn ~ 5000 3150
NoConn ~ 6000 3150
NoConn ~ 6000 3250
$Comp
L Switch:SW_Push SW1
U 1 1 5BC09471
P 3750 2700
F 0 "SW1" H 3750 2985 50  0000 C CNN
F 1 "SW_Push" H 3750 2894 50  0000 C CNN
F 2 "Local:smd_pushbutton_6x6" H 3750 2900 50  0001 C CNN
F 3 "" H 3750 2900 50  0001 C CNN
	1    3750 2700
	1    0    0    -1  
$EndComp
$Comp
L Device:R_Small R1
U 1 1 5BC58D0D
P 7050 2700
F 0 "R1" V 6854 2700 50  0000 C CNN
F 1 "86R" V 6945 2700 50  0000 C CNN
F 2 "Resistor_THT:R_Axial_DIN0207_L6.3mm_D2.5mm_P2.54mm_Vertical" H 7050 2700 50  0001 C CNN
F 3 "~" H 7050 2700 50  0001 C CNN
	1    7050 2700
	0    1    1    0   
$EndComp
$Comp
L WeMos:WeMos_mini U1
U 1 1 5BC015C2
P 5500 2900
F 0 "U1" H 5500 3537 60  0000 C CNN
F 1 "WeMos_mini" H 5500 3431 60  0000 C CNN
F 2 "Local:wemos-d1-mini-with-pin-header" H 6050 2200 60  0001 C CNN
F 3 "http://www.wemos.cc/Products/d1_mini.html" H 5500 3431 60  0001 C CNN
	1    5500 2900
	1    0    0    -1  
$EndComp
$Comp
L power:GNDREF #PWR?
U 1 1 5BD6911B
P 4900 3400
F 0 "#PWR?" H 4900 3150 50  0001 C CNN
F 1 "GNDREF" H 4905 3227 50  0000 C CNN
F 2 "" H 4900 3400 50  0001 C CNN
F 3 "" H 4900 3400 50  0001 C CNN
	1    4900 3400
	1    0    0    -1  
$EndComp
Wire Wire Line
	5000 2650 4900 2650
Wire Wire Line
	4900 2650 4900 3400
Wire Wire Line
	4800 2750 5000 2750
$EndSCHEMATC
