1 7 2 maj 3 m
2 2 1 erreur -3 e
1 3 1 aBc 0.5 a
1 1 3 aBc 1.5 a
3 1 1 abc 4.2 a
1 1 2 xyz 5 x
1 2 1 a,b,c,d 18 a
2 1 2 xyz 10 x
4 1 1 abc 6.3 a
5 1 1 abc 1.6 a
6 1 1 abc 0.8 a
7 1 1 abc 1.0 a
3 7 2 xyz 5 x