{
    "Company": [
      {
        "name": "Numerix",
        "id": 1
      },
      {
        "name": "Techbulls SoftTech",
        "id": 2
      },
      {
        "name": "Model N",
        "id": 3
      },
      {
        "name": "Turtlemint",
        "id": 4
      }
    ],
    "Country": [
      {
        "name": "INDIA",
        "id": 1
      },
      {
        "name": "USA",
        "id": 2
      }
    ],
    "Skills": [
      {
        "name": "Java",
        "id": 1
      },
      {
        "name": "React",
        "id": 2
      }
    ],
    "data":[
        {
          "Company": "Numerix",
          "Country": "USA"
        },
        {
          "Company": "Techbulls SoftTech",
          "Country": "INDIA"
        },
        {
          "Company": "Turtlemint",
          "Country": "INDIA"
        },
        {
          "Company": "Model N",
          "Country": "USA"
        }
      ]
  }