{
    "Version": "2012-10-17",
    "Statement": [
        {
            "Sid": "VisualEditor0",
            "Effect": "Allow",
            "Action": [
                "ecs:PutAttributes",
                "ecs:UpdateCluster",
                "ecs:ListAttributes",
                "ecs:ExecuteCommand",
                "ecs:UpdateContainerInstancesState",
                "ecs:StartTask",
                "ecs:RegisterContainerInstance",
                "ecs:DeleteAttributes",
                "ecs:DescribeTaskSets",
                "ecs:DeleteCapacityProvider",
                "ecs:SubmitAttachmentStateChanges",
                "ecs:Poll",
                "ecs:UpdateService",
                "ecs:DescribeCapacityProviders",
                "ecs:CreateService",
                "ecs:RunTask",
                "ecs:ListTasks",
                "ecs:StopTask",
                "ecs:DescribeServices",
                "ecs:SubmitContainerStateChange",
                "ecs:DescribeContainerInstances",
                "ecs:DeregisterContainerInstance",
                "ecs:TagResource",
                "ecs:DescribeTasks",
                "ecs:UntagResource",
                "ecs:PutClusterCapacityProviders",
                "ecs:UpdateTaskSet",
                "ecs:SubmitTaskStateChange",
                "ecs:UpdateClusterSettings",
                "ecs:UpdateCapacityProvider",
                "ecs:DeleteService",
                "ecs:DeleteCluster",
                "ecs:DeleteTaskSet",
                "ecs:DescribeClusters",
                "ecs:ListTagsForResource",
                "ecs:StartTelemetrySession",
                "ecs:UpdateContainerAgent",
                "ecs:ListContainerInstances",
                "ecs:UpdateServicePrimaryTaskSet"
            ],
            "Resource": [
                "arn:aws:ecs:us-west-2:864370184797:service/front*/*",
                "arn:aws:ecs:us-west-2:864370184797:service/back*/*",
                "arn:aws:ecs:us-west-2:864370184797:container-instance/*-end-app/*",
                "arn:aws:ecs:*:864370184797:task-set/*/*/*",
                "arn:aws:ecs:us-west-2:864370184797:cluster/*-end-app",
                "arn:aws:ecs:us-west-2:864370184797:capacity-provider/app*",
                "arn:aws:ecs:*:864370184797:task/*/*",
                "arn:aws:ecs:*:864370184797:task-definition/*:*"
            ]
        },
        {
            "Sid": "VisualEditor1",
            "Effect": "Allow",
            "Action": [
                "ecs:DiscoverPollEndpoint",
                "ecs:PutAccountSettingDefault",
                "ecs:CreateCluster",
                "ecs:DescribeTaskDefinition",
                "ecs:PutAccountSetting",
                "ecs:ListServices",
                "ecs:CreateCapacityProvider",
                "ecs:DeregisterTaskDefinition",
                "ecs:ListAccountSettings",
                "ecs:DeleteAccountSetting",
                "ecs:ListTaskDefinitionFamilies",
                "ecs:RegisterTaskDefinition",
                "ecs:ListTaskDefinitions",
                "ecs:CreateTaskSet",
                "ecs:ListClusters"
            ],
            "Resource": "*"
        }
    ]
}
