INDEX VERSION 1.131+C:\Users\dell\Desktop\Server_Side\.metadata\.plugins\org.eclipse.jdt.core
3449302891.index
2218016100.index
1475319868.index
3917711867.index
2711071698.index
569952943.index
3936476308.index
2487780398.index
2806691857.index
2209586441.index
2342233159.index
1865797976.index
3071189534.index
1900601350.index
1729216582.index
1495897196.index
2289139095.index
2172444271.index
3740305033.index
1046984699.index
777209002.index
197093283.index
2708336453.index
210034965.index
556883471.index
791537701.index
319768830.index
841689458.index
2171567624.index
817073133.index
1598398456.index
3764063162.index
2262267673.index
8710240.index
2131970340.index
1169642215.index
2835857961.index
3724641416.index
420709336.index
1921178851.index
3788399336.index
1891204091.index
2106989068.index
3152466785.index
4095867090.index
1006772568.index
848185633.index
3526162561.index
3085344655.index
1574612486.index
1690204989.index
2819677972.index
1434532684.index
727978797.index
3279564177.index
2556865253.index
2701550811.index
1047157894.index
1966236034.index
3831898.index
2519614097.index
3094754528.index
3283963375.index
3405310340.index
719648061.index
55900538.index
2538918115.index
2546130900.index
351215141.index
4225955867.index
2342983097.index
2005044664.index
2105977067.index
1994096236.index
3696591832.index
130735378.index
1496866822.index
3320960488.index
4110625080.index
1398025770.index
931892446.index
2411884512.index
527207564.index
1257070066.index
216627181.index
3353870687.index
1249301671.index
172022630.index
