{
	"ulid": "01G6XZW8KNPKSR600BCQG4NDRW",
	"minTime": 1656630463408,
	"maxTime": 1656640800000,
	"stats": {
		"numSamples": 255716,
		"numSeries": 1889,
		"numChunks": 2992
	},
	"compaction": {
		"level": 2,
		"sources": [
			"01G6XKNA4SN5QTHC56KZGEGR5R",
			"01G6XKNA6CS9ZQ964B2APMKDTZ"
		],
		"parents": [
			{
				"ulid": "01G6XKNA4SN5QTHC56KZGEGR5R",
				"minTime": 1656630463408,
				"maxTime": 1656633600000
			},
			{
				"ulid": "01G6XKNA6CS9ZQ964B2APMKDTZ",
				"minTime": 1656633604626,
				"maxTime": 1656640800000
			}
		]
	},
	"version": 1
}