{
	"ulid": "01G6ZPTCV19MR2VZECQBZZQT20",
	"minTime": 1656699992599,
	"maxTime": 1656720000000,
	"stats": {
		"numSamples": 1006330,
		"numSeries": 1538,
		"numChunks": 9517
	},
	"compaction": {
		"level": 2,
		"sources": [
			"01G6XTH1D6YNZAYV871TVW6RVH",
			"01G6XZW8ERVNE1NJTRRTZKY2KF",
			"01G6Z77D9NY4A0SGZ7AN5SSQ8R"
		],
		"parents": [
			{
				"ulid": "01G6XTH1D6YNZAYV871TVW6RVH",
				"minTime": 1656699992599,
				"maxTime": 1656705600000
			},
			{
				"ulid": "01G6XZW8ERVNE1NJTRRTZKY2KF",
				"minTime": 1656705602599,
				"maxTime": 1656712800000
			},
			{
				"ulid": "01G6Z77D9NY4A0SGZ7AN5SSQ8R",
				"minTime": 1656712802601,
				"maxTime": 1656720000000
			}
		]
	},
	"version": 1
}