{
    "targets": [
		"sobel",
		"swap",
		"blur",
		"blur2"
    ],
    "passes": [
		{
            "name": "color_convolve",
            "intarget": "minecraft:main",
            "outtarget": "sobel",
            "uniforms": [
                {
                    "name": "Saturation",
                    "values": [ 0.7 ]
                },
				{
                    "name": "RedMatrix",
                    "values": [ 0.5, 0.5, 0.5 ]
                },
                {
                    "name": "GreenMatrix",
                    "values": [ 0.5, 0.2, 0.2 ]
                },
                {
                    "name": "BlueMatrix",
                    "values": [ 0.0, 0.0, 0.0 ]
                }
            ]
        },
        {
            "name": "sobel",
            "intarget": "sobel",
            "outtarget": "swap"
        },
        {
            "name": "blit",
            "intarget": "swap",
            "outtarget": "blur"
        },
		        {
            "name": "blur",
            "intarget": "blur",
            "outtarget": "blur2",
            "uniforms": [
                {
                    "name": "BlurDir",
                    "values": [ 1.0, 0.0 ]
                },
                {
                    "name": "Radius",
                    "values": [ 2.0 ]
                }
            ]
        },
        {
            "name": "blur",
            "intarget": "blur2",
            "outtarget": "minecraft:main",
            "uniforms": [
                {
                    "name": "BlurDir",
                    "values": [ 0.0, 1.0 ]
                },
                {
                    "name": "Radius",
                    "values": [ 2.0 ]
                }
            ]
        }
    ]
}
