Added Net: Name=NetC1_1
Added Net: Name=NetC1_2
Added Net: Name=NetContact_1_1
Added Net: Name=NetContact_2_1
Added Net: Name=NetR1_1
Added Net: Name=NetR1_2
Added Net: Name=NetR2_2
Added Net: Name=NetR3_1
Added Net: Name=NetR5_2
Added Net: Name=NetVT1_3
Added Class: Name=Sheet1
Added Room: Name=Sheet1
