[
  {
    "name": "Куртка Lyle & Scott",
    "price": 5192,
    "image": "https://img2.ans-media.com/i/1080x1626/AW22-KUM1EP_59X_F1.jpg?v=1665136604",
    "article": 424621,
    "color": "синій ",
    "isFavourite": false
  },
  {
    "name": "Кофта Marmot",
    "price": 6459,
    "image": "https://img2.ans-media.com/i/1080x1626/SS23-BLM0PM-22X_F1.jpg?v=1675245508",
    "article": 689170,
    "color": "помаранчевий ",
    "isFavourite": false
  },
  {
    "name": "Пухова куртка Tommy Hilfiger",
    "price": 8799,
    "image": "https://img2.ans-media.com/i/1080x1626/AW22-KUM0IZ_82X_F1.jpg?v=1669721808",
    "article": 335631,
    "color": "коричневий",
    "isFavourite": false
  },
  {
    "name": "Кофта Calvin Klein Jeans",
    "price": 8457,
    "image": "https://img2.ans-media.com/i/1080x1626/SS23-BLM0NS-95X_F1.jpg?v=1674815438",
    "article": 621600,
    "color": "блакитна сталь",
    "isFavourite": false
  },
  {
    "name": "Бавовняна кофта Calvin Klein Jeans",
    "price": 4460,
    "image": "https://img2.ans-media.com/i/1080x1626/SS23-BLM0NU-90X_F1.jpg?v=1673604759",
    "article": 504410,
    "color": "сірий",
    "isFavourite": false
  },
  {
    "name": "Кофта Calvin Klein Jeans",
    "price": 7609,
    "image": "https://img2.ans-media.com/i/1080x1626/SS23-BLM00J-99X_F1.jpg?v=1670927094",
    "article": 820233,
    "color": "чорний",
    "isFavourite": false
  },
  {
    "name": "Бавовняна кофта BOSS",
    "price": 6469,
    "image": "https://img2.ans-media.com/i/1080x1626/SS23-BLM042-99X_F1.jpg?v=1670578605",
    "article": 328587,
    "color": "чорний",
    "isFavourite": false
  },
  {
    "name": "Бавовняна футболка Calvin Klein Jeans",
    "price": 8757,
    "image": "https://img2.ans-media.com/i/1080x1626/AW22-TSM0AF-65X_F1.jpg?v=1674815789",
    "article": 123687,
    "color": "бірюзовий",
    "isFavourite": false
  },
  {
    "name": "Бавовняна футболка Polo Ralph Lauren",
    "price": 5233,
    "image": "https://img2.ans-media.com/i/1080x1626/SS23-TSM0ZD-MLC_F1.jpg?v=1674818241",
    "article": 466034,
    "color": "візерунок",
    "isFavourite": false
  },
  {
    "name": "Бавовняна футболка Calvin Klein",
    "price": 6033,
    "image": "https://img2.ans-media.com/i/1080x1626/SS23-TSM0AH-99X_F1.jpg?v=1674205635",
    "article": 279143,
    "color": "чорний ",
    "isFavourite": false
  },
  {
    "name": "Бавовняна футболка Pepe Jeans Jacko",
    "price": 7608,
    "image": "https://img2.ans-media.com/i/1080x1626/SS23-TSM0KN-59X_F1.jpg?v=1673873832",
    "article": 790418,
    "color": "синій",
    "isFavourite": false
  },
  {
    "name": "Бавовняна футболка HUGO",
    "price": 5126,
    "image": "https://img2.ans-media.com/i/1080x1626/SS23-TSM02D-99X_F1.jpg?v=1672907718",
    "article": 820307,
    "color": "чорний візерунок",
    "isFavourite": false
  },
  {
    "name": "Бавовняна футболка Tommy Hilfiger",
    "price": 1342,
    "image": "https://img2.ans-media.com/i/1080x1626/SS23-TSM02S-00X_F1.jpg?v=1672399130",
    "article": 523307,
    "color": "білий",
    "isFavourite": false
  },
  {
    "name": "Бавовняна футболка adidas",
    "price": 3885,
    "image": "https://img2.ans-media.com/i/1080x1626/SS23-TSM096-99X_F1.jpg?v=1671533357",
    "article": 137343,
    "color": "чорний",
    "isFavourite": false
  }
]
