<svg xmlns="http://www.w3.org/2000/svg" width="110.346" height="84.07" viewBox="0 0 110.346 84.07">
  <g id="asia" transform="translate(0 0)">
    <path id="Path_53" data-name="Path 53" d="M75.313,172.863a1.746,1.746,0,0,1-1.433-.747c-.646-.923-6.342-9.13-7.269-12.84a68.259,68.259,0,0,0-2.655-7.532c-2.648,1.61-6.693,4.319-8.258,6.406-3.063,4.086-6.3,4.2-6.655,4.2a1.753,1.753,0,0,1-1.368-.656,20.048,20.048,0,0,1-3.887-11.6c0-2.513-9.328-5.436-18.391-6.759V146.9l6.671,9.172a1.751,1.751,0,0,1-1.2,2.768L16.856,160.59a1.771,1.771,0,0,1-1.455-.5c-.228-.228-5.6-5.65-7.453-12.143-1.491-5.224-2.348-9.765-2.6-11.15l-5-6.672a1.751,1.751,0,0,1,.712-2.66c6.46-2.769,7.357-2.769,7.7-2.769,1.438,0,2.462,1.261,3.014,2.171,3.27,1.551,8.45,3.275,10.215,2.393.62-1.069-1.367-7.063-4.266-12.5a1.752,1.752,0,0,1,.991-2.486l5.255-1.751c.3-.1.358-.217.407-.372.652-2-2.468-7.724-4.781-10.962a1.749,1.749,0,0,1,.641-2.584l7.007-3.5a1.627,1.627,0,0,0,.607-.431,3.833,3.833,0,0,0-.874-.979,1.751,1.751,0,0,1,.763-3.129l10.509-1.751a1.879,1.879,0,0,1,.48-.014l19.166,2.074A1.753,1.753,0,0,1,59.44,92.81c-.108.963-.98.26-1.934.152L38.58,90.218l-10.248,1.94c.161.462,2.339,2.363,2.288,2.9-.082.92-1.283,1.52-3.208,2.483l-5.918,3.307c1.96,3.039,5.256,8.894,4.118,12.39-.414,1.273.071.781-1.236,1.214l-4.721,1.806c1.679,3.432,4.56,10.779,3.512,14.066-.381,1.195.257.388-.312.673-4.078,2.034-10.84-1.83-12.432-2.628l.154-.423-.938-.36c-.121-.239-1-1.217-1.154-1.4-.682.22-5.078,2.242-6.777,2.94l5.3,5.907a1.74,1.74,0,0,1,.327.763c.009.051.883,5.236,2.585,11.192,1.277,4.477,5.338,9.919,6.686,11.413l13.671-1.273L23.623,148.5a1.761,1.761,0,0,1-.335-1.029v-4.735a1.748,1.748,0,0,1,.588-1.31,1.729,1.729,0,0,1,1.372-.43c5.5.66,20.646,1.973,20.646,9.1,0,3.949,2.317,8.491,3.223,9.941.723-.291,3.962-1.674,5.173-3.287,2.819-3.759,8.632-6.781,8.968-6.967.432-.242,1.645-.984,2.114-.824s.15.511.346.968a74.751,74.751,0,0,1,2.894,8.5c.381,1.522,4.137,7.918,5.785,10.549.609-2.044,1.955-6.019,4.564-6.887l5.276-1.76-5.37-7.322c-1.2-1.016-2.837-2.793-2.215-4.571.429-1.225,1.629-1.147,3.561-1.147,2.995,0,5.633-3.534,6.131-4.452v-12.01a1.7,1.7,0,0,1,.024-.287,115.75,115.75,0,0,1,2.67-11.579,11.5,11.5,0,0,0-1.457-9.428l-.13-.607.112-.209a1.752,1.752,0,0,1,1.163-.962c.324-.084,6.621-1.945,10.777,2.211,1.2,1.2,5.175,2.619,6.155,3.048l-1.047-6.283a1.742,1.742,0,0,1,.214-1.353l3.268-5.229-17.351-7.5-15.426-.7L56.977,93.006c-.967-.03-1.728.557-1.7-.409a1.8,1.8,0,0,1,1.8-1.7l18.286-.356h15.71a1.782,1.782,0,0,1,.65.124l17.515,7.007a1.753,1.753,0,0,1,.835,2.556l-3.984,6.375,1.571,6.284a1.751,1.751,0,0,1-1.7,2.176c-.173,0-4.275-.046-8.244-4.016-1.663-1.665-4.707-1.8-6.883-1.6a18.744,18.744,0,0,1,.173,10.48c-1.55,5.422-2.41,10.191-2.561,11.053v12.112c0,2.1-4.272,6.6-9,6.981.157.152.319.294.464.409a1.762,1.762,0,0,1,.407.467l5.255,8.757a1.752,1.752,0,0,1-.947,2.562l-5.255,1.752c-3.64,1.214-2.41,6.455-2.357,6.678a1.754,1.754,0,0,1-1.7,2.169Zm0,0" transform="translate(0.001 -88.793)" fill="#fff"/>
  </g>
</svg>
