tree
version=v3
num_class=1
num_tree_per_iteration=1
label_index=0
max_feature_idx=3
objective=poisson
feature_names=source platform event_2 event_3
feature_infos=-1:1:0 -1:0:1 [0:2694] [0:643]
tree_sizes=10857 11396 12443 12799 13029 12826 13342 12870 11188 11723 10456 11423 11094 11181 11105 11640 11500 10822 11025 11160 12700 12563 12685 12382 12082 11893 12243 12227 12112 12754 9965 11202 11012 10467 12574 12383 11563 11964 12088 12197 10591 10302 10230 10093 10325 10345 9173 10937 10847 10938 10109 8884 8982 8859 11497 11405 11590 11497 8758 10671 9181 9094 9082 9277 8868 8565 9714 8993 9072 9585 9016 9543 9731 9515 9729 9505 9651 9627 9440 9565 10690 10270 10587 10499 10930 9445 9506 9315 9408 9315 7179 7075 7292 7400 7297 7392 7295 7211 7180 7104 10208 10210 10208 10551 9911 10495 10273 10250 10423 10397 7545 7541 6428 6440 6412 6525 6432 6105 8196 6320 8205 7596 7610 7612 8016 7702 7704 7936 7715 7817 7856 7771 7760 7878 7178 7362 7524 7411 7515 7508 7133 7491 7247

Tree=0
num_leaves=108
num_cat=28
split_feature=2 2 2 2 2 3 3 0 2 2 2 3 2 3 2 0 2 2 1 1 2 3 1 2 1 2 3 3 3 2 2 2 1 2 2 1 3 3 0 2 1 1 2 2 2 0 3 2 2 2 1 2 3 2 2 3 3 2 2 2 2 1 1 3 2 2 3 3 3 3 3 2 3 3 3 3 1 2 2 3 1 2 2 2 2 2 2 2 1 2 3 1 1 2 1 2 2 1 2 3 0 1 2 1 1 0 0
split_gain=861.868 257.425 138.124 33.1979 29.7845 14.3085 12.357 10.1907 9.47646 9.10594 7.9359 13.5315 15.2295 9.95285 7.49626 6.25763 6.10242 9.27384 7.08582 5.81134 5.17326 13.8966 5.30466 4.32338 3.79689 3.79306 3.68888 3.56849 7.5047 3.31466 13.5016 5.0341 5.92674 2.871 8.11211 2.81453 2.71965 12.8999 2.45813 2.42839 2.24644 1.91607 1.79784 1.6016 1.27375 1.24493 1.18563 1.13415 1.05148 1.02552 2.89445 0.795431 0.754971 0.741294 0.635761 0.619407 0.573449 0.480977 0.417218 0.40246 1.32261 0.630874 0.333376 0.308943 0.29716 0.295969 0.293397 0.239255 0.203744 0.202978 0.172837 0.145202 0.137817 0.136155 0.105582 0.102812 0.0833566 0.0795086 0.0540867 0.0868699 0.045965 0.0454288 0.044855 0.0369428 0.0287744 0.0258533 0.0133611 0.0130496 0.0101561 0.00766588 0.00712424 0.00651248 0.00443217 0.00428409 0.00307616 0.00206264 0.0018078 0.00104835 0.000709136 0.000708755 0.000493474 0.000527185 0.000477496 2.67997e-05 2.05753e-07 3.49322e-07 2.09835e-07
threshold=166.50000000000003 13.500000000000002 465.00000000000006 242.50000000000003 64.500000000000014 1.0000000180025095e-35 1.5000000000000002 0 733.50000000000011 65.500000000000014 27.500000000000004 6.5000000000000009 24.500000000000004 1.0000000180025095e-35 42.500000000000007 1 334.50000000000006 248.50000000000003 2 3 48.500000000000007 1.0000000180025095e-35 4 117.50000000000001 5 1.0000000180025095e-35 1.0000000180025095e-35 3.5000000000000004 4.5000000000000009 8.5000000000000018 6.5000000000000009 1.0000000180025095e-35 6 67.500000000000014 66.500000000000014 7 8.5000000000000018 10.500000000000002 8 18.500000000000004 9 10 538.50000000000011 603.00000000000011 899.50000000000011 11 39.500000000000007 45.500000000000007 305.50000000000006 1.5000000000000002 12 399.50000000000006 32.500000000000007 189.50000000000003 157.50000000000003 11.500000000000002 5.5000000000000009 215.50000000000003 139.50000000000003 4.5000000000000009 7.5000000000000009 13 14 2.5000000000000004 27.500000000000004 258.50000000000006 5.5000000000000009 1.5000000000000002 3.5000000000000004 6.5000000000000009 9.5000000000000018 211.50000000000003 7.5000000000000009 4.5000000000000009 4.5000000000000009 34.500000000000007 15 4.5000000000000009 198.50000000000003 1.0000000180025095e-35 16 20.500000000000004 285.50000000000006 4.5000000000000009 208.50000000000003 36.500000000000007 54.500000000000007 9.5000000000000018 17 2.5000000000000004 3.5000000000000004 18 19 17.500000000000004 20 8.5000000000000018 1.5000000000000002 21 1.5000000000000002 2.5000000000000004 22 23 10.500000000000002 24 25 26 27
decision_type=2 2 2 2 2 2 2 9 2 2 2 2 2 2 2 9 2 2 1 1 2 2 1 2 1 2 2 2 2 2 2 2 1 2 2 1 2 2 9 2 1 1 2 2 2 9 2 2 2 2 1 2 2 2 2 2 2 2 2 2 2 1 1 2 2 2 2 2 2 2 2 2 2 2 2 2 1 2 2 2 1 2 2 2 2 2 2 2 1 2 2 1 1 2 1 2 2 1 2 2 9 1 2 1 1 9 9
left_child=1 6 3 19 7 43 25 47 24 -6 11 12 39 -14 27 29 17 -5 51 57 21 -16 -22 33 42 26 100 62 -29 30 31 32 -8 34 -11 48 41 -38 92 -9 46 -35 -7 -4 -10 49 54 64 65 50 -27 66 67 68 -25 82 71 75 72 61 -61 -51 -12 -53 81 -19 -18 -20 -21 -59 -60 -55 -42 91 83 78 -49 89 79 -2 85 93 -37 96 -80 -66 -78 94 -83 98 -33 -31 -28 -3 -79 -85 99 -91 -47 -17 101 -1 -89 -40 105 -102 -106
right_child=2 4 5 16 9 8 15 10 44 23 14 -13 13 -15 20 74 18 35 52 53 22 -23 -24 40 -26 45 38 28 -30 73 -32 90 -34 36 -36 55 37 -39 103 -41 58 -43 -44 -45 -46 77 -48 76 -50 59 -52 63 -54 56 -56 -57 -58 69 70 60 -62 -63 -64 -65 80 -67 -68 -69 -70 -71 -72 -73 -74 -75 -76 -77 86 87 84 -81 -82 88 -84 95 -86 -87 -88 102 -90 97 -92 -93 -94 -95 -96 -97 -98 -99 -100 -101 104 -103 -104 -105 106 -107 -108
leaf_value=-2.1028324209913611 -2.0479092778479813 -2.0961521121189621 -1.8449095737404997 -1.9458659966367164 -1.9932580349047422 -1.9769862112019903 -2.0489627813995872 -2.0790473818140716 -1.9082008041784317 -2.0770707795021099 -2.090486338664896 -2.00533056613448 -2.0018558366297654 -2.0617703287285707 -2.0282548907547029 -2.1020364980688027 -2.0058654050769809 -2.0293360518525327 -1.9479641836533323 -2.016492723558692 -2.083372580186388 -2.0807695635400654 -2.0582610027683588 -2.0573368477909875 -1.9186051461676465 -2.0789686702330612 -2.0800850900347627 -2.0227445142336173 -2.0833732521084105 -2.0984141401971783 -2.0121793809110957 -2.1006721989487538 -2.0908365463645606 -2.068318741133667 -1.994301174707098 -1.9979323524324117 -1.9791454637731269 -2.0619469457307749 -2.1025900254828072 -2.0659052358545171 -2.0473696153777103 -2.0577713759432905 -1.9451352611856891 -1.8827209378965757 -1.8746813380407923 -2.1024467964590543 -2.0302945524244524 -2.0742390383230069 -1.9991835571499623 -2.1018653429486513 -2.1023531727168536 -1.9880641613735923 -1.9316214998607923 -2.0091622828307782 -2.0459993371612559 -1.9745758838390894 -1.9968739965628861 -2.0365597786158269 -2.037891732839312 -2.0887153955105999 -2.098457623969197 -2.0936978967511819 -2.0845795267881511 -1.9707687483076699 -2.0903922411144862 -2.0159686233536762 -1.9917392520356809 -1.9630147665651221 -2.0285767173618017 -2.0256726633651043 -2.0279813962940634 -2.0201174651959328 -2.0386303056773727 -2.0877523535081504 -2.0929522588226077 -2.0343185592153956 -2.0823049947579184 -2.1001641133309206 -2.037287079329007 -2.0415224787138841 -2.0845610711753406 -2.092910756165137 -1.9919966483645652 -2.0988559280905972 -2.0420616983229727 -2.0870524330686591 -2.0793375033025532 -2.0985735143130575 -2.0903660030426217 -2.1013891491320682 -2.0984875246674783 -2.0961700698800776 -2.0812924200511849 -2.0947031104571816 -2.0991596401215968 -2.0975611847454743 -2.1007823004483694 -2.1006033515259275 -2.1020398396442275 -2.101421848883279 -2.102945589203534 -2.1029205375694611 -2.0979941448257597 -2.1024579494205784 -2.1029408855661909 -2.1029391927731718 -2.1029472514619196
leaf_weight=387.65672338008881 7.0574696063995388 12.602624297142031 5.0410497188568097 7.3095220923423758 5.7972071766853324 8.0656795501709002 18.399831473827362 69.062381148338318 5.7972071766853315 6.0492596626281721 70.826748549938202 9.8300469517707807 13.862886726856233 13.86288672685623 24.701143622398376 12.350571811199194 6.3013121485710171 5.0410497188568142 5.5451546907424909 7.8136270642280561 62.256964027881622 25.709353566169739 31.758613228797913 67.802118718624115 8.3177320361137408 31.758613228797913 19.155988931655884 6.8054171204566982 20.416251361370087 7.3095220923423776 8.5697845220565778 14.366991698741915 15.627254128456114 113.6756711602211 5.7972071766853333 7.0574696063995379 5.5451546907424918 31.002455770969391 16.131359100341797 71.582906007766724 15.879306614398958 69.314433634281158 9.8300469517707807 6.3013121485710144 5.5451546907424927 29.238088369369507 5.0410497188568106 7.5615745782852173 9.5779944658279401 61.752859055995941 22.684723734855652 5.2931022047996503 5.0410497188568106 7.0574696063995379 15.123149156570433 5.0410497188568106 8.3177320361137372 8.8218370079994219 16.1313591003418 57.467966794967651 88.470422565937042 38.311977863311768 36.043505489826202 5.0410497188568115 11.846466839313509 23.188828706741333 8.8218370079994184 5.0410497188568115 6.3013121485710144 8.3177320361137372 6.0492596626281729 5.2931022047996521 6.3013121485710135 5.0410497188568106 5.2931022047996512 5.0410497188568106 6.8054171204566982 27.221668481826782 7.8136270642280561 21.67651379108429 9.073889493942259 17.64367401599884 5.7972071766853333 6.5533646345138532 5.2931022047996521 11.342361867427824 8.5697845220565778 5.2931022047996548 5.0410497188568142 21.424461305141449 5.0410497188568106 5.7972071766853341 12.602624297142031 8.5697845220565778 10.586204409599302 5.7972071766853333 5.5451546907424918 5.2931022047996548 16.887516558170319 7.5615745782852164 238.69370418787003 301.95887815952301 10.838256895542143 5.0410497188568142 65.53364634513855 23.440881192684174 16.131359100341797
leaf_count=1538 28 50 20 29 23 32 73 274 23 24 281 39 55 55 98 49 25 20 22 31 247 102 126 269 33 126 76 27 81 29 34 57 62 451 23 28 22 123 64 284 63 275 39 25 22 116 20 30 38 245 90 21 20 28 60 20 33 35 64 228 351 152 143 20 47 92 35 20 25 33 24 21 25 20 21 20 27 108 31 86 36 70 23 26 21 45 34 21 20 85 20 23 50 34 42 23 22 21 67 30 947 1198 43 20 260 93 64
internal_value=-2.07812 -2.08751 -1.99057 -2.00875 -2.06643 -1.91513 -2.09943 -2.07375 -1.93 -2.05543 -2.07059 -2.06235 -2.06568 -2.03181 -2.07586 -2.0842 -1.98904 -1.99882 -1.97405 -2.02951 -2.06796 -2.05504 -2.07489 -2.05642 -1.94652 -2.10067 -2.10224 -2.08438 -2.06822 -2.07594 -2.07044 -2.07978 -2.06819 -2.06054 -2.03657 -2.00577 -2.06184 -2.04938 -2.08936 -2.07236 -2.04921 -2.06432 -1.95949 -1.86592 -1.89181 -2.09668 -2.05384 -2.08828 -2.0135 -2.09492 -2.08871 -1.99032 -1.94755 -2.01305 -2.05527 -1.98943 -2.00702 -2.03844 -2.04004 -2.0963 -2.09462 -2.09874 -2.08849 -1.97963 -2.09122 -2.01836 -1.99763 -1.95513 -2.02189 -2.03128 -2.03519 -2.01386 -2.04489 -2.09474 -2.09957 -2.04106 -2.07854 -2.10083 -2.04188 -2.04309 -2.08758 -2.0939 -1.99526 -2.10049 -2.03922 -2.08876 -2.08065 -2.09937 -2.09235 -2.10191 -2.1001 -2.09742 -2.08056 -2.09557 -2.09988 -2.09825 -2.10158 -2.10123 -2.1023 -2.1018 -2.1029 -2.10287 -2.09818 -2.10256 -2.10294 -2.10295 -2.10294
internal_weight=0 2562.11 251.8 202.902 925.285 48.8982 1636.83 555.776 37.5558 369.509 456.719 178.201 168.371 27.7258 278.518 123.254 104.098 63.0131 41.0846 98.8046 144.426 50.4105 94.0156 363.712 26.2135 1513.58 1086.35 134.092 27.2217 80.1527 62.0049 53.4351 34.0271 231.384 11.8465 55.7036 219.538 36.5476 52.931 140.645 132.328 182.99 17.8957 11.3424 11.3424 427.229 87.9663 99.0566 37.8079 300.447 54.4433 25.4573 15.6273 34.7832 82.9253 17.8957 20.6683 64.0213 44.3612 246.003 145.938 100.065 106.87 10.3342 76.1199 28.2299 15.1231 10.5862 14.1149 17.1396 22.1806 12.3506 22.1806 18.1478 43.101 46.8818 22.9368 126.782 41.8407 28.734 32.2627 43.8571 12.8547 37.8079 13.1067 23.1888 15.3752 53.9392 22.6847 72.8432 19.408 13.1067 31.7586 21.1724 37.8079 12.3506 25.4573 26.7176 46.1256 19.9121 1033.42 689.616 16.1314 21.1724 343.8 262.135 81.665
internal_count=11164 10165 999 805 3671 194 6494 2205 149 1466 1812 707 668 110 1105 489 413 250 163 392 573 200 373 1443 104 6005 4310 532 108 318 246 212 135 918 47 221 871 145 210 558 525 726 71 45 45 1695 349 393 150 1192 216 101 62 138 329 71 82 254 176 976 579 397 424 41 302 112 60 42 56 68 88 49 88 72 171 186 91 503 166 114 128 174 51 150 52 92 61 214 90 289 77 52 126 84 150 49 101 106 183 79 4100 2736 64 84 1364 1040 324
cat_boundaries=0 1 2 3 4 5 6 7 8 9 10 11 12 13 14 15 16 17 18 19 20 21 22 23 24 25 26 27 28
cat_threshold=1 2 1 1 1 1 1 1 2 1 1 2 1 1 1 2 1 1 1 1 1 1 2 1 1 1 1 1
is_linear=0
shrinkage=1


Tree=1
num_leaves=110
num_cat=28
split_feature=2 2 2 2 2 2 3 0 2 2 2 2 3 2 3 2 2 0 1 1 2 3 1 2 3 1 3 3 2 2 2 1 3 3 2 2 1 2 0 2 2 2 1 2 2 0 2 2 2 1 3 2 3 2 2 1 3 3 3 2 2 1 2 1 2 2 3 2 2 3 3 3 2 3 2 2 3 2 2 2 1 2 2 1 3 2 3 2 2 2 1 2 3 1 2 1 1 2 2 1 2 3 0 1 2 1 1 0 0
split_gain=757.647 234.964 107.2 23.2798 19.1468 14.5124 12.354 9.66705 8.89234 8.45375 7.8521 7.34716 11.5972 13.5379 8.20273 7.08081 6.53507 6.10122 5.02823 5.01764 4.73367 12.3005 4.95369 3.85241 3.7275 3.72267 3.41353 6.71188 3.1706 11.9289 4.85345 5.48803 3.06178 4.68404 2.91276 7.49244 2.92926 2.57067 2.4298 2.37926 2.32064 2.2696 2.11373 1.83267 1.51065 1.25534 1.18801 1.10474 1.02106 2.85404 0.914048 0.812196 0.748861 0.569989 0.569982 0.480355 0.440982 0.435041 0.425844 0.404714 1.31958 0.637387 0.385862 0.32655 0.293772 0.255998 0.217263 0.187694 0.170483 0.166866 0.162877 0.135585 0.113179 0.106534 0.100713 0.198615 0.0999172 0.0840772 0.0961394 0.0809603 0.0791936 0.0477767 0.0453252 0.0449032 0.0428714 0.0375499 0.0346203 0.0253918 0.0132258 0.0128088 0.01007 0.00783188 0.00723365 0.00656454 0.00429417 0.00424744 0.00312323 0.00208469 0.00184459 0.00106868 0.000725471 0.000723974 0.00050582 0.000540322 0.00048264 2.74393e-05 2.10835e-07 3.58146e-07 2.15037e-07
threshold=155.50000000000003 13.500000000000002 334.50000000000006 64.500000000000014 469.50000000000006 242.50000000000003 1.5000000000000002 0 490.00000000000006 978.00000000000011 65.500000000000014 27.500000000000004 6.5000000000000009 24.500000000000004 1.0000000180025095e-35 42.500000000000007 248.50000000000003 1 2 3 48.500000000000007 1.0000000180025095e-35 4 1.0000000180025095e-35 1.0000000180025095e-35 5 3.5000000000000004 4.5000000000000009 8.5000000000000018 6.5000000000000009 1.0000000180025095e-35 6 8.5000000000000018 10.500000000000002 67.500000000000014 66.500000000000014 7 92.500000000000014 8 581.00000000000011 112.50000000000001 18.500000000000004 9 536.50000000000011 72.500000000000014 10 189.50000000000003 45.500000000000007 1.5000000000000002 11 37.500000000000007 733.50000000000011 39.500000000000007 399.50000000000006 215.50000000000003 12 11.500000000000002 5.5000000000000009 32.500000000000007 4.5000000000000009 7.5000000000000009 13 280.50000000000006 14 27.500000000000004 435.50000000000006 5.5000000000000009 166.50000000000003 168.50000000000003 6.5000000000000009 3.5000000000000004 4.5000000000000009 211.50000000000003 4.5000000000000009 176.50000000000003 185.50000000000003 1.5000000000000002 164.50000000000003 161.50000000000003 4.5000000000000009 15 259.50000000000006 20.500000000000004 16 5.5000000000000009 4.5000000000000009 1.5000000000000002 36.500000000000007 9.5000000000000018 54.500000000000007 17 2.5000000000000004 3.5000000000000004 18 17.500000000000004 19 20 8.5000000000000018 1.5000000000000002 21 1.5000000000000002 2.5000000000000004 22 23 10.500000000000002 24 25 26 27
decision_type=2 2 2 2 2 2 2 9 2 2 2 2 2 2 2 2 2 9 1 1 2 2 1 2 2 1 2 2 2 2 2 1 2 2 2 2 1 2 9 2 2 2 1 2 2 9 2 2 2 1 2 2 2 2 2 1 2 2 2 2 2 1 2 1 2 2 2 2 2 2 2 2 2 2 2 2 2 2 2 2 1 2 2 1 2 2 2 2 2 2 1 2 2 1 2 1 1 2 2 1 2 2 9 1 2 1 1 9 9
left_child=1 6 5 7 18 19 23 47 -6 25 -5 12 13 41 -15 26 -7 28 53 54 21 -17 -22 24 102 43 63 -28 29 30 31 -8 34 -34 35 -12 44 -38 95 -27 55 -9 50 -10 -36 48 67 64 49 -25 62 -45 -42 66 68 -35 86 72 76 61 -61 -50 81 -13 82 -55 -4 -21 77 -56 -69 93 -48 85 -70 -76 -20 78 -2 91 -49 -18 94 87 -64 98 -44 -66 96 -82 -84 100 -32 -30 -3 -26 -81 -87 101 -93 -47 -19 103 -1 -90 -40 107 -104 -108
right_child=2 3 4 10 8 16 17 11 9 -11 32 15 -14 14 -16 20 42 73 58 46 22 -23 -24 45 38 39 27 -29 71 -31 92 -33 33 40 36 -37 37 -39 105 -41 52 -43 56 51 -46 79 57 80 59 -51 -52 -53 -54 65 69 -57 -58 -59 -60 60 -62 -63 84 -65 83 -67 -68 70 74 -71 -72 -73 -74 -75 75 -77 -78 -79 -80 88 89 -83 90 -85 -86 97 -88 -89 104 -91 -92 99 -94 -95 -96 -97 -98 -99 -100 -101 -102 -103 106 -105 -106 -107 108 -109 -110
leaf_value=-0.02471156118638736 0.027772202327989343 -0.017910468987385086 0.065485586232089554 0.075935747461060799 0.19377019217415586 0.11279280740294478 0.027604000248730793 -0.00090717108872020015 0.089160668491348002 0.18032027998198652 0.00068048820195683714 -0.012213273969677557 0.065934586940905926 0.068839349611094627 0.015679984381499128 0.046230036685617773 0.046538667583102468 -0.023896464547154411 0.11123974082648221 0.04255382340404433 -0.0051514647116240242 -0.0025926921741745183 0.018978404197562887 -0.0008302760567972362 -0.0019220852858274563 0.12258024245460906 0.051053098805320378 -0.0051521273012653298 -0.017928629117840295 0.060146558895587669 -0.022502316935918091 -0.012563544550235506 0.059682522910136274 0.0094272165460730153 -0.0019638497130757561 0.082096955771368968 0.013462377142648242 0.029814927702616251 -0.024463188326228052 0.16454663488770696 0.029669113966091773 0.011763119524946887 0.076739751784502708 0.11028782159616349 0.013753296481632897 -0.024316484948832737 0.062706631744842631 0.0037678078494275367 -0.023721355769348879 -0.024220611994194962 0.078187457527416959 0.12959348452423625 0.050410056061072364 0.094566432474158857 0.038855809143607291 0.023411043767803574 0.090915252195466478 0.072966967732106272 0.12314972975915309 -0.010445785454748472 -0.020247385202557366 -0.015434677033100648 0.058619118104834306 -0.0063424717527140843 -0.01211920085539509 0.079746494557922987 0.077175921031152811 0.056458327964499934 0.039600858427241689 0.048497075441230358 0.045946637817114035 -0.0094872652948261166 0.053333024125681694 -0.014684898197774441 0.026781097121731236 0.035895717560075077 0.10232157074081275 0.024602517236335053 0.035823153260010482 -0.021984088238025112 -0.0041003968152642295 0.052299108247990438 -0.014643197786633652 -0.0063242379931845883 0.063357302854787578 -0.020652209968930538 0.071759830557195689 -0.0087917983138817175 -0.020365138865185872 -0.0011907054586598757 -0.012092972860984737 -0.02323447864037393 -0.020277763531810364 -0.020203208788564259 -0.016447253207541004 -0.0031055812632729625 -0.020961111401972165 -0.019337450471104294 -0.022614686289931445 -0.022432064831669443 -0.023899883592876592 -0.023267896814641333 -0.024827561326632955 -0.024801880351029707 -0.019776724827787862 -0.024327906934341049 -0.024822740271898527 -0.024821003727296429 -0.024829265085023523
leaf_weight=378.19340571761131 7.5446076393127459 12.377383559942247 6.7734487354755464 6.3106344044208518 5.7736428081989279 8.3430579304695112 18.944178551435471 68.998222172260284 7.4870463609695461 6.7714466452598563 5.550964415073393 69.956127896904945 10.572233408689497 14.961456358432772 14.091374576091765 25.964043438434601 5.5648340582847586 12.058668956160551 6.3159505724906939 8.6878910064697283 61.930687367916107 25.641273379325867 32.395544528961182 31.731606602668762 19.118342757225037 7.2536871433258039 7.1928847432136562 20.309239268302917 5.6934943050146103 9.1539104580879194 14.046581894159319 15.429756164550779 10.553292155265806 20.745242208242416 17.053814351558685 5.7558760643005371 41.157345771789551 57.764338105916977 15.741382598876953 6.3200247287750244 24.83519330620766 72.46248722076416 7.1183769702911395 14.339850157499315 147.66623884439468 28.535342216491699 7.5612928867340106 7.590961754322052 60.303665548563004 22.14156299829483 5.3879665732383719 8.785780191421507 5.2765847146511069 5.5593883693218213 9.1961811482906359 8.7235761582851428 5.590990185737609 9.0217065811157209 5.8363801240921012 56.862168252468109 86.68913671374321 37.719704627990723 10.260247319936754 35.811356157064438 11.701948672533037 6.1236923038959503 9.6177351474761945 8.3102895617485029 10.194470643997191 8.7655994296073896 6.6213488578796378 4.9927154183387747 5.6091821193695068 5.2151621282100669 7.5793202817440024 28.270007789134979 6.2472878694534302 5.7396344244480124 7.2919452488422394 26.628100991249084 6.776981949806216 10.192147374153135 17.384595572948456 9.0156126022338885 8.9282552897930128 6.4188604950904828 6.8469069302082062 11.241474598646162 5.1859287321567527 8.5593396425247175 4.979683160781863 20.931644216179848 4.9394044280052176 7.1626618951559085 8.4288252592086774 12.562680244445803 10.36577984690666 5.6855793744325638 5.4208907783031455 5.1754125952720669 16.488329172134399 7.387397736310958 232.84046494960785 294.56162509322166 10.624960213899611 4.9198317527771005 63.926930725574493 22.866210177540779 15.73575973510742
leaf_count=1538 29 50 25 23 20 29 73 274 26 22 22 281 39 55 55 98 21 49 22 33 247 102 126 126 76 24 27 81 23 34 57 62 39 81 67 21 160 223 64 21 96 284 26 49 578 116 28 30 245 90 20 29 20 20 35 34 20 33 20 228 351 152 38 143 47 22 35 31 39 33 25 20 21 21 29 108 22 22 28 108 27 38 70 36 33 26 25 45 21 34 20 85 20 29 34 50 42 23 22 21 67 30 947 1198 43 20 260 93 64
internal_value=0 -0.00971114 0.0741304 0.0105833 0.115469 0.0526512 -0.021233 0.00423805 0.134961 0.128298 0.0206655 0.00727467 0.0151186 0.0119679 0.0430557 0.00218723 0.0713344 -0.00597692 0.0916743 0.0428745 0.00979652 0.0219714 0.00313573 -0.0224964 -0.0241007 0.120325 -0.00614501 0.00954775 0.00210627 0.00741305 -0.0016334 0.00957361 0.0196548 0.0289799 0.0172761 0.0421265 0.0162103 0.0230113 -0.0110911 0.14212 0.0235417 0.00558312 0.065559 0.110661 0.0121261 -0.0184397 0.0562018 -0.0100161 -0.0166679 -0.0104436 0.0590182 0.117622 0.0333036 0.0783599 0.0356561 0.0135668 0.0790489 0.0645085 0.11199 -0.018056 -0.0163649 -0.0205326 0.0560627 -0.0102255 -0.0129479 0.0867986 0.072345 0.0483971 0.0335248 0.0435609 0.051797 -0.0164802 0.0587145 -0.0213749 0.0352157 0.0339687 0.106805 0.0297412 0.0317291 -0.0226633 -0.000409062 0.0502647 -0.015638 -0.00931405 0.0608238 -0.0223186 0.0742982 -0.0104889 -0.0211801 -0.00247647 -0.0140754 -0.0237644 -0.0219236 -0.0191959 -0.0173177 -0.00239138 -0.0216974 -0.0200347 -0.0234303 -0.0230754 -0.0241639 -0.0236577 -0.0247761 -0.0247511 -0.0199697 -0.024431 -0.0248263 -0.024827 -0.024824
internal_weight=0 2512.14 301.832 909.737 103.205 198.626 1602.4 558.344 56.7315 50.9578 351.393 460.287 181.086 170.514 29.0528 279.201 68.2328 122.549 46.4739 130.393 145.932 51.6053 94.3262 1479.85 1060.47 44.1864 133.27 27.5021 80.3627 62.5138 53.3599 34.3739 345.082 70.1339 274.949 11.3068 263.642 98.9217 52.3422 13.5737 59.5806 141.461 59.8897 30.6127 164.72 419.383 45.8117 98.0568 295.448 53.8732 40.3335 23.1256 30.1118 28.0743 84.5818 29.4688 19.5563 22.1922 18.3996 241.575 143.551 98.0234 34.9455 105.767 75.1295 11.6831 16.3912 23.6195 66.62 17.9618 14.9316 17.8489 13.1705 42.1866 46.0438 35.8493 12.5632 20.5762 14.8366 123.935 22.9273 15.757 43.1705 31.959 19.1885 36.9714 13.9653 22.9434 52.8048 15.3363 22.3643 71.1307 18.986 12.8562 20.8062 31.681 36.9939 12.1044 24.867 26.1071 45.0237 19.4461 1008.12 672.755 15.8109 20.6612 335.369 255.707 79.6627
internal_count=11164 10063 1101 3569 357 744 6494 2205 191 171 1364 1812 707 668 110 1105 250 489 166 494 573 200 373 6005 4310 149 532 108 318 246 212 135 1341 270 1071 43 1028 383 210 45 231 558 221 104 645 1695 171 393 1192 216 150 78 116 102 323 115 71 82 64 976 579 397 130 424 302 42 60 89 255 68 56 72 49 171 176 137 44 79 57 503 91 59 174 128 71 150 51 92 214 61 90 289 77 52 84 126 150 49 101 106 183 79 4100 2736 64 84 1364 1040 324
cat_boundaries=0 1 2 3 4 5 6 7 8 9 10 11 12 13 14 15 16 17 18 19 20 21 22 23 24 25 26 27 28
cat_threshold=1 2 1 1 1 1 1 1 2 1 2 1 1 1 1 2 1 1 2 1 1 1 2 1 1 1 1 1
is_linear=0
shrinkage=0.05


Tree=2
num_leaves=120
num_cat=29
split_feature=2 2 2 2 2 2 3 0 2 1 2 3 2 3 2 2 0 2 2 1 2 3 1 1 3 3 2 2 2 1 3 3 2 2 0 2 1 1 2 2 1 0 2 2 2 2 2 2 1 3 2 2 1 2 2 2 1 2 3 1 3 3 2 3 2 2 3 2 2 3 2 2 3 3 3 3 3 3 2 3 2 2 3 1 2 3 2 1 2 2 3 2 2 2 2 2 2 2 2 1 2 3 2 1 2 1 1 2 2 1 2 3 0 1 2 1 1 0 0
split_gain=675.608 209.126 96.0834 17.0183 16.1677 12.6643 12.3485 9.17334 6.94954 7.14515 6.80984 10.0221 12.0855 6.84082 6.71247 6.69088 5.94848 5.5237 4.43734 5.98534 3.91196 3.76587 3.73601 3.366 3.26589 6.03105 3.03374 10.6051 4.68063 5.09082 2.85581 5.84593 2.46246 7.84171 2.40126 2.12249 2.10925 1.95069 1.70837 1.56687 1.38744 1.26546 1.25658 1.21588 11.9469 1.09602 1.07575 1.0162 2.81368 0.906201 0.8979 0.890943 0.476801 0.423317 0.406838 1.31605 0.643801 0.356069 0.324151 0.319726 0.31677 0.314235 0.307052 0.29717 0.290293 0.23524 0.230469 0.228849 0.204465 0.200687 0.16904 0.230299 0.165105 0.149744 0.134964 0.132034 0.126604 0.118473 0.114343 0.107464 0.10551 0.0824261 0.0765268 0.0752419 0.0528764 0.0479668 0.0452024 0.0438475 0.0397575 0.03816 0.0374249 0.0284568 0.0249273 0.0176792 0.0194976 0.0163832 0.0134012 0.0122772 0.0113894 0.00997997 0.00800085 0.00734323 0.00707914 0.00661486 0.00430259 0.00406971 0.00317034 0.00210636 0.00188194 0.00108926 0.000742144 0.000739457 0.000518469 0.000553788 0.000487701 2.80938e-05 2.16398e-07 3.67196e-07 2.20573e-07
threshold=139.50000000000003 13.500000000000002 334.50000000000006 64.500000000000014 227.50000000000003 465.00000000000006 1.5000000000000002 0 67.500000000000014 1 27.500000000000004 6.5000000000000009 24.500000000000004 1.0000000180025095e-35 485.50000000000006 42.500000000000007 2 733.50000000000011 43.500000000000007 3 1.0000000180025095e-35 1.0000000180025095e-35 4 5 3.5000000000000004 4.5000000000000009 8.5000000000000018 6.5000000000000009 1.0000000180025095e-35 6 8.5000000000000018 10.500000000000002 243.50000000000003 237.50000000000003 7 18.500000000000004 8 9 92.500000000000014 978.00000000000011 10 11 112.50000000000001 72.500000000000014 74.500000000000014 166.50000000000003 45.500000000000007 1.5000000000000002 12 36.500000000000007 159.50000000000003 280.50000000000006 13 399.50000000000006 4.5000000000000009 7.5000000000000009 14 303.50000000000006 1.5000000000000002 15 32.500000000000007 26.500000000000004 215.50000000000003 22.500000000000004 27.500000000000004 521.50000000000011 11.500000000000002 82.500000000000014 258.50000000000006 2.5000000000000004 189.50000000000003 201.50000000000003 5.5000000000000009 5.5000000000000009 4.5000000000000009 3.5000000000000004 9.5000000000000018 15.500000000000002 373.50000000000006 4.5000000000000009 187.50000000000003 4.5000000000000009 5.5000000000000009 16 97.500000000000014 1.0000000180025095e-35 20.500000000000004 17 150.50000000000003 4.5000000000000009 1.5000000000000002 172.50000000000003 36.500000000000007 153.50000000000003 146.50000000000003 70.500000000000014 9.5000000000000018 54.500000000000007 267.50000000000006 18 2.5000000000000004 3.5000000000000004 266.50000000000006 19 17.500000000000004 20 21 8.5000000000000018 1.5000000000000002 22 1.5000000000000002 2.5000000000000004 23 24 10.500000000000002 25 26 27 28
decision_type=2 2 2 2 2 2 2 9 2 1 2 2 2 2 2 2 9 2 2 1 2 2 1 1 2 2 2 2 2 1 2 2 2 2 9 2 1 1 2 2 1 9 2 2 2 2 2 2 1 2 2 2 1 2 2 2 1 2 2 1 2 2 2 2 2 2 2 2 2 2 2 2 2 2 2 2 2 2 2 2 2 2 2 1 2 2 2 1 2 2 2 2 2 2 2 2 2 2 2 1 2 2 2 1 2 1 1 2 2 1 2 2 9 1 2 1 1 9 9
left_child=1 6 4 7 22 23 20 46 9 58 11 12 35 -14 -7 24 26 37 -17 -20 21 112 50 53 59 -26 27 28 29 -8 36 -32 33 -6 105 -9 43 49 67 -19 51 47 52 95 -45 76 64 48 -22 65 66 68 -33 72 56 -56 -49 73 -5 -12 78 -44 77 82 86 -16 93 -38 -34 -55 75 -72 -4 98 103 -47 85 80 -25 89 -52 100 -53 -48 -40 -24 104 92 -68 108 -73 -79 -66 94 -2 -10 106 -85 -42 -88 110 -30 -70 -28 -3 -23 -83 -91 111 -102 -43 -18 113 -1 -98 -36 117 -114 -118
right_child=2 3 5 8 32 14 16 10 30 -11 15 -13 13 -15 17 18 79 39 19 -21 41 34 45 60 25 -27 74 -29 101 -31 31 42 40 -35 115 -37 38 -39 84 -41 57 81 61 44 -46 70 83 54 -50 -51 62 63 -54 69 55 -57 -58 -59 -60 -61 -62 -63 -64 -65 87 -67 88 -69 102 -71 71 90 -74 -75 -76 -77 -78 91 -80 -81 -82 96 -84 97 -86 -87 99 -89 -90 107 -92 -93 -94 -95 -96 -97 114 -99 -100 -101 109 -103 -104 -105 -106 -107 -108 -109 -110 -111 -112 -113 116 -115 -116 -117 118 -119 -120
leaf_value=-0.024708616552244319 0.021194030807247698 -0.017785434524647419 0.059760753638101509 0.061887095651560732 0.054351376155721977 0.16095860834174563 0.026176427673943188 -0.00088546075524408041 -0.0032333140951744618 0.0061213781094940226 -0.012058246199662191 0.060143132807163963 0.062608192140431979 0.015049755056952116 0.076073553858928514 0.044143402550994776 -0.023873905148616845 0.11868521986466152 -0.00048970063732768523 0.021160667382365272 -0.00081034116116171983 -0.0018780135840861614 0.038446459853658875 0.097018376363552469 0.047276293027885052 -0.0050504866358627443 -0.020108796800321401 0.05518622809642007 -0.022449362474966501 -0.012408471710760861 0.06378205173683614 0.0092269132404594178 0.039676966096033807 0.12459065097148192 -0.024315560947924551 0.011335201656841688 0.010307062208288168 0.11384877318328035 0.031125334599204559 0.14647116257836171 0.059521325702576434 -0.024303863171112373 0.025187582758052482 0.08684975505936747 0.0092455860048057219 0.051996116876884824 0.0036602620102249 -0.023694761103155174 -0.024205691325275239 0.10374399953896388 0.028746511199537264 0.053868060584583058 0.023357463715901344 0.071360652461805826 -0.010294751483730033 -0.020153668200219632 -0.015288549621648995 0.078236498027360754 0.077798624697607927 -0.006224847187231289 0.10600359040425547 0.038722217189863899 0.042037264666328705 0.069266044056749174 -0.011964227939234705 0.087890720991585625 0.032355315490331583 0.018138980403309662 0.048336110063651516 0.084063270664796907 0.062412194324515093 0.053703851728770235 0.069599690738881406 0.070125133238008272 -0.0093410194426513573 0.042768299915560429 0.043685541095374307 0.038451136437119955 0.087743496838469326 -0.0145348301948207 0.033500451291402077 -0.021920846831909209 0.060681137554607661 -0.0040152257561624546 0.026142399540584678 0.033169260870881838 -0.014492943612165937 -0.0062068368075713209 0.026261180031484824 -0.020565046904109423 0.048074369473336383 0.034169630871737876 -0.0086501783588977532 0.022785651334625831 0.017725721673170779 -8.811225230566578e-05 -0.020273295065026113 -0.0011625421496315972 0.062562664532354775 -0.011938018117542675 -0.023196989938435896 -0.020184527381422818 0.050623951962332638 -0.017803794989914135 -0.016308252744590645 -0.0030380121746234256 -0.020879175366749627 -0.019230219617103264 -0.022564033358851685 -0.022377682102850419 -0.023877403859081089 -0.023231141304771968 -0.024827519610371024 -0.024801193403531319 -0.019675807933857634 -0.024454123625206301 -0.024822575105291581 -0.024820796752983064 -0.024829265922682232
leaf_weight=368.96217849850655 8.3736142516136223 12.157671898603441 7.2318583726882997 6.8134588003158569 11.227550834417345 6.9496483504772177 19.474397480487823 68.935655534267426 9.9073718190193194 6.8458381891250619 69.106933280825615 11.292803585529326 16.027671247720722 14.314068108797072 7.0329700708389344 8.6753368377685529 11.773925289511686 13.55326557159424 88.918892949819565 49.801888227462769 31.705272138118744 19.081632018089294 7.8710370659828248 6.9907087087631243 7.5696398913860348 20.204871699213982 7.0194052606821069 9.7213811278343183 13.734030425548555 15.237115919589995 8.982889920473097 20.687029361724854 8.4525057673454302 6.1504196226596823 4.8015865683555603 73.319901585578918 27.636299431324005 12.098218828439711 6.095420539379119 8.1094905138015729 6.4325232803821617 27.849831283092499 12.498539537191393 5.1611882448196402 126.80816268920898 8.7929720282554609 7.6196175813674927 58.890012428164482 21.611722111701965 7.6825787723064414 26.91522017121315 10.879671275615697 8.3913383483886737 6.3217431008815748 56.271287977695465 84.951560541987419 37.141983866691589 5.9985384941101065 6.0368287265300751 35.584943115711212 6.6012597084045401 6.5284995436668387 8.8203803896903974 6.096676528453826 11.56098620593548 10.497095257043837 5.3537946939468366 14.078869521617888 6.2365207076072675 6.1190458536148071 6.6654627323150661 5.7041537761688215 10.389385819435118 7.0176806151866904 4.9455720186233512 6.9326750934123984 6.6188310086727133 5.9576460421085384 6.3337733745574951 5.1391374617815009 20.607802093029022 26.049094676971436 6.6353054344654074 6.7492504566907909 42.062829822301865 9.5069372653961164 17.131884098052979 8.9587760567665118 5.3514044284820557 6.2876564860343915 6.1197296380996704 11.133288502693174 11.143075078725813 5.5462877452373496 7.8517962098121634 7.1129848957061759 5.081384450197219 8.5491541624069196 5.9033674001693726 4.9198266863822964 20.450915545225143 4.8402529954910269 7.3850514888763428 5.5923272073268899 8.2913278639316541 12.523727118968965 10.150762617588041 5.5766909867525101 5.2996749877929679 5.0606100261211422 16.098931878805161 7.2174927592277518 227.13076686859131 287.34579774737358 10.416897177696226 15.360969543457033 62.35962450504303 22.305634215474129 15.349863052368162
leaf_count=1538 32 50 25 24 40 20 73 274 39 24 281 39 55 55 22 33 49 39 351 189 126 76 29 22 27 81 29 34 57 62 31 80 29 21 20 284 106 35 23 22 21 116 47 20 490 31 30 245 90 24 100 38 32 21 228 351 152 20 22 143 20 24 32 21 47 32 20 54 22 20 23 20 35 23 20 25 24 22 20 21 76 108 23 27 158 35 70 36 20 26 21 41 45 21 30 28 21 34 20 20 85 20 26 23 34 50 42 23 22 21 67 30 947 1198 43 64 260 93 64
internal_value=0 -0.0102266 0.0624015 0.00933583 0.0451032 0.10009 -0.021156 0.00410897 0.0186228 0.0473813 0.00703475 0.0145094 0.0115236 0.0401719 0.114481 0.00212339 -0.00587014 0.109004 0.00945246 0.00728296 -0.0224433 -0.0240829 0.0358176 0.0811103 -0.00603171 0.00921061 0.00203881 0.00716059 -0.00160113 0.00923903 0.0167088 0.0267556 0.0623397 0.0792105 -0.0109387 0.00541319 0.0143077 0.0973445 0.0203572 0.129087 0.0582126 -0.0183209 0.0198415 0.0106585 0.0122806 0.0459931 -0.0098673 -0.016531 -0.0102935 0.089425 0.0302249 0.0530073 0.0133047 0.0705471 -0.0179327 -0.0162253 -0.0204435 0.0675929 0.069362 -0.0100755 0.0970469 0.0298315 0.0332865 0.0597585 -0.0127931 0.0831497 0.0233022 0.0129503 0.0457858 0.0776085 0.0517388 0.05498 0.0655617 0.064294 -0.0163415 0.047928 0.0378008 0.032092 0.0926096 -0.0213003 0.030808 -0.0226137 0.0564491 -0.000399193 0.0267731 0.0355595 -0.0154932 -0.0091689 0.0293089 -0.0222619 0.0507902 0.0356621 -0.0103377 0.0203487 0.0195156 -0.0019189 -0.021102 -0.00242107 0.0609768 -0.0139229 -0.0237388 -0.0218592 0.0495765 -0.0190867 -0.0171865 -0.00233767 -0.0216288 -0.0199376 -0.0233971 -0.0230345 -0.0241476 -0.0236296 -0.0247748 -0.0247491 -0.0198717 -0.0244211 -0.0248262 -0.0248269 -0.0248239
internal_weight=0 2445.29 368.45 876.482 252.539 115.911 1568.81 560.834 315.648 19.6961 463.753 183.89 172.597 30.3417 65.9233 279.863 121.859 58.9736 147.396 138.721 1446.95 1035.22 164.123 49.9878 132.466 27.7745 80.5645 63.0072 53.2858 34.7115 295.951 57.0883 88.4158 17.378 51.7679 142.256 238.863 37.3109 89.8734 21.6628 71.0378 411.73 48.1054 148.99 131.969 58.2118 97.0816 290.572 53.317 25.2126 105.911 45.6857 29.0784 30.062 237.255 141.223 96.032 25.3521 12.8503 104.692 19.9257 19.027 73.4343 23.6117 74.1635 17.5301 32.4769 41.7152 22.0741 12.4408 34.215 18.4893 17.6212 19.3536 17.5573 15.7256 23.9968 64.614 13.3245 41.2946 47.523 121.158 17.515 22.918 48.1583 17.378 42.5007 31.6628 10.7052 36.1554 11.8239 17.0909 22.7041 21.7717 16.2254 17.0204 51.6981 15.2984 12.3359 22.0517 69.4603 18.5743 13.6216 12.6117 20.449 31.6054 36.1999 11.8643 24.2911 25.5115 43.9488 18.9914 983.454 656.308 15.4983 20.1626 327.146 249.436 77.7095
internal_count=11164 9901 1263 3407 906 357 6494 2205 1202 70 1812 707 668 110 194 1105 489 174 573 540 6005 4310 602 163 532 108 318 246 212 135 1132 214 304 61 210 558 918 113 341 61 243 1695 183 577 510 208 393 1192 216 78 394 159 112 101 976 579 397 84 46 424 62 71 271 82 302 54 123 160 77 41 120 64 60 64 72 56 88 239 42 171 176 503 61 91 181 64 174 128 40 150 41 63 92 83 62 67 214 61 41 90 289 77 48 52 84 126 150 49 101 106 183 79 4100 2736 64 84 1364 1040 324
cat_boundaries=0 1 2 3 4 5 6 7 8 9 10 11 12 13 14 15 16 17 18 19 20 21 22 23 24 25 26 27 28 29
cat_threshold=1 1 2 1 1 1 1 2 1 1 1 2 1 1 1 1 2 1 1 1 1 1 1 2 1 2 1 1 1
is_linear=0
shrinkage=0.05


Tree=3
num_leaves=123
num_cat=27
split_feature=2 2 2 2 2 3 0 2 3 2 1 2 0 3 2 3 2 3 2 0 3 2 3 2 3 1 2 2 2 2 1 2 1 3 3 0 3 2 2 2 1 2 2 2 2 2 3 2 2 2 2 0 3 2 2 1 2 2 3 3 2 2 2 1 1 2 3 2 2 3 2 2 3 2 3 2 2 3 3 3 3 2 3 0 2 1 2 2 2 2 2 3 2 1 2 2 2 2 2 1 2 3 1 3 2 1 1 2 2 2 1 2 3 0 1 2 3 3 1 1 0 0
split_gain=615.6 166.486 103.551 22.5144 13.9792 12.3403 8.70827 6.31713 8.72272 10.8298 6.33944 6.04845 5.79925 5.76322 7.73159 5.76226 5.72304 5.07112 7.50396 4.41283 6.66327 4.08922 5.56522 3.97167 3.80399 3.64201 2.92577 2.90358 9.47853 4.51518 4.73009 2.62431 4.34962 2.41873 3.34419 2.37255 2.3313 2.20833 2.14472 6.0924 2.38705 2.06533 3.07048 2.03274 2.02165 1.98609 3.72706 3.45738 1.83166 1.34166 1.3023 1.27527 1.18433 1.04718 1.01095 2.77337 0.79246 0.63525 0.586823 0.480044 0.578104 0.408829 1.31202 0.650108 0.397966 0.326187 0.321107 0.286727 0.262498 0.25528 0.192791 0.190028 0.167694 0.14875 0.134293 0.133239 0.124064 0.115599 0.108371 0.108336 0.0997404 0.0839057 0.0827212 0.10076 0.0764937 0.0714905 0.0675328 0.113616 0.0971345 0.061623 0.0570145 0.0483778 0.0450605 0.0427987 0.0387727 0.0244601 0.0165338 0.0135755 0.0117656 0.0098862 0.00817276 0.00745288 0.00666337 0.00547525 0.00430931 0.00389875 0.00321748 0.00212763 0.00211395 0.00191982 0.0011101 0.000759159 0.000755207 0.000531419 0.000567572 0.00049267 0.000271624 0.000154563 2.87629e-05 2.21494e-07 3.76305e-07 2.26149e-07
threshold=64.500000000000014 242.50000000000003 13.500000000000002 469.50000000000006 155.50000000000003 1.5000000000000002 0 27.500000000000004 6.5000000000000009 24.500000000000004 1 65.500000000000014 2 1.0000000180025095e-35 26.500000000000004 1.0000000180025095e-35 47.500000000000007 3.5000000000000004 36.500000000000007 3 1.0000000180025095e-35 56.500000000000007 1.5000000000000002 1.0000000180025095e-35 1.0000000180025095e-35 4 733.50000000000011 8.5000000000000018 6.5000000000000009 1.0000000180025095e-35 5 248.50000000000003 6 8.5000000000000018 10.500000000000002 7 1.5000000000000002 342.00000000000006 67.500000000000014 66.500000000000014 8 43.500000000000007 47.500000000000007 92.500000000000014 305.50000000000006 18.500000000000004 1.5000000000000002 16.500000000000004 112.50000000000001 651.50000000000011 72.500000000000014 9 34.500000000000007 45.500000000000007 1.5000000000000002 10 189.50000000000003 521.50000000000011 39.500000000000007 40.500000000000007 399.50000000000006 4.5000000000000009 7.5000000000000009 11 12 198.50000000000003 5.5000000000000009 27.500000000000004 899.50000000000011 11.500000000000002 385.50000000000006 36.500000000000007 7.5000000000000009 264.50000000000006 4.5000000000000009 560.50000000000011 166.50000000000003 3.5000000000000004 4.5000000000000009 3.5000000000000004 32.500000000000007 4.5000000000000009 11.500000000000002 13 211.50000000000003 14 169.50000000000003 176.50000000000003 164.50000000000003 222.50000000000003 60.500000000000007 1.5000000000000002 20.500000000000004 15 4.5000000000000009 36.500000000000007 220.50000000000003 9.5000000000000018 54.500000000000007 16 2.5000000000000004 3.5000000000000004 17 1.5000000000000002 17.500000000000004 18 19 8.5000000000000018 40.500000000000007 1.5000000000000002 20 1.5000000000000002 2.5000000000000004 21 22 10.500000000000002 1.0000000180025095e-35 1.0000000180025095e-35 23 24 25 26
decision_type=2 2 2 2 2 2 9 2 2 2 1 2 9 2 2 2 2 2 2 9 2 2 2 2 2 1 2 2 2 2 1 2 1 2 2 9 2 2 2 2 1 2 2 2 2 2 2 2 2 2 2 9 2 2 2 1 2 2 2 2 2 2 2 1 1 2 2 2 2 2 2 2 2 2 2 2 2 2 2 2 2 2 2 9 2 1 2 2 2 2 2 2 2 1 2 2 2 2 2 1 2 2 1 2 2 1 1 2 2 2 1 2 2 9 1 2 2 2 1 1 9 9
left_child=2 4 5 31 11 23 53 8 9 45 19 -2 27 14 -11 49 17 71 -19 41 -21 22 -18 24 113 65 52 28 29 30 -7 -3 44 38 -35 105 -15 69 39 -13 50 72 -43 -42 73 47 -47 -8 64 -5 -40 54 57 67 55 -25 76 -17 -50 60 -46 63 -63 -56 -36 80 84 92 -28 91 -39 -12 -9 -33 102 -54 -27 -75 94 -78 86 100 83 -67 -58 -55 88 -88 -6 -85 -23 -34 104 95 109 116 -84 106 -87 103 111 -31 -29 -94 117 -26 -83 -96 -97 112 -102 -53 -14 114 -1 -99 -69 -4 -37 120 -115 -121
right_child=1 3 6 15 25 12 7 10 -10 13 16 33 78 36 -16 26 21 18 -20 20 -22 90 -24 51 35 56 68 74 -30 101 -32 32 37 34 48 118 -38 70 40 -41 43 42 -44 -45 59 46 -48 -49 58 -51 -52 81 75 85 61 -57 66 -59 -60 -61 -62 62 -64 -65 -66 82 -68 93 -70 -71 -72 -73 -74 77 -76 -77 79 -79 -80 -81 -82 97 96 89 -86 98 87 -89 -90 -91 -92 -93 99 -95 107 108 -98 115 -100 -101 110 -103 -104 -105 -106 -107 -108 -109 -110 -111 -112 -113 -114 119 -116 -117 -118 -119 -120 121 -122 -123
leaf_value=-0.024705597771674168 0.064484470793158777 0.089680807420900191 -0.017818473079922955 0.13707868192736658 0.028308974773506568 0.024858606719613999 0.007100497555680989 -0.011804525732387791 0.055183275512072152 0.02768763027354279 -0.007984573045817487 -0.000745384550231531 -0.023850823487514768 -0.011028825848184175 0.095553305318028733 0.066194297790577547 0.026791283522361029 0.077377522746896119 0.0012293530320292695 0.064185243974312814 -0.0082003649642429302 0.004710939044358254 0.084773342223453313 -0.00079087027774930147 -0.0018348717197420223 0.037329876618451607 0.10198643104248051 -0.020012912932367635 0.050890103078734053 -0.022395330900332591 -0.012253388331895486 0.041799511821481304 0.064516340296010735 0.050305578110240667 0.0087651146725357485 -0.024302916445169315 0.030193521917302815 0.091678038263908301 -0.0018749241289582139 0.069417775220924002 0.012463974264166598 0.018069564919245509 -0.0052238590866960071 0.02672047987415558 0.05668332241511588 0.004820757549440253 0.031502890150446126 -0.016620597778707721 0.026512243114940954 0.109770641675697 0.01272347242999205 -0.024290937095522689 0.097700417847622983 0.0035561735842042554 -0.023667557754039559 -0.024190412471783343 0.052739391143988748 0.083947875746829242 0.044132834278868584 0.075478989236246005 0.070135051573526286 -0.010144349501282053 -0.020058481995376687 -0.015141565153264189 0.021254383133647557 0.038822710903237106 0.061178289253030531 -0.012080672057917793 0.1140579155867453 0.073379209220356831 0.082166701808886647 -0.0017311609005199631 -0.0032762340003770077 0.045550873564907536 -0.0091956650892216201 0.088729260412272026 0.048103570715733915 0.052716272261993873 -0.014384109532395155 0.039938217972262685 0.034893726681314727 -0.02185638683673986 0.036577369771328076 0.033597161664417799 0.045454607639448599 -0.003931484404151084 0.035162630294485485 0.027872421740761912 0.021031918359208271 0.02744133194386016 0.010847982658642044 0.059252527412601189 -0.015077190547336717 -0.0060908905798894445 -0.020476446048331591 -0.0092168249604493869 0.04034562570797106 -0.02017998716300233 -0.0011350127090013074 -0.01178320039807396 -0.023158684551413303 -0.02008982373436536 -0.017677595583393293 -0.013239337019177531 -0.016168149660711558 -0.0029717100528205117 -0.020795833123704217 -0.019121506928374932 -0.0078331614432366695 -0.022512339813288287 -0.022322203816826612 -0.023854402455990964 -0.023193581166947752 -0.024827473335788233 -0.024800487176816443 -0.019573405098823514 -0.011590265689240166 -0.017456113871955954 -0.024444836700524265 -0.024822406949129849 -0.024820582618121711 -0.024829266433213284
leaf_weight=359.9573580622673 7.1197464764118186 10.026968598365782 6.6882784962654132 9.5113713741302508 14.917207539081575 19.99089726805687 45.748848736286163 78.882459282875061 11.99282795190811 9.6174474060535484 20.773330092430115 5.8796060085296613 11.496164113283163 5.5482457280158988 7.4457657337188712 9.7594641447067279 15.877928733825685 5.1924413442611685 8.5833427906036359 5.8301037549972516 6.9921679496765137 6.9585739970207205 5.5973044335842124 31.679591059684753 19.04582953453064 9.4180340468883532 8.902569532394411 6.8796631693840036 10.27294737100601 13.429145336151125 15.049215137958525 10.833468258380888 8.5522944927215629 11.870359569787977 21.154102891683578 4.6862414479255676 8.9828740358352643 11.04280409216881 16.98774728178978 6.5302215218544006 42.259198367595673 18.174196422100067 63.853550374507904 61.231837838888168 26.426037490367889 57.183463722467422 16.972260922193527 23.125791668891907 26.362251430749893 8.5329105854034406 151.71574622392654 27.181132078170776 8.6266106963157672 7.6475581526756287 57.511030808091164 21.094876527786255 8.532886743545534 10.416462570428846 5.7568817138671866 6.4771390259265891 11.446842938661574 55.694962441921234 83.256611377000809 36.578455448150635 9.1318291723728198 6.3126634657382965 10.25827246904373 5.1041133999824542 9.1136549413204175 6.5893138647079459 10.294466078281401 29.260443806648254 6.2185198366641989 11.949577212333681 4.8995906114578238 7.9557850062847129 9.2622675895690936 10.64118707180023 5.0649812668561927 7.2356052696704856 6.208539515733718 25.484290659427643 5.6777641773223859 11.835443437099462 6.2379391491413108 6.7222053408622768 7.2865730822086361 20.051176577806473 6.6210137903690329 6.1926110386848441 8.2967613041400892 8.9152971804141981 10.131229877471926 8.9033428430557269 6.1596708595752698 5.4008052349090558 5.9734419584274292 4.9794055223464957 8.539220988750456 4.8614427447319057 19.981975108385086 4.74353402853012 5.4936435073614129 6.7541532516479483 8.1572077274322492 12.48573735356331 9.9410206675529462 5.4704744964838028 5.6462963819503784 5.1814319193363181 4.9486228376626995 15.719084069132803 7.0517545938491812 221.56111031770706 280.3069332242012 10.213939636945723 6.3193784952163696 5.2550759613513947 14.989886283874513 60.830751359462738 21.758805468678474 14.973429679870604
leaf_count=1538 23 29 28 24 54 73 182 319 39 31 84 22 49 21 24 27 59 20 33 23 28 26 21 126 76 33 23 29 34 57 62 37 27 39 81 20 34 31 67 21 160 69 255 223 85 219 65 92 96 21 578 116 23 30 245 90 28 29 20 20 35 228 351 152 34 22 33 21 22 20 29 112 25 40 20 22 31 35 21 25 22 108 20 42 21 27 26 72 24 21 31 28 42 36 26 22 20 21 34 20 85 20 23 28 34 50 42 23 23 22 21 67 30 947 1198 43 26 22 64 260 93 64
internal_value=0 0.0393912 -0.0143532 0.0773045 0.0240165 -0.0210776 0.00398542 0.00680582 0.0139344 0.0111015 0.00206299 0.0188499 -0.00576439 0.0375949 0.0573017 0.0996595 0.0121194 0.00306865 0.0299315 -0.00355562 0.0247123 0.0278427 0.0419037 -0.0223892 -0.0240647 0.0373313 0.0915867 0.00197421 0.00691945 -0.00156926 0.00891955 0.0650829 0.0630804 0.0179446 0.0259796 -0.0107868 0.0144541 0.0753793 0.0158476 0.0361754 0.0149208 -0.00572436 -6.29315e-05 0.020899 0.055902 0.00524936 0.0109276 -0.00086425 0.0213524 0.124165 0.0112535 -0.0182007 0.0834966 -0.00971925 -0.0163929 -0.0101441 0.048037 0.0753601 0.0296705 0.0629003 0.060749 -0.017808 -0.0160847 -0.020353 0.0125309 0.0313429 0.0543825 -0.0126383 0.108093 0.0649932 0.0870892 -0.00432749 -0.0111813 0.0466162 -0.0162018 0.0933963 0.0419086 0.0489261 -0.0212243 0.0445224 0.0289241 -0.022563 0.0350447 0.0333863 0.0496629 -0.000389556 0.0281659 0.0298155 0.026072 0.0314826 0.00804863 0.0618297 -0.0153474 -0.0090247 -0.0222041 -0.0101871 0.0385093 -0.0210225 -0.00236678 -0.01377 -0.0237126 -0.0217935 -0.0189761 -0.014342 -0.017054 -0.00228503 -0.0215588 -0.0198391 -0.00850962 -0.0233632 -0.0229926 -0.024131 -0.0236009 -0.0247734 -0.0247471 -0.0197722 -0.0118094 -0.017659 -0.024411 -0.0248261 -0.0248269 -0.0248238
internal_weight=0 714.035 2099.28 206.014 508.021 1536.04 563.239 467.109 186.618 174.625 280.491 366 121.183 31.5943 17.0632 72.8188 100.54 63.8096 13.7758 179.951 12.8223 36.7306 21.4752 1414.86 1010.6 142.021 54.7745 80.7586 63.4857 53.2128 35.0401 133.195 123.168 358.88 74.2754 51.2077 14.5311 45.3942 284.604 12.4098 272.195 167.129 82.0277 103.491 77.7743 143.03 74.1557 68.8746 62.4051 18.0443 168.703 404.265 36.7583 96.1303 285.816 52.7745 50.945 20.1759 32.1191 44.35 37.8729 233.041 138.952 94.0895 30.2859 91.0764 25.0291 73.2213 18.0162 24.0569 21.3373 50.0338 85.101 33.4242 17.2729 16.5824 25.9159 22.5908 40.4245 16.4979 55.0845 118.449 35.9919 24.3407 14.7708 22.909 48.876 27.3377 21.5382 18.0281 15.2553 17.4676 41.8474 31.3739 35.3595 22.4706 11.6512 50.6187 15.2614 21.7468 67.8308 18.1727 12.3733 16.8854 20.1006 31.5316 35.4253 11.6301 11.0471 23.7294 24.9306 42.9002 18.5479 959.388 640.264 15.1933 11.4235 11.9434 19.6761 319.124 243.32 75.8042
internal_count=11164 2465 8699 607 1858 6494 2205 1812 707 668 1105 1364 489 110 55 191 386 249 53 719 51 137 80 6005 4310 494 146 318 246 212 135 416 387 1341 270 210 55 135 1071 43 1028 668 324 383 252 558 284 274 231 45 645 1695 101 393 1192 216 171 56 116 140 120 976 579 397 115 323 82 302 45 75 60 196 344 112 72 45 89 75 171 56 198 503 125 85 49 91 176 98 78 63 57 55 174 128 150 92 40 214 61 90 289 77 52 70 84 126 150 49 45 101 106 183 79 4100 2736 64 47 50 84 1364 1040 324
cat_boundaries=0 1 2 3 4 5 6 7 8 9 10 11 12 13 14 15 16 17 18 19 20 21 22 23 24 25 26 27
cat_threshold=1 1 2 2 1 1 1 2 1 2 1 1 1 1 2 1 1 1 1 1 1 2 1 2 1 1 1
is_linear=0
shrinkage=0.05


Tree=4
num_leaves=125
num_cat=29
split_feature=2 2 2 2 2 3 2 0 2 3 2 2 0 2 3 2 2 2 2 3 2 2 1 3 3 2 1 3 1 2 3 2 2 2 3 0 3 3 1 3 2 2 2 1 2 2 2 2 0 2 1 2 2 1 2 1 2 2 3 2 3 3 1 2 2 1 2 2 1 2 2 3 1 2 3 3 3 3 3 3 2 3 3 2 3 0 2 1 2 2 2 3 2 2 1 2 2 2 2 2 2 2 1 2 3 2 1 1 2 2 2 1 2 3 0 1 2 3 3 1 1 0 0 2
split_gain=570.766 136.77 101.627 23.025 20.3305 12.3295 12.2442 8.26528 5.86531 7.64064 9.72654 6.04883 5.6534 5.18105 4.89097 6.09723 4.75231 4.15554 4.15163 10.5982 15.5514 4.03152 3.94681 5.35114 3.84184 3.08109 3.06993 2.99619 5.41705 5.23687 2.83209 4.07805 17.9019 5.06956 2.56957 2.34368 2.16237 9.76696 2.16232 2.14292 1.91286 1.89821 5.20469 2.16295 1.85937 3.46292 3.32313 1.81782 1.28476 1.21105 1.03042 1.01906 1.00531 2.73313 0.810699 0.688128 0.656725 0.524608 0.523148 0.513782 0.452267 0.446014 0.418228 0.410684 1.3075 0.656302 0.342601 0.336309 0.308899 0.283077 0.281219 0.200513 0.163411 0.152088 0.137628 0.132092 0.127737 0.298036 0.117871 0.109255 0.102017 0.100956 0.0862937 0.0853984 0.0704702 0.0861184 0.0688071 0.0679289 0.0589108 0.0982019 0.0854985 0.053428 0.0473568 0.0448996 0.0417577 0.0393878 0.0239909 0.0188182 0.0162721 0.0139591 0.0137488 0.0112735 0.00978883 0.00834769 0.00543644 0.00431432 0.00373438 0.00326461 0.00214849 0.00206306 0.00195824 0.00113118 0.000776522 0.000771223 0.000544716 0.00058172 0.000497544 0.000267753 0.000155063 2.94464e-05 2.27201e-07 3.85817e-07 2.31759e-07 2.7462e-09
threshold=64.500000000000014 242.50000000000003 13.500000000000002 243.50000000000003 459.50000000000006 1.5000000000000002 155.50000000000003 0 27.500000000000004 6.5000000000000009 24.500000000000004 42.500000000000007 1 65.500000000000014 1.0000000180025095e-35 26.500000000000004 479.50000000000006 303.50000000000006 48.500000000000007 1.0000000180025095e-35 46.500000000000007 1.0000000180025095e-35 2 1.5000000000000002 1.0000000180025095e-35 733.50000000000011 3 3.5000000000000004 4 36.500000000000007 3.5000000000000004 8.5000000000000018 6.5000000000000009 1.0000000180025095e-35 52.500000000000007 5 8.5000000000000018 9.5000000000000018 6 1.5000000000000002 109.50000000000001 67.500000000000014 66.500000000000014 7 18.500000000000004 20.500000000000004 16.500000000000004 92.500000000000014 8 72.500000000000014 9 45.500000000000007 1.5000000000000002 10 978.00000000000011 11 198.50000000000003 521.50000000000011 39.500000000000007 355.50000000000006 5.5000000000000009 37.500000000000007 12 4.5000000000000009 7.5000000000000009 13 258.50000000000006 399.50000000000006 14 27.500000000000004 198.50000000000003 14.500000000000002 15 166.50000000000003 7.5000000000000009 11.500000000000002 3.5000000000000004 1.0000000180025095e-35 11.500000000000002 4.5000000000000009 34.500000000000007 5.5000000000000009 32.500000000000007 4.5000000000000009 11.500000000000002 16 34.500000000000007 17 169.50000000000003 176.50000000000003 164.50000000000003 1.0000000180025095e-35 280.50000000000006 20.500000000000004 18 4.5000000000000009 36.500000000000007 4.5000000000000009 267.50000000000006 220.50000000000003 9.5000000000000018 54.500000000000007 19 2.5000000000000004 1.5000000000000002 17.500000000000004 20 21 8.5000000000000018 40.500000000000007 1.5000000000000002 22 1.5000000000000002 2.5000000000000004 23 24 10.500000000000002 1.0000000180025095e-35 1.0000000180025095e-35 25 26 27 28 11.500000000000002
decision_type=2 2 2 2 2 2 2 9 2 2 2 2 9 2 2 2 2 2 2 2 2 2 1 2 2 2 1 2 1 2 2 2 2 2 2 9 2 2 1 2 2 2 2 1 2 2 2 2 9 2 1 2 2 1 2 1 2 2 2 2 2 2 1 2 2 1 2 2 1 2 2 2 1 2 2 2 2 2 2 2 2 2 2 2 2 9 2 1 2 2 2 2 2 2 1 2 2 2 2 2 2 2 1 2 2 2 1 1 2 2 2 1 2 2 9 1 2 2 2 1 1 9 9 2
left_child=2 6 5 -3 17 21 13 51 9 10 44 27 30 -2 15 -12 -6 55 19 20 -13 24 75 -24 114 50 70 68 74 -30 31 32 33 -7 78 106 41 -38 61 -16 62 42 -15 49 46 -46 -9 -45 52 -43 57 69 53 -23 -27 66 73 -18 -42 -40 -58 67 -39 65 -65 -54 -5 -19 80 93 82 -61 -21 -28 -29 -20 77 -75 97 95 -10 98 88 103 85 -72 -70 101 90 -90 -8 -87 -68 105 96 110 117 -32 -57 -86 107 -53 104 112 -95 118 -26 -85 -97 -98 113 -105 -50 -14 115 -1 -102 -71 -4 -37 121 -116 -122 -33
right_child=1 3 7 4 16 12 26 8 11 -11 14 18 79 36 39 -17 25 38 22 72 -22 48 23 -25 35 54 56 28 29 -31 34 123 -34 -35 -36 119 37 40 59 -41 58 43 -44 47 45 -47 -48 -49 83 -51 -52 87 63 -55 -56 81 60 -59 -60 71 -62 -63 -64 64 -66 -67 92 -69 86 94 84 -73 -74 76 -76 -77 -78 -79 -80 -81 -82 -83 -84 100 99 91 -88 -89 89 -91 -92 -93 -94 102 -96 108 109 -99 -100 -101 116 -103 -104 111 -106 -107 -108 -109 -110 -111 -112 -113 -114 -115 120 -117 -118 -119 -120 -121 122 -123 -124 -125
leaf_value=-0.024702503512350971 0.058906885303833957 0.21233675824164744 -0.017692433154053177 0.033646196662933205 0.12190681575687337 0.017541372005217253 0.026825777555956439 0.0068745831380409685 -0.013623247179306653 0.050887538522668196 0.026253502829519118 0.016612580743589428 -0.023827206026778971 -0.00072742606849646337 -0.010875780739230522 0.084582829029983542 0.061186657183001203 0.051912842598765475 -0.0056917392119982665 -0.005593978490650524 0.097700752341532193 -0.00077185147693942485 0.00081163227449834838 0.041335591499805549 -0.001792639896107175 0.089764162766670708 0.03505225815867679 -0.012457107282966798 0.069767240967100144 0.0010866219017178806 -0.022182626552891823 -0.019168446295495193 0.093395458587318597 -0.022340206749043454 0.016438181085716094 -0.02443532255403065 0.085620064178673544 0.0067773517429424533 0.066950816822717363 0.028557018611842767 0.024357384834403265 -0.0018318461418948186 0.063097270374111517 0.012002037617175297 0.024141340589439536 0.0020492719410446373 -0.016483024637178614 0.025361286571880207 -0.024277700520182514 0.012248698196394313 0.085926248578602982 -0.0038491634211144142 -0.02363973502830417 -0.024174769537631226 0.1074384156016206 0.048888040058813961 0.0450888581284467 0.074857533101410162 0.039684348422205029 0.07465840030078702 0.060146000488339103 0.068191959960687901 0.018935498599603029 -0.0099946221804300475 -0.019961820673092559 -0.01499376289436969 0.042791319022070923 0.062365492383239796 -0.008303212811740816 -0.011925725910386303 0.036398922839759977 0.085653413051443278 0.0029823237580779006 0.038392545480026768 -0.0032146252191785083 0.0026316089678922062 0.038140467583339374 0.053205896261379261 -0.012444135168588721 -0.014232779456303813 -0.00973436428117193 0.057521279396784378 0.03284570877817574 -0.02179069629078462 0.034371857425760467 0.03329595229245369 -0.0038772009242064895 0.0034554092138138386 0.033089813993467353 0.026423781197651347 0.020077441981589159 0.027719812032328928 0.046909808297871947 -0.014929043225578207 -0.0059764092520501275 -0.020386396797766066 -0.0090722624360774651 -0.018731319856422356 0.052295145986050874 0.037768443432607213 -0.020085212110405846 -0.001108104120452491 -0.011628566799133953 -0.023119543977776023 -0.013084874170321512 -0.016026977579967648 -0.0029066584204888724 -0.020711075802436602 -0.019011316106019381 -0.0076995056844990006 -0.022459589573916149 -0.02226561117511934 -0.023830868942129234 -0.023155200163811354 -0.024827429250238276 -0.024799764887897334 -0.019469516440845575 -0.011435929740133886 -0.01732627750910112 -0.024289967781060812 -0.024822234723554784 -0.02482036485257906 -0.024829265513778637 -0.019166791746887003
leaf_weight=351.17335242033005 7.5939860045909873 2.7929780185222617 6.5701587200164813 9.324241101741789 8.897187262773512 20.265105739235878 15.34553298354149 46.074848771095276 35.656903505325317 12.673232853412626 9.8874526917934418 19.338146984577183 11.225215300917631 5.8752251565456373 5.4873913228511801 8.1923339366912842 10.681082069873812 28.572831630706787 56.205313265323639 18.038844123482704 8.5169195532798749 31.654544591903687 21.568203002214432 13.090713977813719 19.010914921760559 16.97383484244347 9.7762530744075757 10.783233225345613 5.6101728975772875 5.4931197166442871 6.4067700505256751 5.1370396316051465 6.358393430709838 13.131738066673277 7.1336347609758368 14.627903938293457 6.0513808727264395 22.476762801408768 14.22747126221657 9.2582356333732587 30.582387506961823 16.955926358699799 6.999639630317688 42.789210677146912 28.804464936256409 46.170780837535858 22.744604170322418 62.890035390853882 26.528831481933594 153.65843111276627 15.557404696941374 6.6958288997411737 56.165866404771805 20.590705722570419 10.502635061740873 7.3603768050670642 11.329049944877626 20.459372580051422 6.8064864277839652 8.7067744731903094 8.9088565111160261 7.2990327179431906 10.321257770061491 55.132828116416931 81.60324838757515 36.028770565986633 14.988383710384371 10.531737506389616 16.928102508187294 5.042823404073717 6.562557578086853 7.9170981347560874 8.025132894515993 6.9608859419822711 6.4293053746223441 5.2084630429744712 9.8496373593807203 6.6291680335998535 7.3148489445447913 4.9926475435495368 31.99716505408287 8.0917454659938794 6.4290025830268851 24.933338105678558 5.8892869949340803 6.7309211492538514 18.245576247572899 7.6748031377792367 7.5473461151123074 20.617912739515305 6.761741191148757 11.873812824487684 13.063182979822157 9.9796248972415942 8.8492780923843402 6.0348253548145276 5.3512557148933393 10.297915518283842 6.6892784237861633 6.2193720042705536 4.8799281120300284 8.5295340418815595 4.8044955730438259 19.524536654353142 6.6653219461441031 8.0263812541961652 12.448688596487047 9.7364238202571851 5.3668644428253174 5.602240577340126 5.0660887956619254 4.8393824994564083 15.348551124334334 6.8900813162326804 216.12802389264107 273.44067573547363 10.015962004661558 6.246557891368866 5.1641387939453125 4.573724865913392 59.339369833469391 21.225385800004005 14.606227874755858 4.9002313166856766
leaf_count=1538 23 7 28 29 21 77 54 182 148 39 31 68 49 22 21 24 28 87 226 71 30 126 79 47 76 39 33 41 20 21 26 22 20 57 27 64 19 83 39 34 108 67 21 160 109 175 92 223 116 578 36 27 245 90 22 21 36 52 23 23 27 21 37 228 351 152 48 30 69 21 22 20 31 22 26 21 32 21 28 21 133 23 22 108 20 23 74 30 26 72 24 40 41 42 36 26 22 40 20 20 21 34 20 85 28 34 50 42 23 23 22 21 67 30 947 1198 43 26 22 20 260 93 64 21
internal_value=0 0.036882 -0.0142035 0.0696791 0.0678667 -0.0209979 0.0228517 0.00386356 0.00658256 0.0133865 0.0106956 0.00200136 -0.00565972 0.01803 0.0352538 0.0526838 0.0873768 0.0560168 0.00885922 0.0199631 0.041406 -0.022334 0.00262737 0.0161176 -0.0240461 0.0832349 0.0350503 -0.00584211 0.00855986 0.035789 0.00191228 0.00930996 0.0164999 0.00185982 -0.00991153 -0.0106353 0.0171805 0.0246714 0.0636665 0.0138826 0.0194166 0.0152056 0.033972 0.0143311 0.00508948 0.0105367 -0.00084503 0.0199522 -0.0180791 0.0108494 0.0754182 -0.00957198 -0.0162537 -0.00999532 0.09652 0.0460873 0.044617 0.0701685 0.0271476 0.0739255 0.0517171 0.0568458 0.0106034 -0.0176819 -0.015943 -0.020261 0.0419493 0.054728 -0.009808 -0.0124833 0.0296089 0.0798948 -0.00295332 0.0402911 -0.00900481 -0.00498584 0.0424761 0.0456184 -0.0177372 -0.021147 -0.011784 0.0530725 0.0273912 -0.0225113 0.0329822 0.0314743 -0.00600732 -0.000380144 0.0266937 0.0282101 0.0247617 0.0297372 0.0447092 -0.0152008 -0.00888147 -0.0221452 -0.0100372 -0.020055 0.0505102 0.0361164 -0.0209417 -0.00231357 -0.0136167 -0.0236858 -0.0141906 -0.0169203 -0.00223346 -0.0214875 -0.0197391 -0.00837016 -0.0233286 -0.0229499 -0.0241139 -0.0235716 -0.024772 -0.0247451 -0.0196712 -0.0116547 -0.0175313 -0.0244007 -0.024826 -0.0248268 -0.0248236 -0.0191676
internal_weight=0 743.069 2069.71 222.637 219.844 1504.08 520.432 565.631 470.429 189.293 176.62 281.135 120.521 373.001 32.8254 18.0798 83.0715 136.772 149.992 53.919 27.8551 1383.56 96.0727 34.6589 986.574 74.1743 147.431 131.144 28.3158 11.1033 80.9457 49.7925 39.7552 33.3968 31.1532 50.6612 365.407 76.2383 77.2549 14.7456 70.1869 289.168 12.8749 276.294 143.795 74.9752 68.8195 105.679 396.983 170.614 46.6979 95.2024 281.176 52.2453 27.4765 59.5172 53.4539 31.1405 37.3889 30.8513 20.2379 46.4036 32.798 228.931 136.736 92.1946 37.3758 39.1046 102.828 72.3023 93.9775 16.6239 26.064 33.2159 17.2125 61.4138 23.4397 13.5901 24.0195 39.5757 67.6541 22.1414 56.7015 115.807 37.276 25.1673 35.1737 22.9002 50.2725 28.1653 22.1073 18.6047 28.0516 41.2101 31.0922 34.5831 22.2429 16.7047 14.0497 12.1087 49.5657 15.2254 21.4494 66.2413 16.6449 19.7607 31.4596 34.6698 11.4017 10.9535 23.1814 24.3639 41.8774 18.1153 935.913 624.614 14.8959 11.2894 11.7343 19.2016 311.299 237.353 73.9456 10.0373
internal_count=11164 2465 8699 607 600 6494 1858 2205 1812 707 668 1105 489 1364 110 55 198 402 573 200 98 6005 373 126 4310 177 494 532 108 41 318 197 154 134 121 210 1341 270 220 55 251 1071 43 1028 558 284 274 383 1695 645 116 393 1192 216 61 182 171 80 131 82 63 138 120 976 579 397 118 117 424 302 323 43 102 108 67 247 75 43 94 171 281 64 198 503 125 85 143 91 176 98 78 63 89 174 128 150 92 66 41 40 214 61 90 289 70 84 126 150 49 45 101 106 183 79 4100 2736 64 47 50 84 1364 1040 324 43
cat_boundaries=0 1 2 3 4 5 6 7 8 9 10 11 12 13 14 15 16 17 18 19 20 21 22 23 24 25 26 27 28 29
cat_threshold=1 2 1 1 1 2 1 1 2 1 1 1 1 1 1 1 1 1 1 1 1 1 1 2 1 1 1 1 1
is_linear=0
shrinkage=0.05


Tree=5
num_leaves=123
num_cat=29
split_feature=2 2 2 2 2 3 2 0 0 2 3 2 2 2 3 2 2 2 1 3 2 2 3 3 2 3 2 2 1 1 1 2 3 2 0 3 3 3 3 2 2 2 3 2 2 1 2 0 1 2 1 2 2 1 1 2 3 2 2 1 2 1 1 3 2 2 2 2 3 3 2 2 3 2 3 2 2 2 2 3 3 3 2 3 2 1 2 2 2 0 3 1 2 2 2 2 2 2 3 2 3 1 2 2 1 1 3 2 2 1 2 2 3 3 0 1 3 1 1 0 0 2
split_gain=530.498 113.671 99.7267 15.0678 15.6741 12.3137 10.7734 7.84602 5.50861 5.45301 6.72919 8.76489 5.71748 4.47161 4.18508 4.89555 4.09146 4.08101 4.81125 3.87939 3.59085 3.43754 2.86578 5.3831 2.7193 2.68452 3.84747 15.1767 5.01223 2.60773 2.50761 3.0111 2.47167 2.46791 2.31467 1.97389 1.93635 8.12058 1.7576 9.39637 2.70374 1.74172 3.32119 3.19432 1.72531 1.69244 1.63923 1.29391 1.04658 0.999285 2.69299 0.992887 0.810146 0.565553 0.564207 0.557612 0.466118 0.412397 1.30248 0.662378 0.388201 0.335928 0.302082 0.298349 0.345164 0.291331 0.287815 0.243798 0.229265 0.220943 0.211109 0.18858 0.117932 0.117036 0.110115 0.100529 0.0869038 0.0822208 0.186954 0.081239 0.0750526 0.0741846 0.0666519 0.061845 0.0683008 0.0580063 0.0516239 0.0853327 0.0755484 0.0479287 0.0639725 0.0442262 0.0400048 0.0391951 0.0344905 0.0190319 0.0139613 0.0132251 0.00978126 0.00852562 0.00760935 0.00532639 0.00431758 0.00358364 0.00357633 0.00243267 0.00229144 0.00216889 0.0019972 0.0011525 0.000895803 0.000794243 0.000787508 0.000654181 0.00055833 0.000596181 0.000155502 3.01461e-05 2.32841e-07 3.95394e-07 2.37512e-07 2.76689e-09
threshold=64.500000000000014 242.50000000000003 13.500000000000002 243.50000000000003 469.50000000000006 1.5000000000000002 155.50000000000003 0 1 27.500000000000004 6.5000000000000009 24.500000000000004 42.500000000000007 65.500000000000014 1.0000000180025095e-35 26.500000000000004 1.0000000180025095e-35 43.500000000000007 2 1.0000000180025095e-35 486.50000000000006 303.50000000000006 3.5000000000000004 4.5000000000000009 47.500000000000007 3.5000000000000004 8.5000000000000018 6.5000000000000009 3 4 5 649.50000000000011 52.500000000000007 47.500000000000007 6 1.5000000000000002 8.5000000000000018 9.5000000000000018 1.0000000180025095e-35 67.500000000000014 109.50000000000001 18.500000000000004 1.5000000000000002 16.500000000000004 112.50000000000001 7 73.500000000000014 8 9 1.5000000000000002 10 39.500000000000007 536.50000000000011 11 12 218.50000000000003 39.500000000000007 4.5000000000000009 7.5000000000000009 13 355.50000000000006 14 15 40.500000000000007 399.50000000000006 736.00000000000011 258.50000000000006 198.50000000000003 7.5000000000000009 18.500000000000004 166.50000000000003 25.500000000000004 11.500000000000002 48.500000000000007 4.5000000000000009 34.500000000000007 4.5000000000000009 189.50000000000003 201.50000000000003 5.5000000000000009 32.500000000000007 3.5000000000000004 34.500000000000007 7.5000000000000009 215.50000000000003 16 169.50000000000003 176.50000000000003 164.50000000000003 17 1.0000000180025095e-35 18 4.5000000000000009 280.50000000000006 20.500000000000004 4.5000000000000009 7.5000000000000009 267.50000000000006 2.5000000000000004 2.5000000000000004 1.0000000180025095e-35 19 17.500000000000004 42.500000000000007 20 21 1.5000000000000002 8.5000000000000018 1.5000000000000002 22 23.500000000000004 1.5000000000000002 2.5000000000000004 1.0000000180025095e-35 23 24 1.0000000180025095e-35 25 26 27 28 11.500000000000002
decision_type=2 2 2 2 2 2 2 9 9 2 2 2 2 2 2 2 2 2 1 2 2 2 2 2 2 2 2 2 1 1 1 2 2 2 9 2 2 2 2 2 2 2 2 2 2 1 2 9 1 2 1 2 2 1 1 2 2 2 2 1 2 1 1 2 2 2 2 2 2 2 2 2 2 2 2 2 2 2 2 2 2 2 2 2 2 1 2 2 2 9 2 1 2 2 2 2 2 2 2 2 2 1 2 2 1 1 2 2 2 1 2 2 2 2 9 1 2 1 1 9 9 2
left_child=2 6 5 -3 21 16 13 51 25 10 11 41 22 -2 15 -13 19 -14 33 114 -6 53 62 -24 -20 26 27 28 -7 67 52 -32 72 -19 104 -16 38 -38 39 -15 48 43 -43 -9 61 63 -41 49 -40 50 -18 71 -22 66 -42 70 -46 59 -59 -51 -47 -39 75 64 -23 -54 -5 80 -25 -62 -31 94 95 103 92 -11 99 81 -79 97 86 -72 -64 89 -85 -75 88 -88 -8 90 -69 98 108 -68 102 -27 105 -55 113 111 -87 -98 116 -53 -21 -78 110 -94 112 -101 -96 -49 -10 -73 115 -1 -4 -36 119 -116 -120 -28
right_child=1 3 7 4 20 8 29 9 74 12 -12 14 17 36 35 -17 47 18 24 34 30 45 23 68 -26 32 121 -29 -30 55 31 -33 -34 -35 117 -37 37 44 40 46 54 42 -44 -45 56 60 -48 76 -50 57 -52 73 65 79 -56 -57 -58 58 -60 -61 69 -63 82 -65 -66 -67 93 83 -70 -71 77 91 -74 85 -76 -77 96 78 -80 -81 -82 -83 -84 84 -86 100 87 -89 -90 -91 -92 -93 107 -95 106 -97 101 -99 -100 109 -102 -103 -104 -105 -106 -107 -108 -109 -110 -111 -112 -113 -114 -115 118 -117 -118 -119 120 -121 -122 -123
leaf_value=-0.02469933421688382 0.054116722882326995 0.1669650831517237 -0.017565040580757672 0.031711449999329525 0.10840669869251383 0.017018458742315022 0.025458512359248665 0.0066573793824074665 -0.023803043317392761 -0.01346954050155719 0.04713088692688816 0.024929851082205731 0.041043590381837108 0.085161393397596097 -0.010723197219355936 0.075709019535469838 -0.00075327535027817352 0.014731498786230353 -0.00012419282078620242 -0.0017513077936566739 0.056951697219789765 0.048073709414746688 0.042877153089131245 -0.01054516779794025 0.02534033237916529 -0.022123260613320525 -0.019058890891128853 0.0828537409913431 -0.022807174045763642 0.032989636235288021 0.072969198628500334 0.10765622840697936 0.015765364740908911 -0.00510657302050079 -0.024425578886227876 0.027054028215027337 0.076556917936926719 0.0074338787744754019 0.0021396344381001075 0.031921630014934303 0.015354183282656461 0.0043794178703088077 0.029106647742944358 -0.016344313151845875 0.023599702810238817 0.061007248636351236 0.014156099540337794 -0.024264146746412495 0.013039759345726785 -0.023611280179919921 -0.024158754661733447 -0.0069757469310180332 0.067989900126754946 0.045370821492165397 0.025091128826692739 0.052903222775855109 0.038588238581730369 -0.0098456122995799391 -0.019863681122169293 -0.014845180174963744 0.066761648556910191 0.0181145868948023 -0.0081654226143527062 0.06179318615031873 0.057763735980080513 0.076315548444340187 0.039958780692770583 0.031392482697661941 2.8589222717953648e-05 0.077596382109736434 0.04154901142665568 -0.011542308602678894 -0.012289049616313446 0.0041576359505135869 -0.014080883628903055 -0.0095867078057636709 -0.022049493462706234 0.04935147161098364 0.039212171533330141 0.052918033253510924 0.030982106021355822 0.035073639316765319 -0.0037958079049389202 0.029418679299543799 0.035928845315166137 -0.0031874279972088737 0.031204643108877068 0.025087217842079013 0.019184820712651016 0.033042961897991156 0.024920224716927755 -0.0065678094062603699 -0.020294893121212756 0.043622253379663432 -0.01460436889351592 -0.018616020329832089 -0.020425897704662091 0.048365559265974634 -0.0094213240045435687 -0.023079555275433788 -0.00069740793490412779 -0.018680873653510826 -0.015884766904957683 -0.0052263302093103993 -0.0028428433517896793 -0.020953675301751983 -0.012986323414566542 -0.018899651300523065 -0.02240576498765098 -0.022207889611533776 -0.013692793588250658 -0.023806791074469858 -0.023115983825389676 -0.012258348128278043 -0.024827383225526075 -0.024799023526099206 -0.017195146256670794 -0.02427670762067724 -0.024822058945899006 -0.02482014237717298 -0.024829265367187894 -0.01905721412966568
leaf_weight=342.60475292801857 8.0547618865966779 3.4536967873573294 6.4549391269683856 9.6433040797710401 9.0080072581768018 20.681685328483582 15.762759685516359 46.392685651779175 10.960910916328436 35.174433916807175 13.334833055734633 10.150470733642578 9.0835768282413465 5.1340507268905631 5.4280351996421805 8.9154138565063477 31.630121469497681 20.282037541270256 14.398484230041502 18.976865530014038 11.192978739738463 30.455866813659668 8.0614678561687487 10.426417633891107 38.56259560585022 6.2662158608436682 5.0395082235336286 6.9808536767959586 12.783660158514975 10.12500950694084 14.45998188853264 11.028094351291655 7.2518678903579703 69.051130667328835 14.274797439575195 9.5264343619346601 6.5923278927803031 24.530530780553818 64.230200529098511 14.655152350664137 37.541619598865509 58.047502815723419 17.726297944784164 22.372777223587036 30.257343798875809 15.212622493505476 113.8989779651165 25.892526745796204 33.510883539915085 54.85369049012661 20.098898559808731 5.5671750009059924 21.342991530895233 7.7291520237922686 24.643874496221542 9.1074797809123975 6.2602061033248892 54.584541857242584 79.990451663732529 35.492594003677368 10.25795415043831 10.518558382987974 16.788126066327095 7.5004862844943991 13.161425232887266 20.696068346500397 15.643676906824114 6.9588062167167672 10.085171863436697 8.6924000978469831 10.176875174045565 6.8905193060636538 7.2243862003087989 6.4178064465522766 4.9220915436744681 31.687203601002693 16.715709716081619 7.8390256166458157 10.823433905839918 8.5708398520946485 6.6436740756034842 7.8231923282146445 18.174971133470535 6.6329814791679409 10.261902093887327 4.9834173917770404 7.8012646436691311 21.169977605342865 6.8988717198371878 6.2138891518116006 8.4586040973663312 7.5610039830207851 5.913042485713957 13.69057512283325 5.6416485756635684 10.106817677617071 18.864122241735458 7.0484036207199097 5.9517314881086341 19.07831646502018 7.9834075570106506 5.6924802958965328 7.8987678885459891 6.1736351847648621 12.412557005882265 7.266168117523196 6.5986337661743155 5.2657970786094666 4.9535748064517966 4.7328214198350933 5.1600369364023209 14.987105414271353 6.7323732376098624 5.9392352700233459 210.82819141447544 266.74281230568886 5.0754341185092926 4.4639676809310922 57.884565591812134 20.705048158764839 14.248031616210936 4.8072038739919662
leaf_count=1538 23 7 28 29 18 80 54 182 49 148 39 31 33 17 21 24 126 74 52 76 28 88 27 41 137 26 22 20 54 33 31 22 27 277 64 34 19 90 239 56 139 219 65 92 104 39 415 116 120 245 90 23 50 21 85 27 20 228 351 152 25 37 69 20 35 42 48 23 40 20 31 29 28 25 21 133 74 23 32 23 22 25 74 22 32 20 26 72 24 20 28 31 26 41 24 40 83 20 25 85 32 25 34 25 50 32 28 23 22 21 22 67 30 25 947 1198 22 20 260 93 64 21
internal_value=0 0.0346221 -0.0140534 0.0632864 0.0617649 -0.0209168 0.0217688 0.00374553 -0.00555876 0.0063676 0.0128685 0.0103097 0.0019404 0.0172596 0.0331434 0.0486747 -0.0222777 0.00855075 0.00647652 -0.024027 0.0785028 0.0518169 -0.00573351 0.00825928 0.0184173 0.00184751 0.00897028 0.0157938 0.00180519 0.0329852 0.0750809 0.0879775 -0.00976458 -0.000602574 -0.0104844 0.013342 0.0164611 0.023455 0.0145993 0.0188304 0.0110624 0.00493536 0.010164 -0.000826199 0.0185636 0.05834 0.0161814 -0.0179562 0.00587678 -0.0161134 -0.00984729 -0.00942554 0.0689058 0.0428914 0.0192129 0.041584 0.0261692 -0.0175545 -0.0158003 -0.0201675 0.066956 0.0106393 -0.00966003 0.0525817 0.0509977 0.0720887 0.0392051 0.0280201 -0.00534625 0.0717315 0.0393807 -0.0130269 -0.0176103 -0.00211627 -0.0210683 -0.0116294 -0.0224585 0.0411457 0.0434711 0.0490453 0.0259799 0.0387347 -0.00589395 0.0311062 0.0333729 0.000269849 0.0253362 0.0267345 0.0235486 0.0293357 0.0278415 -0.00979673 -0.0220851 0.0416686 -0.0153373 -0.0199583 -0.0208594 0.0467992 -0.0110966 -0.0236584 -0.00165437 -0.0200214 -0.0167853 -0.00605586 -0.00218294 -0.0217175 -0.0137204 -0.0196377 -0.0232932 -0.0229063 -0.0141689 -0.0240965 -0.0235416 -0.0118738 -0.0247706 -0.024743 -0.0174022 -0.0243901 -0.024826 -0.0248267 -0.0248235 -0.0190581
internal_weight=0 771.315 2040.88 238.789 235.335 1472.91 532.526 567.967 119.89 473.67 191.894 178.56 281.776 379.828 34.0204 19.0659 1353.02 151.378 142.294 963.142 87.7281 147.607 130.398 28.5731 52.9611 81.1422 50.2929 40.4462 33.4653 152.698 78.7201 25.4881 30.8493 89.3332 50.1282 14.9545 371.774 78.159 293.615 133.688 159.927 144.539 75.7738 68.7655 71.5666 85.2808 128.554 389.88 97.7411 276.65 51.729 94.2974 53.232 62.326 62.1855 55.895 36.5175 224.921 134.575 90.3463 34.163 35.0491 101.825 51.1178 43.6173 42.0391 38.9776 96.8027 20.5116 18.9504 46.7875 63.172 23.5974 31.1254 38.7478 66.8616 113.229 36.6625 18.6625 23.3484 58.2765 18.0001 34.9631 38.5262 16.8949 19.3846 51.6329 28.9712 22.6616 21.6313 15.4174 26.3425 33.8257 29.3343 36.8295 16.373 48.5385 14.7776 18.7815 64.6908 12.9668 24.5566 19.4291 11.7408 31.3894 23.9819 17.4003 11.1788 22.6469 23.8111 10.8017 40.8796 17.6933 12.8298 913.013 609.348 11.5304 18.7388 303.666 231.533 72.1326 9.84671
internal_count=11164 2465 8699 607 600 6494 1858 2205 489 1812 707 668 1105 1364 110 55 6005 573 540 4310 191 409 532 108 189 318 197 154 134 494 173 53 121 351 210 55 1341 270 1071 488 583 558 284 274 251 227 471 1695 359 1192 216 393 120 182 224 171 124 976 579 397 84 127 424 143 123 92 118 323 81 45 144 268 94 125 171 281 503 111 55 64 198 56 143 125 54 77 176 98 78 71 51 110 150 89 158 66 214 41 79 289 52 108 84 48 126 106 74 49 101 106 46 183 79 54 4100 2736 50 84 1364 1040 324 43
cat_boundaries=0 1 2 3 4 5 6 7 8 9 10 11 12 13 14 15 16 17 18 19 20 21 22 23 24 25 26 27 28 29
cat_threshold=1 2 1 1 1 1 2 1 2 1 1 1 1 1 1 1 2 2 1 1 1 1 1 2 1 1 1 1 1
is_linear=0
shrinkage=0.05


Tree=6
num_leaves=128
num_cat=32
split_feature=2 2 2 3 2 2 2 0 0 2 3 2 2 2 3 2 2 3 2 3 2 1 3 3 2 3 1 2 3 2 2 2 3 0 1 2 3 3 3 3 3 2 1 2 2 1 2 1 1 0 2 1 1 2 1 2 1 2 2 1 3 1 3 3 2 1 2 3 2 2 2 3 1 3 3 3 3 3 2 3 2 2 3 3 2 3 3 1 3 2 1 0 3 2 2 2 2 2 2 2 2 2 2 3 2 3 1 2 2 1 1 3 2 2 1 2 2 3 3 0 1 2 1 1 0 0 2
split_gain=494.182 97.8641 95.4727 12.2955 10.5154 12.1952 9.51894 7.45215 5.36745 5.07084 5.95507 7.922 5.40986 4.15147 3.91664 3.88485 3.66837 9.34617 12.5887 3.60695 3.9899 3.35293 4.6744 3.25283 2.78935 2.74301 4.91135 4.45519 2.5459 3.6341 13.0181 4.83187 2.37845 2.28553 2.23089 2.12318 1.73942 6.83113 1.7299 2.56851 1.59577 5.89122 5.45664 2.47791 1.55277 1.37051 1.34772 1.33773 1.33553 1.30271 0.992879 2.65294 0.974094 0.967998 0.504731 0.474734 0.469705 0.413967 1.29698 0.668329 0.401053 0.353493 0.346649 0.338289 0.299779 0.295291 0.243744 0.238992 0.278986 0.212423 0.186396 0.167688 0.15763 0.139571 0.127289 0.124604 0.240198 0.117948 0.112192 0.110949 0.0990175 0.0884212 0.0671284 0.0662301 0.0645424 0.0604831 0.0830527 0.0550058 0.0534056 0.0586806 0.0432445 0.0415452 0.0557979 0.0406236 0.0343561 0.0327532 0.0301869 0.111862 0.0210582 0.0192428 0.0141429 0.0116453 0.0108756 0.00961189 0.00870655 0.00727706 0.00537692 0.0043224 0.00347163 0.00342446 0.00246956 0.00227112 0.00218882 0.00203668 0.00117405 0.000889281 0.00081232 0.00080406 0.000644989 0.000572264 0.000611044 0.000193791 3.08605e-05 2.386e-07 4.05397e-07 2.43409e-07 2.78634e-09
threshold=64.500000000000014 13.500000000000002 242.50000000000003 1.5000000000000002 243.50000000000003 469.50000000000006 155.50000000000003 0 1 27.500000000000004 6.5000000000000009 24.500000000000004 42.500000000000007 1.0000000180025095e-35 1.0000000180025095e-35 65.500000000000014 48.500000000000007 1.0000000180025095e-35 46.500000000000007 1.0000000180025095e-35 26.500000000000004 2 1.5000000000000002 1.0000000180025095e-35 303.50000000000006 3.5000000000000004 3 36.500000000000007 3.5000000000000004 8.5000000000000018 6.5000000000000009 1.0000000180025095e-35 52.500000000000007 4 5 490.00000000000006 8.5000000000000018 9.5000000000000018 3.5000000000000004 2.5000000000000004 1.0000000180025095e-35 73.500000000000014 6 109.50000000000001 109.50000000000001 7 94.500000000000014 8 9 10 1.5000000000000002 11 12 39.500000000000007 13 198.50000000000003 14 4.5000000000000009 7.5000000000000009 15 39.500000000000007 16 5.5000000000000009 72.500000000000014 355.50000000000006 17 258.50000000000006 40.500000000000007 399.50000000000006 198.50000000000003 25.500000000000004 18.500000000000004 18 7.5000000000000009 11.500000000000002 1.5000000000000002 6.5000000000000009 11.500000000000002 48.500000000000007 4.5000000000000009 34.500000000000007 4.5000000000000009 8.5000000000000018 5.5000000000000009 34.500000000000007 16.500000000000004 32.500000000000007 19 7.5000000000000009 215.50000000000003 20 21 1.0000000180025095e-35 4.5000000000000009 20.500000000000004 280.50000000000006 169.50000000000003 180.50000000000003 174.50000000000003 4.5000000000000009 7.5000000000000009 164.50000000000003 267.50000000000006 2.5000000000000004 2.5000000000000004 1.0000000180025095e-35 22 18.500000000000004 42.500000000000007 23 24 1.5000000000000002 8.5000000000000018 1.5000000000000002 25 23.500000000000004 1.5000000000000002 2.5000000000000004 1.0000000180025095e-35 26 27 15.500000000000002 28 29 30 31 11.500000000000002
decision_type=2 2 2 2 2 2 2 9 9 2 2 2 2 2 2 2 2 2 2 2 2 1 2 2 2 2 1 2 2 2 2 2 2 9 1 2 2 2 2 2 2 2 1 2 2 1 2 1 1 9 2 1 1 2 1 2 1 2 2 1 2 1 2 2 2 1 2 2 2 2 2 2 1 2 2 2 2 2 2 2 2 2 2 2 2 2 2 1 2 2 1 9 2 2 2 2 2 2 2 2 2 2 2 2 2 2 1 2 2 1 1 2 2 2 1 2 2 2 2 9 1 2 1 1 9 9 2
left_child=1 3 6 13 -4 24 15 53 28 10 11 38 25 14 119 -2 17 18 -14 20 -13 74 -23 48 56 65 73 -28 29 30 31 -5 77 109 69 -25 40 -38 39 -9 41 42 -17 52 61 63 -43 67 -7 50 51 -15 -42 70 -45 75 66 59 -59 -52 -46 -39 -57 -37 -49 80 -6 68 -26 82 94 -66 -19 -27 -18 98 -77 99 108 93 -11 104 96 102 -67 -84 -87 -80 91 -90 103 92 -71 113 107 -68 101 -98 -36 -30 110 -8 -58 118 116 -89 -102 121 -55 -16 -83 115 -95 117 -106 -96 -51 -10 -72 120 -1 -3 -35 124 -121 -125 -31
right_child=2 7 4 8 5 23 34 9 79 12 -12 19 16 49 33 36 21 72 -20 -21 -22 22 -24 35 47 26 27 -29 32 126 -32 -33 -34 122 55 45 37 44 -40 -41 43 46 -44 54 60 -47 -48 64 -50 81 57 -53 -54 78 -56 62 83 58 -60 -61 -62 -63 -64 -65 71 84 95 -69 -70 88 90 -73 -74 -75 -76 76 -78 -79 87 -81 -82 100 85 -85 -86 86 -88 105 89 -91 -92 -93 -94 112 111 -97 97 -99 -100 -101 106 -103 -104 -105 114 -107 -108 -109 -110 -111 -112 -113 -114 -115 -116 -117 -118 -119 -120 123 -122 -123 -124 125 -126 -127 -128
leaf_value=-0.024696085451097388 0.049957966115869223 -0.017309652622472246 0.13747270514144311 0.016735698115385365 0.029946592714886061 0.097022168973316669 0.022738877879603617 0.0043979397511009479 -0.023778322404223562 -0.013315494244625331 0.043818026201187389 0.02370470316377964 0.015309818899207562 -0.00073513225585263714 -0.0017108559343868698 0.060439586202112941 -0.0054839663251615616 -0.005755232852954051 0.085289971271080817 0.012829908553264664 0.068378365436703253 0.00014976456219590058 0.037067845546977805 0.043494801105385367 0.044651902486700978 -0.012461799049448278 0.062745057524143805 0.00077055550233343811 -0.02206272839866559 -0.018947858596537175 0.074291405947904843 -0.022290405775392257 0.015130393702947576 -0.024415596943949666 0.029666361497899821 0.061598529795285531 0.0690847728741497 0.0063313597052186161 -0.017034834077244005 0.032942392125645689 0.0020819924448887924 0.0065657169812798292 0.0057376637267749463 0.01474191084313557 0.02208010837598345 0.080414973248733729 0.017749563616993893 0.0559271374107334 0.073347003596807001 -0.024250265615349847 -0.023582179273358837 -0.024142359577827757 0.012549161858841185 -0.0068507697784156388 0.02385415358480519 0.039036572933204457 0.04225695897023448 -0.0096973601627263414 -0.019764060586413189 -0.01469585861543408 0.035040376552520805 0.017343681550942427 0.051580287655037277 0.072306795208291572 0.060846534779311824 -0.0080287979842078982 0.037420971426089959 0.056602533734901345 0.053128031058803649 0.029654957145188194 -0.011388057636173076 0.069949060385610412 0.0026188984228681621 -0.0031456504666678431 0.0026996579205410252 0.043051563437693938 0.032563086665947358 -0.012133991802593152 0.0040373688958497021 -0.013928466714816266 -0.0094398786292580993 -0.021987520233166302 0.030533090179564071 0.04891076230788477 -0.0037158170280422544 0.022090744546763578 0.029279463901327452 -0.0031183360854875291 0.027846022952777241 0.033784626534827937 -0.0064474766068312005 0.031161941423820547 0.023695776883377241 -0.020201928290435128 -0.014453945570491164 0.040700436511630689 0.029881701245328515 0.021786506661553059 0.033531042582191563 -0.018499271586331651 -0.020335030640818937 0.020005086684126188 0.044909696694477481 -0.0092754748404262465 -0.023038703176035111 -0.00068057238418583457 -0.018564937070160287 -0.015498169120970179 -0.0051236105172276962 -0.0027802522645820099 -0.020871611387940761 -0.012831524099951603 -0.018786517229311631 -0.022350851259463053 -0.022149023330233511 -0.013539255824168824 -0.023782156678170015 -0.023075917769105846 -0.012103301352544123 -0.024827335870534154 -0.024798266691136116 -0.016926575004986063 -0.024263130058497173 -0.024821878590524704 -0.024819912448892201 -0.024829265050972781 -0.018946159842492247
leaf_weight=334.24628844857216 8.5026696324348432 7.4788798838853854 4.0812783241271964 20.657915651798248 9.9540073573589307 13.448153853416443 11.657366424798967 128.32034802436829 10.70308886468411 34.703828394412994 13.978360801935194 10.40670108795166 19.965789735317234 31.606306672096252 18.943659842014313 13.948595464229584 55.601656943559647 18.191346541047096 9.4768026173114759 15.157821416854857 9.6165990829467773 22.139694631099701 13.993306159973143 9.6573204696178419 31.955756902694702 10.787323847413065 6.0600268840789813 5.5609399974346161 6.1291088163852789 4.9443704187870008 7.5838804244995108 12.874151989817618 7.3671022504568091 13.930351257324219 6.8302900493144971 33.906957536935806 7.11683765053749 22.798464417457581 8.5477835834026319 8.3966221809387189 64.367779165506363 42.778913915157318 6.7723507583141336 38.122490346431732 32.067049145698547 17.775023937225342 72.743899792432785 16.169596940279007 10.693202912807465 25.271828949451447 53.573696240782738 19.619151949882507 33.950719147920609 5.5284749269485491 25.270039528608322 12.402654469013216 8.0879069566726702 54.049760520458221 78.417222216725349 34.969592809677124 7.3344524204730979 10.710833281278608 9.9075627326965314 9.4257768690586072 10.966170012950899 16.651602253317833 16.281436294317249 7.9785847365856162 13.944065034389494 7.1807256937026986 6.8114441782236117 9.3937584459781629 8.1313889324665087 6.4088540673255912 5.1955883949995032 10.674920588731768 11.170917361974714 7.1361485719680777 6.4445450901985168 4.8532697707414618 31.384880423545837 16.351170569658279 7.2781172394752529 9.0366067588329297 18.106113970279694 9.7121601700782794 6.8527309298515311 4.9675582647323626 6.83101359009743 10.637303918600081 7.5115073621273067 6.4226443469524392 8.6720426082611066 5.7942474782466871 5.5598543733358401 14.301005840301512 6.6971240043640163 11.762774974107741 7.2834666967391968 9.9204092025756818 18.482713758945465 5.850497066974639 7.3976821303367606 5.8959216922521582 18.643039688467979 7.977841854095459 5.5871268361806896 5.7163890451192847 6.1414538025856018 12.377320230007173 7.1154990196228054 6.5134957432746878 5.1672100275754929 4.8438204526901236 4.6288738846778896 5.0898629426956177 14.634524300694464 6.5785329043865195 5.8668744713068008 205.65831081569195 260.20918351411819 5.9104753136634827 4.3569019436836252 56.465435922145844 20.197471037507057 13.898619651794432 4.7164594531059265
leaf_count=1538 23 33 7 77 29 26 39 495 49 148 39 31 68 126 76 49 226 71 30 55 24 79 47 18 88 41 20 21 26 22 20 57 27 64 21 73 19 83 32 31 239 156 24 139 108 35 259 39 19 116 245 90 120 23 85 36 21 228 351 152 23 37 27 20 25 69 48 20 35 23 29 20 31 26 21 32 34 28 25 21 133 74 24 23 74 32 22 20 22 32 31 20 28 26 24 41 22 39 21 40 83 20 20 25 85 32 25 25 25 50 32 28 23 22 21 22 67 30 25 947 1198 26 20 260 93 64 21
internal_value=0 -0.0139025 0.0325791 -0.0208343 0.0578615 0.0565638 0.02076 0.00363375 -0.00545854 0.00616389 0.0123779 0.00994242 0.00188507 -0.0222202 -0.0240075 0.0165347 0.00826268 0.0184801 0.0378346 0.0312306 0.0451601 0.00238446 0.0144471 0.0706872 0.0479419 -0.00562538 0.00797901 0.0330886 0.00178606 0.0086482 0.0151321 0.00175219 -0.00961838 -0.010334 0.0311072 0.0652806 0.0157828 0.0223276 0.00478671 0.00615103 0.014025 0.0180115 0.042561 0.0106663 0.0177636 0.0687236 0.0136081 0.0536233 0.0865355 -0.0178318 -0.0159721 -0.00970001 0.00569645 -0.00927997 0.0183743 0.0388773 0.0400469 -0.0174258 -0.0156566 -0.0200726 0.0244926 0.00985131 0.044607 0.0639278 0.0610098 -0.00951288 0.0367426 0.0486153 0.0472269 0.0265593 -0.0128722 0.0650463 -0.00316837 -0.00898976 -0.00478461 0.0353225 0.0376883 -0.0174821 -0.00206832 -0.0209883 -0.011475 -0.0224047 0.0246765 0.0455092 -0.00578206 0.0267339 0.0250646 0.000262971 0.0293926 0.0314623 -0.00964877 0.0277695 0.0263951 -0.0220238 -0.0151906 0.0389545 0.0233127 0.0247234 0.0316607 -0.0198601 -0.0207757 0.0218253 0.0435242 -0.0109434 -0.0236304 -0.00161602 -0.0199242 -0.0166492 -0.00594183 -0.00213346 -0.0216492 -0.013567 -0.0195347 -0.023257 -0.0228617 -0.0140168 -0.0240786 -0.0235109 -0.011719 -0.0247691 -0.0247408 -0.0171406 -0.0243793 -0.0248259 -0.0248267 -0.0248233 -0.018947
internal_weight=0 2012.7 798.764 1442.5 254.454 250.373 544.309 570.198 119.27 476.783 194.424 180.446 282.359 1323.23 940.284 386.485 152.696 55.7653 29.4426 35.1811 20.0233 96.9302 36.133 94.9064 155.467 129.664 28.8171 11.621 81.3295 50.7768 41.1159 33.5321 30.5528 49.6082 157.824 70.7651 377.982 80.0276 145.265 136.717 297.955 136.244 20.7209 161.711 72.9108 61.1078 115.523 90.4079 24.1414 382.951 272.236 51.2255 98.3185 93.4146 63.3925 58.2698 65.0586 221.01 132.467 88.5433 39.4015 33.5093 22.3102 43.3327 36.5295 100.846 40.5364 53.8784 45.8998 99.5545 62.3547 20.3599 26.3227 17.1962 60.7972 35.9596 21.8458 23.1857 31.0599 37.9402 66.0887 110.715 59.8108 24.5222 34.7577 23.843 16.5649 19.3899 39.7437 17.4683 26.0857 22.2754 15.8528 33.0869 36.269 30.5824 35.9678 18.4599 14.1138 16.0495 47.5365 17.5079 15.4856 18.5742 63.1783 12.9454 24.0698 19.1057 11.6699 31.321 23.4667 17.1632 10.9615 22.1254 23.2719 10.6497 39.9064 17.2816 12.6783 890.675 594.455 13.3894 18.2873 296.22 225.856 70.3641 9.66083
internal_count=11164 8699 2465 6494 607 600 1858 2205 489 1812 707 668 1105 6005 4310 1364 573 200 98 110 55 373 126 191 409 532 108 41 318 197 154 134 121 210 494 146 1341 270 558 526 1071 488 73 583 251 128 415 227 45 1695 1192 216 359 393 224 171 182 976 579 397 131 120 63 93 84 424 118 143 123 323 268 45 102 67 247 108 66 94 125 171 281 503 198 64 143 78 54 77 125 54 110 71 51 150 158 89 120 61 42 66 214 59 41 79 289 52 108 84 48 126 106 74 49 101 106 46 183 79 54 4100 2736 59 84 1364 1040 324 43
cat_boundaries=0 1 2 3 4 5 6 7 8 9 10 11 12 13 14 15 16 17 18 19 20 21 22 23 24 25 26 27 28 29 30 31 32
cat_threshold=1 2 1 1 2 1 1 1 1 1 2 1 1 1 1 1 1 1 1 2 1 2 1 1 1 1 2 1 1 1 1 1
is_linear=0
shrinkage=0.05


Tree=7
num_leaves=123
num_cat=28
split_feature=2 2 2 3 2 2 0 0 2 3 2 2 2 3 2 1 2 1 2 3 2 2 3 3 1 2 2 2 1 2 0 2 2 2 2 3 2 1 3 3 1 2 0 1 2 1 2 2 3 2 2 1 2 2 1 1 2 3 2 3 3 2 2 2 2 2 1 2 2 3 3 2 3 3 2 2 2 2 3 3 2 3 2 3 1 1 2 3 3 2 2 2 2 3 3 2 3 3 2 3 1 3 2 1 2 1 3 2 2 1 2 2 3 3 0 1 2 3 1 1 0 0
split_gain=461.288 96.0194 80.9216 12.2749 8.48171 7.86677 7.07816 5.22974 4.72377 5.29229 7.18062 5.11692 4.21151 3.95357 3.67691 5.20593 3.66495 4.17446 3.22273 3.1271 3.29322 2.90399 2.62416 4.86526 2.45915 2.42728 6.14844 4.06155 4.10415 2.4262 2.25628 2.19978 2.03495 1.94341 9.62359 2.1226 7.42954 2.40587 1.65563 2.33594 1.59754 2.00875 1.31115 1.07392 0.986099 2.61302 0.943402 0.647884 0.581359 0.571361 0.557493 0.447006 0.41539 1.29098 0.674149 0.288533 0.250435 0.231016 0.467224 0.222334 0.194079 0.231529 0.189709 0.184153 0.176333 0.174415 0.172824 0.150094 0.140618 0.132596 0.121325 0.120498 0.119128 0.111756 0.107531 0.0974839 0.0928725 0.0899503 0.0748102 0.0736064 0.0625273 0.0599974 0.0597875 0.0533082 0.0521653 0.0422665 0.0412436 0.0358478 0.0355201 0.0342071 0.0298269 0.0276052 0.0246209 0.022439 0.0221086 0.0143473 0.010935 0.00944112 0.00889052 0.00835115 0.00709932 0.00695841 0.00432955 0.00340299 0.00336195 0.00327853 0.00224994 0.00220825 0.0020767 0.00119584 0.000882402 0.000830768 0.000820879 0.000635627 0.000586554 0.000626215 0.000527258 0.000158681 3.15914e-05 2.44677e-07 4.15463e-07 2.49684e-07
threshold=64.500000000000014 13.500000000000002 242.50000000000003 1.5000000000000002 139.50000000000003 469.50000000000006 0 1 27.500000000000004 6.5000000000000009 24.500000000000004 42.500000000000007 1.0000000180025095e-35 1.0000000180025095e-35 67.500000000000014 2 43.500000000000007 3 245.50000000000003 1.0000000180025095e-35 26.500000000000004 486.50000000000006 3.5000000000000004 4.5000000000000009 4 8.5000000000000018 6.5000000000000009 1.0000000180025095e-35 5 47.500000000000007 6 47.500000000000007 303.50000000000006 72.500000000000014 73.500000000000014 8.5000000000000018 82.500000000000014 7 3.5000000000000004 2.5000000000000004 8 649.50000000000011 9 10 1.5000000000000002 11 39.500000000000007 189.50000000000003 1.5000000000000002 536.50000000000011 159.50000000000003 12 4.5000000000000009 7.5000000000000009 13 14 342.00000000000006 66.500000000000014 733.50000000000011 7.5000000000000009 40.500000000000007 334.50000000000006 224.50000000000003 25.500000000000004 363.00000000000006 258.50000000000006 15 215.50000000000003 201.50000000000003 4.5000000000000009 11.500000000000002 166.50000000000003 6.5000000000000009 4.5000000000000009 48.500000000000007 34.500000000000007 222.50000000000003 4.5000000000000009 9.5000000000000018 15.500000000000002 36.500000000000007 3.5000000000000004 187.50000000000003 1.0000000180025095e-35 16 17 4.5000000000000009 4.5000000000000009 9.5000000000000018 20.500000000000004 150.50000000000003 280.50000000000006 172.50000000000003 5.5000000000000009 1.0000000180025095e-35 9.5000000000000018 1.0000000180025095e-35 2.5000000000000004 2.5000000000000004 3.5000000000000004 18 1.0000000180025095e-35 17.500000000000004 19 42.500000000000007 20 1.5000000000000002 8.5000000000000018 1.5000000000000002 21 23.500000000000004 1.5000000000000002 2.5000000000000004 1.0000000180025095e-35 22 23 10.500000000000002 1.0000000180025095e-35 24 25 26 27
decision_type=2 2 2 2 2 2 9 9 2 2 2 2 2 2 2 1 2 1 2 2 2 2 2 2 1 2 2 2 1 2 9 2 2 2 2 2 2 1 2 2 1 2 9 1 2 1 2 2 2 2 2 1 2 2 1 1 2 2 2 2 2 2 2 2 2 2 1 2 2 2 2 2 2 2 2 2 2 2 2 2 2 2 2 2 1 1 2 2 2 2 2 2 2 2 2 2 2 2 2 2 1 2 2 1 2 1 2 2 2 1 2 2 2 2 9 1 2 2 1 1 9 9
left_child=1 3 4 12 14 18 46 25 9 10 38 22 13 114 15 48 -13 31 -4 20 -12 -7 55 -24 50 26 27 28 -5 -19 105 -18 51 66 -35 37 -37 -36 39 -8 49 -42 44 60 45 -14 63 71 -2 -23 70 65 54 -54 -46 75 -45 58 -51 -25 61 -34 68 89 -58 -20 72 79 -49 100 87 78 94 86 104 -10 -69 98 83 82 -57 -73 -52 -26 -76 97 108 96 -78 102 -72 -67 -81 -53 -16 103 -6 113 111 -29 -27 -86 117 -79 -48 -15 110 -88 112 -100 -91 -44 -9 -65 115 -1 -97 -3 -32 120 -116 -121
right_child=2 6 5 7 24 21 8 73 11 -11 19 16 42 30 33 -17 17 29 32 -21 -22 40 23 59 47 69 -28 99 -30 -31 118 -33 43 34 35 36 -38 -39 -40 -41 41 -43 77 56 52 -47 74 62 -50 57 67 93 53 -55 -56 80 64 -59 -60 -61 -62 -63 -64 85 -66 91 -68 76 -70 -71 90 81 -74 -75 84 -77 88 95 -80 92 -82 -83 -84 -85 101 -87 107 -89 -90 106 -92 -93 -94 -95 -96 116 -98 -99 109 -101 -102 -103 -104 -105 -106 -107 -108 -109 -110 -111 -112 -113 -114 -115 119 -117 -118 -119 -120 121 -122 -123
leaf_value=-0.024692756047240024 0.041627023341756997 -0.017308262735066509 0.075880945806892239 0.02227450859181479 0.016408636881683532 0.089004469928248175 0.0042696819691036237 -0.023753033495293056 -0.01316115746073708 0.040874989365137872 0.022567744512900771 0.038032244220122302 -0.00071741331562489219 -0.0016712689454075576 -0.0045709435712585926 0.0011677645780300355 0.013540360595800808 -0.00056703571933680976 0.028507729398937472 0.012349832067429355 0.062217996974805734 0.04721550933161843 0.039597835867505822 -0.010547579238174514 0.030251632293213593 -0.019627388961269848 0.037625686114787733 -0.022233178111897081 -0.012059795044608397 0.023186816482629189 -0.024405372897423172 -0.0049832884545877422 0.038238200098701491 0.078793575344305047 0.0072085044775164744 0.07131971934313544 0.015627461010121125 0.01789724779069202 -0.016900919894072147 0.031070259948166729 0.05924894123745153 0.085267992696809569 -0.024236053643074029 0.049157847670917347 -0.023552421123411202 -0.024125572868866969 -0.006727180528997824 0.043208498058757261 0.060709506006868752 0.051394207812699669 0.022072508238138305 0.042223003384996322 -0.0095499070732609249 -0.019662956390528157 -0.014545840822145984 -0.0074693443056521314 0.063916655520316071 0.065796334955305055 0.06247097627485472 -0.00015486618744317527 0.052121308455964736 0.04602610587774196 0.047195715101621731 -0.011234113732499981 0.055572485109485141 0.035134553978628809 0.0069878741893480648 0.034134974054231354 0.035068988581418485 -0.0085457981770300888 0.024791987694704254 0.03657967867959324 0.0058455546120547014 -0.013775572377538415 0.0039210585678581562 -0.0092939170205943201 0.024960588451647007 -0.021587292907112809 0.03316899264163202 0.029485151809363754 -0.0031554037771135968 0.030967726065395742 0.025405371280915912 0.025074690207930642 -0.0030505284606082705 -0.0063285778469191999 -0.020107496359331643 0.01288587083433719 0.029663984132433235 -0.014302891881934046 0.019864976177726493 0.038086897136811591 0.025795741958931015 0.045390862394186965 -0.00082695719359496408 -0.019793502916912342 0.018970218604264209 -0.0091305347706665679 -0.022996972526998026 -0.019698889700794541 -0.017123967966828697 -0.00066413166933499855 -0.015596122780166505 -0.020450102689793994 -0.0050223872905482197 -0.0027188646199378438 -0.012676582953487316 -0.018671922301967663 -0.022294833050017487 -0.022088995701679298 -0.013385357301996895 -0.023756955121735219 -0.023034988376057608 -0.011948339143116087 -0.024827286208937104 -0.024797486213026517 -0.019140503471612884 -0.016928098631519391 -0.024249225325436895 -0.024821690831165324 -0.024819677347285657 -0.024829265343486707
leaf_weight=326.09280243515968 8.8906311094760913 6.2345582842826861 8.866675913333891 21.087591677904129 11.370548635721212 10.543364167213438 128.88594080507755 10.451589241623884 34.244792848825455 14.604483246803282 10.656335920095444 9.5187202990055066 31.583077669143677 18.911278605461121 8.8653760850429553 8.1502808034420031 20.91166877746582 14.661290466785429 8.6439470648765546 15.353546828031538 10.297169208526611 12.705606907606123 8.471793860197069 10.428177773952486 9.0420746207237297 6.3697945475578317 12.454754531383513 12.590356707572939 14.821058809757231 40.292124211788177 13.594351768493652 68.622183188796043 13.121399223804472 5.7675499618053427 137.34957474470139 6.7507156729698172 53.032385289669037 85.365085572004318 8.4034067988395673 8.677833676338194 16.81962621212006 13.270653009414671 24.666350901126862 10.104799538850783 52.325091436505318 19.151172190904617 5.4907300323247927 8.5467931628227287 7.2428791821002951 17.73013311624527 30.745187491178513 13.603203356266024 53.52815455198288 76.882592439651489 34.45944082736969 20.156794533133507 9.4224443137645739 10.240810155868528 20.559012174606323 10.160155549645422 8.443218529224394 34.998497396707535 7.8144218921661368 6.7343149632215518 19.300949811935425 16.902246445417408 10.86040046811104 6.5630936622619656 13.994761139154432 4.7040497213602057 6.1698261499404889 11.000407993793489 5.1407950520515433 4.7861399799585334 6.4706169068813324 31.090005129575729 8.8871385753154772 23.369005411863327 7.8189922869205466 6.9411079585552242 14.400610521435736 8.398875027894972 23.928654342889786 11.048991233110426 4.9520919322967547 7.4632330685853985 5.6783671081066114 6.0107979774475089 7.3207530975341788 5.4800706207752246 6.1172451972961426 14.895069897174833 12.974847316741942 9.4895816445350629 7.1016553044319144 4.5972459912300101 6.5755292177200309 5.8414871245622626 18.218437805771828 4.3820785880088797 5.0989246666431436 7.9724139869213104 7.6518385708332053 9.1561862528324109 6.1100680232048035 12.342955917119982 6.4304517507553092 5.0710422843694687 4.7367578744888297 4.5274760574102428 5.0214146971702576 14.290590137243269 6.428465098142623 5.7962939590215683 200.61523525416851 253.83580845594406 9.4366824477910978 4.903891921043396 4.2524620890617379 55.08111298084259 19.702341243624687 13.557775497436522
leaf_count=1538 24 28 17 73 40 18 495 49 148 39 31 33 126 76 32 24 74 52 25 55 24 28 27 41 29 29 34 57 62 137 64 277 35 20 502 24 174 294 32 31 31 22 116 24 245 90 23 23 22 36 100 35 228 351 152 84 20 20 36 40 20 88 21 29 40 48 39 20 38 20 20 31 19 21 25 133 27 108 24 22 59 25 76 35 20 31 26 20 21 24 20 41 41 23 28 21 23 25 85 20 23 32 34 42 25 50 28 23 22 21 22 67 30 25 947 1198 43 22 20 260 93 64
internal_value=0 -0.0137513 0.0307232 -0.0207505 0.0198185 0.0531983 0.00352472 -0.00535917 0.00596665 0.0119141 0.00959363 0.00182851 -0.0221617 -0.0239876 0.0149816 0.0337394 0.00798111 0.00600136 0.0465441 0.0294921 0.042053 0.0641586 -0.00551946 0.00770469 0.0277061 0.00172759 0.00602043 -0.00142336 0.00810325 0.0168494 -0.0101843 -0.000656876 0.0449074 0.0135592 0.0148563 0.0135509 0.0219162 0.0113054 0.00464419 0.00596032 0.0612903 0.0707241 -0.0177061 0.0495248 -0.0158297 -0.00955353 -0.0091353 0.0347813 0.0501938 0.0566546 0.0235932 0.0379747 -0.0172957 -0.015512 -0.0199762 -0.00936657 0.055928 0.0591259 0.0573418 -0.00541887 0.0451293 0.0439025 0.0404824 -0.0127174 0.0583097 0.0348055 0.00186266 0.0255639 0.0381551 -0.0156149 0.0182996 0.0311233 -0.000774362 -0.0209068 -0.00202136 -0.0113209 0.029117 -0.0223498 0.0290195 0.0244792 -0.00567166 0.03415 0.0235312 0.0274046 0.000256273 -0.00950163 -0.0219613 0.0162279 0.027085 -0.0150431 0.022339 0.0365175 0.0270816 0.0435248 -0.00290573 -0.0206906 0.0173472 -0.0107906 -0.0236017 -0.0215789 -0.0185144 -0.00157849 -0.0165118 -0.0212672 -0.00582928 -0.00208499 -0.0134131 -0.0194303 -0.02322 -0.0228162 -0.0138642 -0.0240603 -0.0234796 -0.0115645 -0.0247676 -0.0247386 -0.0193544 -0.0171409 -0.0243682 -0.0248258 -0.0248266 -0.0248232
internal_weight=0 1985.23 825.449 1412.84 555.787 269.661 572.391 118.661 479.837 196.879 182.274 282.958 1294.18 917.986 344.517 24.2838 154.006 144.487 167.792 36.3071 20.9535 101.869 128.952 29.0601 211.27 81.5086 65.3358 52.8811 35.9087 54.9534 49.101 89.5339 158.925 320.234 288.265 282.498 59.7831 222.715 145.967 137.564 91.3258 30.0903 376.192 95.3913 267.93 50.7342 92.5535 77.6653 16.1335 61.2356 133.605 63.534 217.195 130.411 86.7845 99.8922 38.8282 48.53 38.2891 20.5883 56.5631 48.1199 30.356 61.5576 28.7234 40.4413 31.9682 97.3608 22.5416 16.1728 36.2439 47.3093 21.1078 37.1524 30.9959 65.3348 22.771 108.262 27.9101 74.5898 34.5574 19.3993 54.6738 20.0911 19.3951 25.8353 32.3662 23.9569 16.2079 35.7222 12.2871 31.7973 19.916 23.0928 15.967 46.5591 17.9461 18.3721 61.7029 16.9724 11.4687 12.9245 18.7903 32.5252 11.6008 31.2542 16.9319 10.7494 21.6168 22.7459 10.5015 38.9569 16.8801 12.5306 868.885 579.929 14.0339 11.1385 17.8468 288.956 220.318 68.6389
internal_count=11164 8699 2465 6494 1858 607 2205 489 1812 707 668 1105 6005 4310 1202 70 573 540 416 110 55 191 532 108 656 318 246 212 135 189 210 351 399 1132 1014 994 198 796 558 526 173 53 1695 227 1192 216 393 226 46 120 430 172 976 579 397 424 84 92 72 81 143 123 82 268 60 114 118 307 61 72 123 144 79 171 125 281 68 503 88 239 143 56 176 64 77 110 150 83 48 158 40 89 63 58 60 214 63 79 289 77 52 52 84 150 48 126 74 49 101 106 46 183 79 54 4100 2736 64 50 84 1364 1040 324
cat_boundaries=0 1 2 3 4 5 6 7 8 9 10 11 12 13 14 15 16 17 18 19 20 21 22 23 24 25 26 27 28
cat_threshold=1 2 1 1 1 1 2 1 1 2 1 1 1 1 1 1 2 1 1 1 1 1 2 1 1 1 1 1
is_linear=0
shrinkage=0.05


Tree=8
num_leaves=108
num_cat=31
split_feature=2 2 2 2 3 0 2 2 3 2 2 0 3 2 1 2 2 2 1 3 2 2 3 2 1 3 2 3 0 2 2 2 2 1 3 0 1 1 1 2 1 3 3 3 2 2 2 3 1 3 1 3 2 2 2 1 2 3 2 3 0 2 3 3 3 2 3 2 2 0 3 3 3 1 2 2 2 1 2 3 3 3 2 2 2 1 2 1 2 2 3 2 1 2 2 1 1 2 1 2 3 0 1 1 1 0 0
split_gain=437.117 133.18 17.0609 13.0562 11.4889 6.51652 5.80903 5.45312 5.48004 5.95469 4.84409 4.7605 3.99017 3.30446 3.88038 2.93897 5.60119 3.92094 3.83154 7.55129 2.83064 3.35062 2.72653 2.54247 2.52622 4.71306 2.35367 2.30716 2.22694 2.10364 2.63582 1.85054 1.72019 1.56949 1.45003 1.31921 1.16939 1.09279 1.08098 0.978952 2.57324 0.916126 3.54588 1.64002 5.47708 1.33809 0.866658 0.865767 0.806015 0.495818 0.516914 0.474945 0.474886 0.416662 1.28451 0.679831 0.381003 0.332285 0.24328 0.206306 0.199192 0.17039 0.168306 0.161396 0.109621 0.108091 0.108032 0.0986999 0.0914904 0.0839034 0.100966 0.0805285 0.0746113 0.056758 0.0532475 0.05188 0.0479979 0.0384391 0.03726 0.0358059 0.0344361 0.0334468 0.0286504 0.0220967 0.0145479 0.0118644 0.0101528 0.0100444 0.00916844 0.00907754 0.00846751 0.00576897 0.00552319 0.0039713 0.00326567 0.00313833 0.00254253 0.00211724 0.00121785 0.000849581 0.000837974 0.000601236 0.000641784 3.23376e-05 2.50989e-07 4.2598e-07 2.55887e-07
threshold=14.500000000000002 185.50000000000003 64.500000000000014 334.50000000000006 1.5000000000000002 0 1.0000000180025095e-35 27.500000000000004 6.5000000000000009 24.500000000000004 42.500000000000007 1 1.0000000180025095e-35 43.500000000000007 2 8.5000000000000018 6.5000000000000009 1.0000000180025095e-35 3 2.5000000000000004 65.500000000000014 128.50000000000003 1.0000000180025095e-35 13.500000000000002 4 3.5000000000000004 469.50000000000006 1.0000000180025095e-35 5 242.50000000000003 246.50000000000003 490.00000000000006 23.500000000000004 6 10.500000000000002 7 8 9 10 1.5000000000000002 11 8.5000000000000018 10.500000000000002 1.0000000180025095e-35 73.500000000000014 92.500000000000014 45.500000000000007 56.500000000000007 12 46.500000000000007 13 32.500000000000007 90.500000000000014 4.5000000000000009 7.5000000000000009 14 157.50000000000003 14.500000000000002 27.500000000000004 5.5000000000000009 15 147.50000000000003 117.50000000000001 7.5000000000000009 4.5000000000000009 278.50000000000006 5.5000000000000009 385.50000000000006 4.5000000000000009 16 8.5000000000000018 1.0000000180025095e-35 1.5000000000000002 17 215.50000000000003 299.50000000000006 4.5000000000000009 18 20.500000000000004 4.5000000000000009 23.500000000000004 1.0000000180025095e-35 211.50000000000003 36.500000000000007 7.5000000000000009 19 54.500000000000007 20 206.50000000000003 2.5000000000000004 3.5000000000000004 9.5000000000000018 21 17.500000000000004 2.5000000000000004 22 23 1.5000000000000002 24 1.5000000000000002 2.5000000000000004 25 26 27 28 29 30
decision_type=2 2 2 2 2 9 2 2 2 2 2 9 2 2 1 2 2 2 1 2 2 2 2 2 1 2 2 2 9 2 2 2 2 1 2 9 1 1 1 2 1 2 2 2 2 2 2 2 1 2 1 2 2 2 2 1 2 2 2 2 9 2 2 2 2 2 2 2 2 9 2 2 2 1 2 2 2 1 2 2 2 2 2 2 2 1 2 1 2 2 2 2 1 2 2 1 1 2 1 2 2 9 1 1 1 9 9
left_child=4 2 5 29 6 46 12 8 9 32 24 15 101 -12 -15 16 17 18 19 -6 -4 41 -11 35 63 -26 48 38 95 36 -31 -29 -7 -25 -20 39 69 51 -28 40 -8 43 -43 44 -22 -45 58 57 60 50 65 56 -44 55 -55 -41 -23 -33 78 82 80 79 -49 -9 76 -32 85 -50 89 70 71 -3 -63 -48 -72 -52 97 83 93 -39 81 -5 -38 -60 96 -17 -75 -80 -71 99 94 -78 -86 -2 -19 -14 -70 100 -91 -37 -13 102 -1 -30 105 -103 -106
right_child=1 3 20 26 11 7 23 10 -10 22 13 64 28 14 -16 66 -18 90 34 -21 21 37 -24 33 25 -27 27 31 103 30 49 47 -34 -35 -36 68 59 61 -40 53 -42 42 52 45 -46 -47 73 62 67 -51 75 -53 -54 54 -56 -57 -58 -59 77 -61 -62 72 -64 -65 -66 -67 -68 -69 84 88 74 -73 -74 86 -76 -77 91 -79 87 -81 -82 -83 -84 -85 92 -87 -88 -89 -90 98 -92 -93 -94 -95 -96 -97 -98 -99 -100 -101 -102 104 -104 -105 106 -107 -108
leaf_value=-0.02468934313349086 -0.0170563613517172 0.025911224264604023 0.044083650679931294 0.041624428738015973 0.048959885922196605 0.0067980277993610399 -0.00070010947672702415 -0.011351580380533221 0.042919852438711215 0.039286162989370703 0.035686372795828786 -0.023727164338013751 -0.0016325327899988735 -0.00064173736877237892 0.016150777648172215 -0.019600344504721007 0.035319434551985038 -0.023242947590283333 -0.023169088440707405 -0.010343704599052457 0.038504393333347924 0.015072526680340087 0.011893498915243132 0.012298682940751784 -0.0055627372795056251 0.030700149801233985 0.079688650328246707 0.035246486723179919 -0.024234988041614274 0.064273745111787794 0.030734113873806309 0.05736126772662338 -0.015982032353533748 -0.016787790538198569 0.010072491301894923 -0.024221500349942415 0.03526283783353007 0.023004560143683871 0.05992641604698095 -0.023521992532722184 -0.02410839090927366 0.043754312153899383 0.0057536404582612249 0.0031218149378044913 0.010683818052880913 0.013117268737908118 0.003144801706803306 0.06097666604383687 0.055607559272237296 0.04945214391147696 0.04039797465941089 0.029130274408573732 0.016349817142377692 -0.0094032916879033118 -0.019560365544752531 -0.014395166529459925 0.021542008332870555 0.048947590178948751 -0.011043123638161605 0.041602713429798786 0.048350159315546565 0.026606050587585348 0.069662035890315041 -0.0030739650096328276 -0.013622247610944035 0.035381689306631901 -0.010114370181374864 0.05005836284862987 -0.020704648079660305 0.027515474314276644 0.024586561483552372 0.020127343297110675 0.031628376523228564 -0.003585560495802523 0.029925811376687997 0.044979272636889403 -0.020072178793539786 -0.0054967689708092897 -0.010948881532026486 0.027422697268126246 0.043172756635986201 0.037756689033436847 0.031538165453962756 -0.0078291741725645958 -0.020148896518712215 -0.016737812154835167 -0.00097189691231821152 -0.01361092469848639 0.030031905341904697 -0.02295434683155179 -0.019596825699719558 -0.017761857461381633 -0.018319639653732771 -0.015450992301072178 -0.0215540803472157 -0.002658667754060871 -0.02186095393608203 -0.022237693587951218 -0.022027792627967963 -0.023731175212811741 -0.022993176577060851 -0.024827238591713263 -0.024796687533426287 -0.024394899186704774 -0.024821501603396329 -0.024819437812125811 -0.024829265410046049
leaf_weight=318.13927584886551 7.8838422596454603 10.118051052093508 9.2274596691131574 10.400114119052892 11.482595086097719 117.556172311306 31.560426950454712 75.382221758365631 14.043516397476195 21.857748329639435 9.887710750102995 10.206257253885274 18.879699170589447 89.477814733982086 55.890264928340912 7.7462051808834085 12.932301104068754 4.5257513523101824 9.681341275572775 10.079982072114943 22.048160165548325 53.357724100351334 15.544336855411528 11.885986924171448 34.362039387226105 12.120816022157667 15.678430140018463 10.983256369829176 4.1505834460258484 10.395318806171415 21.160518705844879 25.547346711158752 8.9156745970249158 7.6054477095603952 4.9620520025491706 24.075722694396973 15.355797559022905 15.835674136877062 12.386411845684052 51.107105761766434 18.694666922092438 11.347341835498808 16.505791932344437 68.950684756040573 89.525219559669495 65.091599017381668 7.7600191533565521 10.844853550195696 17.603234738111496 8.1424849629402143 21.57665500044823 10.334527999162672 29.421620547771454 53.019397795200348 75.385620877146721 33.961827754974365 39.683040827512741 21.704647749662399 10.788552910089495 14.591810911893843 11.23028242588043 11.145568013191221 11.484674602746962 6.3877362608909598 4.7206602394580832 30.605061948299408 5.6476071923971167 14.708255052566527 6.8274664878845215 6.4803664386272422 9.0866354107856768 14.851027667522429 21.975239753723145 6.6127434074878719 9.6061468422412855 8.6598550677299482 6.6473368257284147 8.6297269314527529 4.5692325234413147 6.4551322460174552 9.2304745614528638 12.084439367055891 7.7780116200447074 10.60493056476116 17.747674405574799 6.7951518446207055 8.4808371663093549 15.784924179315569 8.1995300352573377 17.80424989759922 4.2966010868549338 4.5526346862316132 5.3765914887189892 7.5334253460168839 7.7877706289291382 12.309442460536959 15.653972029685976 4.6323211789131156 4.4285650402307537 13.955090269446371 6.2820781767368308 195.69581788778305 247.61872407793999 13.266592979431154 53.730732798576355 19.219353899359703 13.225291252136229
leaf_count=1538 36 31 23 25 38 447 126 322 36 55 33 49 76 351 189 35 34 21 41 35 73 183 55 47 143 41 26 18 20 19 59 48 33 30 21 116 41 51 19 245 90 30 58 247 316 228 30 20 35 20 52 31 100 228 351 152 126 40 47 37 27 33 20 26 21 80 22 29 32 20 28 46 64 27 27 20 31 36 20 20 21 29 21 45 83 30 34 70 24 85 20 21 25 34 36 50 74 22 21 67 30 947 1198 64 260 93 64
internal_value=0 0.019087 0.0096776 0.0443353 -0.0203555 0.00369736 -0.0217524 0.0060827 0.0129441 0.0103753 0.00177676 -0.00575546 -0.0239671 0.00771698 0.00581455 0.000703071 0.00582685 -0.00139456 0.00783281 0.0212369 0.0166633 0.0161152 0.0279017 -0.0166508 -0.00541414 0.00389313 0.0539123 0.0586206 -0.0100352 0.0353779 0.0404336 0.0543199 0.00519214 0.000949305 -0.0119049 -0.017579 0.0300869 0.0219982 0.0709666 -0.0156864 -0.00940788 0.0130311 0.0187256 0.0117032 0.0161815 0.00797566 -0.00871868 0.0573306 0.047116 0.0376843 0.0365158 0.0189614 0.0125417 -0.0171644 -0.0153664 -0.0198783 0.0178318 0.0534965 -0.0116324 0.0369471 0.0426277 0.0276637 0.0654438 -0.0107049 -0.0207395 0.0334819 -0.0159833 0.0530816 -0.0222937 0.025651 0.0245515 0.0224711 0.0299383 -0.000330327 0.0273304 0.0417101 -0.021779 -0.00831366 -0.0144178 0.024284 0.0406013 0.0395457 0.0340105 -0.00944994 -0.0206041 -0.0182627 -0.00211699 -0.0130133 0.028921 -0.0235724 -0.021508 -0.0191331 -0.0197236 -0.0162719 -0.0221748 -0.00203752 -0.0215098 -0.0231822 -0.0227698 -0.0240416 -0.0234475 -0.024766 -0.0247363 -0.0243568 -0.0248257 -0.0248265 -0.024823
internal_weight=0 1401.47 1020.98 380.494 1408.3 550.074 1285.33 461.426 177.917 163.874 283.509 122.979 896.236 155.256 145.368 85.9374 65.7484 52.8161 36.206 21.5626 470.905 461.677 37.4021 389.09 128.253 46.4829 183.886 108.63 48.6063 196.607 100.54 80.5648 126.472 19.4914 14.6434 369.598 96.0674 158.787 28.0648 263.729 50.2551 302.89 57.2748 245.616 111.573 134.042 88.6482 69.5815 75.2568 90.1446 82.0021 103.375 45.9274 213.474 128.405 85.0689 93.0408 47.252 65.7946 37.7256 42.9453 55.4116 22.3295 81.77 37.0413 51.7656 20.189 32.3115 105.869 58.3418 43.6619 24.9691 33.1208 22.8536 18.6928 30.2365 32.3206 30.0232 35.7714 22.2908 31.715 22.4846 23.1338 21.3935 45.6057 14.5414 15.0936 20.3542 14.6799 60.2636 16.6101 11.2 23.1243 15.4173 12.3135 31.1891 22.4814 21.1207 22.2328 38.0308 16.4883 847.629 565.758 17.4172 281.871 214.915 66.956
internal_count=11164 4575 3693 882 6589 2110 6082 1731 626 590 1105 507 4310 573 540 333 246 212 135 73 1583 1560 110 1772 532 184 357 191 210 525 250 146 480 77 62 1695 275 508 45 1192 216 1052 188 864 389 475 379 128 166 231 211 340 158 976 579 397 309 88 288 99 102 168 40 348 174 139 87 64 503 176 132 77 97 91 55 72 153 128 160 71 75 54 62 92 214 65 61 90 44 289 77 52 108 70 57 126 106 101 106 183 79 4100 2736 84 1364 1040 324
cat_boundaries=0 1 2 3 4 5 6 7 8 9 10 11 12 13 14 15 16 17 18 19 20 21 22 23 24 25 26 27 28 29 30 31
cat_threshold=1 2 1 1 1 2 1 2 1 1 1 1 1 1 1 2 2 2 1 1 2 1 1 2 1 2 1 2 1 1 1
is_linear=0
shrinkage=0.05


Tree=9
num_leaves=113
num_cat=33
split_feature=2 2 2 2 3 0 2 2 3 2 0 2 3 0 2 1 2 2 2 1 3 2 2 2 1 3 3 0 2 2 2 2 2 1 3 0 1 1 2 1 3 2 1 3 3 1 2 1 2 1 1 3 2 2 2 1 3 1 2 2 3 0 2 2 3 2 3 3 2 2 2 2 2 2 3 2 3 2 1 2 3 2 1 3 3 3 2 2 1 1 2 2 3 3 3 2 2 1 2 2 1 2 1 2 3 0 1 2 1 1 0 0
split_gain=416.443 117.554 13.7944 13.1149 11.4623 6.18856 5.88296 5.07554 4.86904 5.4144 4.64392 4.58758 4.02641 3.22185 5.16146 3.43663 2.81915 5.11735 3.78363 3.57807 6.7576 2.65467 2.59026 2.50026 2.43132 4.35108 2.39112 2.19752 2.16264 1.89541 2.44525 1.87029 1.6429 1.49815 1.41446 1.32689 1.3178 1.23404 1.41233 1.05164 1.01509 4.99962 4.40769 1.98488 4.74078 1.08597 0.971446 2.5336 0.842078 0.740321 0.661251 0.434446 0.424667 0.41778 1.27757 0.685369 0.414977 0.438104 0.293962 0.249559 0.198058 0.165348 0.164602 0.161057 0.157438 0.138716 0.11033 0.10745 0.0992668 0.093068 0.0930408 0.0899511 0.0796243 0.0793544 0.0586724 0.0797019 0.0633123 0.0486952 0.0471075 0.0432681 0.0408542 0.0370349 0.0354308 0.0288357 0.0281352 0.0271597 0.0197851 0.0147284 0.0119226 0.00992215 0.00968525 0.00926762 0.00858351 0.00663545 0.00618148 0.00581109 0.00396751 0.00349481 0.00332268 0.00300491 0.00300368 0.00215829 0.00124008 0.00086877 0.000855332 0.000616234 0.000657763 0.000544824 3.31014e-05 2.57202e-07 4.36765e-07 2.62244e-07
threshold=14.500000000000002 166.50000000000003 334.50000000000006 64.500000000000014 1.5000000000000002 0 1.0000000180025095e-35 27.500000000000004 6.5000000000000009 24.500000000000004 1 42.500000000000007 1.0000000180025095e-35 2 52.500000000000007 3 8.5000000000000018 6.5000000000000009 1.0000000180025095e-35 4 2.5000000000000004 65.500000000000014 242.50000000000003 13.500000000000002 5 3.5000000000000004 1.0000000180025095e-35 6 246.50000000000003 469.50000000000006 486.50000000000006 112.50000000000001 23.500000000000004 7 10.500000000000002 8 9 10 649.50000000000011 11 1.0000000180025095e-35 73.500000000000014 12 8.5000000000000018 10.500000000000002 13 1.5000000000000002 14 39.500000000000007 15 16 39.500000000000007 521.50000000000011 4.5000000000000009 7.5000000000000009 17 46.500000000000007 18 139.50000000000003 224.50000000000003 13.500000000000002 19 730.50000000000011 27.500000000000004 7.5000000000000009 137.50000000000003 4.5000000000000009 5.5000000000000009 48.500000000000007 258.50000000000006 4.5000000000000009 215.50000000000003 385.50000000000006 222.50000000000003 3.5000000000000004 186.50000000000003 1.0000000180025095e-35 4.5000000000000009 20 299.50000000000006 34.500000000000007 20.500000000000004 21 23.500000000000004 1.0000000180025095e-35 9.5000000000000018 173.50000000000003 9.5000000000000018 22 23 137.50000000000003 2.5000000000000004 3.5000000000000004 1.0000000180025095e-35 1.5000000000000002 9.5000000000000018 17.500000000000004 24 2.5000000000000004 42.500000000000007 25 1.5000000000000002 26 1.5000000000000002 2.5000000000000004 27 28 10.500000000000002 29 30 31 32
decision_type=2 2 2 2 2 9 2 2 2 2 9 2 2 9 2 1 2 2 2 1 2 2 2 2 1 2 2 9 2 2 2 2 2 1 2 9 1 1 2 1 2 2 1 2 2 1 2 1 2 1 1 2 2 2 2 1 2 1 2 2 2 9 2 2 2 2 2 2 2 2 2 2 2 2 2 2 2 2 1 2 2 2 1 2 2 2 2 2 1 1 2 2 2 2 2 2 2 1 2 2 1 2 1 2 2 9 1 2 1 1 9 9
left_child=4 3 22 5 6 48 12 8 9 32 16 24 105 15 -15 -13 17 18 19 20 -6 -5 36 35 64 -26 -11 100 -24 50 -31 40 -7 -25 -21 46 71 52 -39 51 41 42 -23 45 -45 -42 47 -8 63 -43 61 58 -32 55 -55 -48 57 69 -33 74 65 83 -54 81 -9 -41 77 88 99 -30 91 80 -52 -73 76 -76 -38 101 -70 -59 86 96 94 84 -4 -75 -3 97 -18 -83 -62 103 98 -80 -65 -79 -2 -72 -20 -50 -14 104 -93 -37 -12 106 -1 -89 -29 110 -107 -111
right_child=1 2 29 21 10 7 23 11 -10 26 66 13 27 14 -16 -17 67 -19 92 34 -22 31 28 33 25 -27 -28 108 56 30 37 39 -34 -35 -36 70 59 38 -40 60 43 49 -44 44 -46 -47 53 -49 68 -51 72 -53 62 54 -56 -57 -58 79 -60 -61 90 -63 -64 82 -66 -67 -68 -69 78 -71 87 73 -74 85 75 -77 -78 95 93 -81 -82 89 -84 -85 -86 -87 -88 107 -90 -91 -92 102 -94 -95 -96 -97 -98 -99 -100 -101 -102 -103 -104 -105 -106 109 -108 -109 -110 111 -112 -113
leaf_value=-0.024685845608062251 -0.016922646608422621 0.020208093910856401 0.038915109749460136 0.041111706524080825 0.045434188041310788 0.0065837540581780889 -0.00068321173666890174 -0.011197715764459312 0.040073589725746726 0.036816148184867371 -0.023700701024516262 -0.00074396886024690519 -0.001594632465448124 0.06592305009537669 -0.002710336352442339 0.014962370913021737 -0.01949684484454001 0.033232095829234795 -0.023205644694320973 -0.023130174231787301 -0.010193092384885673 0.050999164148004233 0.058726927354274608 -0.016651652876421535 -0.0054552642760586929 0.029021290793827904 0.011459324567003718 -0.024384173846933484 0.02657101775025027 0.075231260059046873 0.039265078747960321 0.012402352096316465 -0.015839498535445719 0.011844854026700026 0.0097227081772261279 -0.024206600100161953 0.031648378455880311 0.049990622575376578 0.07041030401081852 0.019614795796456311 0.0018640956332607794 0.0047231589869077273 0.003808713881765952 0.049982201676616274 0.0095015952738916176 0.012269150136216857 -0.023490877609387451 -0.024090799902199221 -0.0064692796687043424 0.015001724999263086 0.051256752995953316 0.027639645758607417 0.04666790554150746 -0.0092575522920782909 -0.019456289846016085 -0.014243879418850658 0.045868117778199241 0.037815441674045207 0.017576510028099644 0.041439525041805821 0.027448216565828479 0.044896096641308364 0.052076579624897527 -0.011151090698408967 -0.0030069869248295052 0.024713093346738588 -0.013468538801141778 -0.0099647831419234223 0.0037186288138926107 0.032432644099248932 -0.021445159755882879 0.030653836727042222 0.046401892804844663 0.022510778345122256 0.025848609711909616 0.032431111313894728 0.036778777881346418 -0.019975727751984466 -0.0029400897363308243 0.041908903084637378 0.026212671975325327 -0.010796071606770171 -0.0058390881359491288 0.040299393110967384 0.035437703948554007 0.026511095333728543 0.022577380603227237 -0.019591495378524677 -0.016601239577368004 -0.013457188753287885 0.030146731546372964 -0.022910811306965987 -0.019493275406990099 -0.00060499797726252429 -0.0091084383864387716 -0.017635205137479921 -0.015304963921057159 -0.020268721123116642 -0.021482720528671034 -0.0048481772742401397 -0.0025996444685957671 -0.022179418261967357 -0.021965397501967646 -0.02370480481182546 -0.02295047111266969 -0.024827186864186924 -0.024795871248738818 -0.018914567441060376 -0.024220409859594026 -0.024821306507128299 -0.02481918931783816 -0.024829264342323795
leaf_weight=310.38080424070358 7.7505128830671293 11.056284368038176 10.84214907884598 9.6433392167091352 12.058771133422853 118.35804679989815 31.538339495658875 74.531352907419205 14.659383773803709 22.733546108007431 9.9669424891471952 87.710463851690292 18.84890228509903 5.8102724403142911 5.1827874183654785 57.764093786478043 7.5958551317453393 13.397224605083464 4.421772703528406 9.4596121758222562 9.9762553274631482 15.685155063867569 11.085404515266417 7.4788344204425812 34.171422556042671 12.498697668313978 15.7303169965744 12.946870803833008 7.9536055326461783 11.994645595550535 12.690698742866514 59.789261519908905 8.7743169069290143 12.033071517944338 5.0122847259044638 23.499577879905701 14.965328454971315 18.900910317897797 15.340919077396391 28.053608983755112 69.603190392255783 39.741380900144577 7.2285118997097024 9.2660255432128888 32.958306044340134 39.199463367462158 49.918994456529617 18.249358534812927 5.4136025309562701 31.328227162361145 18.609835922718048 6.9802453517913809 27.944544643163681 52.523177683353424 73.925376534461975 33.476443290710449 8.5552707910537702 22.466154217720035 50.751852452754974 8.4931921958923322 6.3882261514663679 11.786609590053557 28.324938416481018 7.7348137348890305 6.3681307733058921 25.441218227148056 4.6567901819944373 5.5907730758190146 6.5164990723133087 45.574665039777756 22.387501925230026 6.974877297878268 15.46326571702957 9.3470409512519854 7.1566984653472927 12.865414559841154 10.053080230951307 6.5152408480644208 4.9271066784858721 9.0582619905471784 6.7779686152935019 4.519477367401123 6.912253826856614 9.6377070248126966 12.549431204795836 7.7703316807746878 43.396351426839828 4.4199420958757392 6.6823623776435861 15.571532517671587 6.9344609975814819 17.400220111012459 4.2132209539413443 7.9529523849487305 7.1068287640810013 4.4724854975938797 7.4179208129644394 8.7920276522636431 7.6217084527015686 6.0567957758903503 12.276759743690492 4.5304457843303672 4.3320801258087185 13.627818033099173 6.1392809450626364 190.89705298841 241.55409228801727 9.0762092620134336 4.0512031316757211 52.413470149040222 18.748212441802025 12.900959968566893
leaf_count=1538 36 34 25 23 38 447 126 322 36 55 49 342 76 20 20 191 35 34 21 41 35 49 19 30 143 41 55 64 22 18 25 206 33 47 21 116 39 31 22 89 253 142 24 23 115 133 245 90 23 107 35 20 51 228 351 152 20 52 165 21 20 27 44 34 26 77 21 22 25 117 108 20 29 27 20 32 26 31 20 20 20 20 29 21 29 21 132 21 30 70 20 85 20 32 31 21 34 42 36 25 50 22 21 67 30 947 1198 43 20 260 93 64
internal_value=0 0.018247 0.0398304 0.00871719 -0.0202637 0.00358892 -0.0216848 0.00589183 0.0124542 0.0100092 -0.00565134 0.00172725 -0.0239462 0.00746492 0.0335652 0.0054926 0.000675624 0.00563574 -0.00137126 0.00756355 0.0202492 0.0151676 0.031906 -0.0165138 -0.00531016 0.00377788 0.0264461 -0.00988686 0.0378444 0.0497744 0.0538634 0.0145849 0.00503616 0.000922258 -0.0117517 -0.0174506 0.0274286 0.0513799 0.059139 0.0183895 0.0117225 0.0158022 0.0361121 0.00918368 0.018385 0.00561283 -0.0155421 -0.00926311 -0.0085779 0.00925406 0.0438035 0.0155419 0.0475271 -0.0170318 -0.01522 -0.019779 0.0353714 0.0343156 0.0147779 0.033578 0.023398 0.0398121 0.0493905 -0.0121792 -0.010553 0.0220395 -0.0206538 -0.0158408 -0.00192606 0.0315617 -0.0222366 0.0235703 0.0490535 0.0261585 0.0320955 0.0300783 0.0337099 -0.0217119 0.000254416 0.0389917 0.022552 -0.0142666 -0.00879589 0.0379978 0.0370495 0.0243267 0.0220963 -0.0205161 -0.0181417 -0.0128586 0.0288528 -0.0235424 -0.0214357 -0.00149826 -0.010173 -0.019023 -0.0161315 -0.0211134 -0.0221153 -0.00561328 -0.00199103 -0.0231435 -0.0227224 -0.0240224 -0.0234147 -0.0247645 -0.024734 -0.0191363 -0.0243451 -0.0248256 -0.0248265 -0.0248229
internal_weight=0 1428.8 437.636 991.166 1380.01 552.173 1257.7 464.293 180.256 165.596 122.311 284.037 875.018 156.468 10.9931 145.475 86.0298 66.1609 52.7636 36.5069 22.035 438.992 243.55 382.679 127.57 46.6701 38.4639 48.1237 104.693 194.086 115.197 429.349 127.132 19.5119 14.4719 363.167 138.857 103.202 34.2418 184.339 245.01 93.9833 22.9137 151.027 42.2243 108.803 259.632 49.7877 87.8803 71.0696 78.889 117.521 68.9602 209.844 126.449 83.3954 93.608 85.0527 110.541 53.5337 66.8175 44.8159 56.2695 57.0133 80.8995 53.4948 36.2812 19.869 30.867 53.5283 103.535 85.3229 34.0731 24.0922 45.0405 20.0221 25.0184 31.6244 19.3966 31.5244 61.2306 35.2594 21.7539 33.0293 23.3916 17.1174 54.4526 44.6757 14.2782 20.091 13.3227 58.8597 16.2567 12.8801 14.8416 10.9877 15.1684 31.1795 12.0435 11.4704 31.1257 20.6367 21.7323 37.1274 16.1062 826.895 551.935 13.4962 16.9981 274.96 209.645 65.3144
internal_count=11164 4575 999 3576 6589 2110 6082 1731 626 590 507 1105 4310 573 40 533 333 246 212 135 73 1466 642 1772 532 184 110 210 250 357 191 1443 480 77 62 1695 392 173 53 597 846 322 73 524 138 386 1192 216 379 249 166 391 120 976 579 397 231 211 371 138 206 102 95 254 348 166 174 87 125 139 503 254 64 68 117 52 65 153 77 72 186 160 94 75 54 48 166 214 65 90 40 289 77 52 65 52 70 150 57 48 126 101 106 183 79 4100 2736 64 84 1364 1040 324
cat_boundaries=0 1 2 3 4 5 6 7 8 9 10 11 12 13 14 15 16 17 18 19 20 21 22 23 24 25 26 27 28 29 30 31 32 33
cat_threshold=1 2 2 1 1 1 2 2 2 1 1 1 1 1 1 1 1 1 1 2 2 1 1 2 1 1 1 2 1 1 1 1 1
is_linear=0
shrinkage=0.05


Tree=10
num_leaves=100
num_cat=18
split_feature=2 2 3 2 2 1 3 2 3 3 0 2 2 2 2 2 3 1 2 1 3 2 2 2 2 3 2 2 1 3 2 2 1 2 2 2 2 2 2 2 2 2 2 2 2 0 1 2 2 2 2 1 2 3 2 1 3 2 2 2 2 2 2 2 2 2 2 1 2 2 2 2 2 3 1 3 2 2 2 3 2 2 2 2 2 2 3 2 3 2 2 1 0 1 2 2 0 1 1
split_gain=437.983 108.311 20.9765 13.4133 13.598 21.0155 12.932 11.2093 17.3861 22.2819 7.36147 5.64352 8.18403 5.46264 23.7202 6.74863 7.94513 4.80235 4.42123 4.09733 5.705 8.04422 34.0838 3.87411 7.71565 11.7339 3.68043 3.59725 2.99231 2.56188 2.82808 4.6108 4.09994 1.90269 1.74552 5.62865 1.73116 6.06391 1.9839 1.57584 12.1615 1.2506 1.06764 8.48962 1.56697 0.989346 1.61282 2.36524 1.54619 0.834714 0.820299 0.542793 1.51517 0.482089 0.482759 0.464549 0.458171 0.443188 0.400041 0.395221 0.267553 0.225191 0.200458 0.181219 0.175584 0.144101 0.102373 0.101872 0.100984 0.0942114 0.0842641 0.0837323 0.0491762 0.0316936 0.0224484 0.0215267 0.0192099 0.0145766 0.0121876 0.0117715 0.0106986 0.00934464 0.00862857 0.008347 0.00666927 0.00655825 0.00496406 0.00477216 0.0018895 0.00182644 0.000988398 0.000869723 0.000541367 0.000924793 0.000476961 0.000134313 4.67023e-07 6.42216e-07 2.5245e-07
threshold=13.500000000000002 119.50000000000001 28.500000000000004 353.50000000000006 123.50000000000001 0 1.0000000180025095e-35 66.500000000000014 17.500000000000004 23.500000000000004 1 204.50000000000003 208.50000000000003 23.500000000000004 21.500000000000004 16.500000000000004 1.0000000180025095e-35 2 1.0000000180025095e-35 3 2.5000000000000004 93.500000000000014 84.500000000000014 46.500000000000007 48.500000000000007 1.0000000180025095e-35 68.500000000000014 19.500000000000004 4 3.5000000000000004 8.5000000000000018 6.5000000000000009 5 883.50000000000011 26.500000000000004 27.500000000000004 81.500000000000014 79.500000000000014 73.500000000000014 147.50000000000003 155.50000000000003 242.50000000000003 471.50000000000006 455.50000000000006 500.00000000000006 6 7 1.5000000000000002 4.5000000000000009 82.500000000000014 248.50000000000003 8 22.500000000000004 70.500000000000014 649.50000000000011 9 38.500000000000007 157.50000000000003 100.50000000000001 367.50000000000006 403.00000000000006 22.500000000000004 6.5000000000000009 95.500000000000014 111.50000000000001 109.50000000000001 117.50000000000001 10 91.500000000000014 4.5000000000000009 5.5000000000000009 72.500000000000014 90.500000000000014 11.500000000000002 11 1.5000000000000002 2.5000000000000004 11.500000000000002 103.50000000000001 3.5000000000000004 2.5000000000000004 4.5000000000000009 10.500000000000002 9.5000000000000018 1.5000000000000002 78.500000000000014 1.5000000000000002 10.500000000000002 1.5000000000000002 3.5000000000000004 1.5000000000000002 12 13 14 3.5000000000000004 10.500000000000002 15 16 17
decision_type=2 2 2 2 2 1 2 2 2 2 9 2 2 2 2 2 2 1 2 1 2 2 2 2 2 2 2 2 1 2 2 2 1 2 2 2 2 2 2 2 2 2 2 2 2 9 1 2 2 2 2 1 2 2 2 1 2 2 2 2 2 2 2 2 2 2 2 1 2 2 2 2 2 2 1 2 2 2 2 2 2 2 2 2 2 2 2 2 2 2 2 1 9 1 2 2 9 1 1
left_child=2 7 6 4 5 -3 18 8 13 -10 29 17 -13 14 15 16 -2 56 92 26 49 22 -22 34 25 -25 -9 -17 -26 30 31 32 -8 42 67 -36 37 38 -28 75 -41 55 43 59 -44 46 47 -20 -49 71 -43 52 -16 54 -46 -14 57 -6 72 -5 -61 -53 76 68 78 -65 -60 -15 -51 79 80 -21 -38 81 87 -19 -48 -64 -23 84 90 -31 86 91 88 -73 -71 -32 -12 -82 -47 -72 93 -1 -86 -85 98 -98 -94
right_child=1 3 -4 33 11 -7 10 19 9 -11 69 12 41 23 51 27 -18 39 45 20 21 64 -24 24 28 -27 36 -29 -30 73 74 -33 -34 -35 35 -37 58 -39 -40 40 -42 50 44 -45 53 70 62 48 -50 63 -52 61 -54 -55 -56 -57 -58 -59 66 60 -62 -63 77 65 -66 -67 -68 -69 -70 82 83 85 -74 -75 -76 -77 -78 -79 -80 -81 89 -83 -84 95 94 -87 -88 -89 -90 -91 -92 -93 96 -95 -96 -97 97 -99 -100
leaf_value=-0.024681049132119479 0.00095042288207144868 0.13480923403904463 0.050324129988690264 0.05020506910627779 0.013904846298029606 0.019198182043841341 0.0082808355847496535 0.04232487581219907 0.12430784438605508 0.0037450836961670933 -0.024290269290970595 0.081037871307120299 0.023223611401030783 -0.016433435850334452 0.056149329762025038 -0.016710996675680392 0.038871295156370299 0.024063058045073638 8.3082330226825816e-06 0.0030747658737217899 0.007395071408076658 0.012635272147494485 0.14949966446082541 0.06819635776171222 -0.0049257340413191349 -0.0040395792913192454 0.020203978162499813 0.0036755567283703779 0.010802001400965102 -0.02167971355694211 -0.020405426282421747 0.030800762328373057 -0.014765984634412628 0.058206512107235979 0.021382040380190721 -0.0058042630332886596 0.0020416396151656802 0.057296685060007929 -0.0022586807108833677 0.099734542791469372 0.02891043418093437 0.046244720195844691 0.027261602337788356 0.090708714108655497 0.038726524535948048 -0.024254126831664072 -0.023847125726166089 -0.023495033008005966 -0.01130988297906429 0.020252520932859595 0.033778165799620952 0.051092768132242922 0.028433783240177552 0.052423129980268372 0.048442106002259774 0.032704285237293955 0.02760066800482764 0.019619342766473369 0.0086143041897666639 0.035500562838806204 0.042874336612242832 0.064950587727085604 -0.018430200087487619 0.012521718019093537 0.024350800248494276 0.020726171351238575 0.015445462909946762 -0.011282359336643106 0.028357157541456623 -0.020872384517484105 -0.020267789705268088 0.0103191308912969 0.0049486079187788272 -0.015547490950728625 -0.015608987827099786 0.021182265774753697 -0.022072905177737787 -0.015721547880162796 0.015705209965721743 -0.021313056754288906 -0.023218586636385166 -0.019118111104987748 -0.01754695900598514 -0.019316281237117695 -0.022855077858280528 0.0082067280883980527 -0.019066589190057621 -0.018274580203176852 -0.023532176165008557 -0.022343877432112018 -0.023679794514547579 -0.021067336933115306 -0.024827927597456129 -0.024811801227142015 -0.0221354433531618 -0.018972187069478431 -0.024814065698686844 -0.024829265034092801 -0.024824019155594772
leaf_weight=302.0250258743763 40.256432518362999 7.7029401957988721 10.466093853116034 10.690396279096602 63.397888958454132 8.0269515812396985 51.012732565402985 9.1281941235065442 6.7511080354452124 8.8642468303441984 20.935953095555305 9.0984750986099225 38.708923578262329 24.003899678587914 11.026207834482193 48.769052803516388 21.02807492017746 12.214493930339815 29.015466928482056 7.5774258375167873 10.536221802234651 6.2577669918537158 7.0383667945861808 11.337182313203813 84.71995335817337 11.151508271694182 20.859781414270401 38.896011516451836 47.030583202838898 6.4696047753095645 4.9620728194713593 13.799228340387343 31.03867994248867 27.618463039398193 21.279827475547791 180.80250479280949 30.67507666349411 8.025829464197157 18.589389681816101 6.8812474012374869 50.866621524095535 14.939973652362822 18.13677054643631 10.238976955413817 40.583225965499878 20.762448459863663 28.409594357013702 42.590384870767593 66.971256345510483 9.5635533034801465 112.99366980791092 6.5897836238145846 8.9208727478981018 12.990651428699492 18.667124509811401 19.39487236738205 10.933876097202299 72.993634164333344 47.297521561384201 22.069631814956665 27.795188009738922 5.2808427512645721 22.143741130828861 11.103537619113924 6.3894772529602042 10.331831663846968 6.2039009332656851 15.993858486413954 6.4260863065719596 7.3366326242685336 4.7188263386487961 9.3944803774356824 27.672864496707916 4.7176717072725287 6.8996577560901651 13.82396876811981 32.951937928795815 6.4032191336154929 6.6883706450462341 6.0108676701784125 9.6225396096706408 7.9169654846191406 5.0273007899522772 4.7473396807908994 4.4084009230136854 6.0344532430171958 7.9077443331480026 5.5849108695983887 13.532130509614943 15.713003382086752 11.71948856115341 12.180819898843771 186.21596305072308 244.88277040421963 4.8199393898248672 7.0439287722110748 16.912060052156448 11.798045933246614 53.0949966609478
leaf_count=1534 159 26 38 21 211 25 204 26 23 30 106 24 109 84 41 188 81 38 116 25 35 20 23 33 334 44 73 144 156 28 24 41 136 38 53 736 110 28 65 20 133 26 28 18 68 105 138 214 311 33 263 25 34 21 29 46 31 220 163 46 54 19 105 36 20 33 21 53 21 36 23 32 97 19 33 41 149 31 21 29 48 32 24 23 22 21 38 27 68 78 59 60 947 1245 24 34 86 60 270
internal_value=0 0.0191937 -0.0201849 0.0349246 0.0301593 0.075813 -0.0207388 0.00763566 0.00380965 0.0558689 -0.00909917 0.0284746 0.0347357 0.00240098 0.00960399 0.00123286 0.0139619 0.023188 -0.0228236 0.0161674 0.0243339 0.0398223 0.0643059 -0.000884415 0.00530879 0.0323766 0.0114483 -0.00766571 0.000688547 -0.00216643 0.000689569 0.00405984 -0.000437392 0.0460808 -0.00483036 -0.00294147 0.00967927 0.0176791 0.00961904 0.0327454 0.0373498 0.0324713 0.0440029 0.0486009 0.0404012 -0.0177929 -0.0160687 -0.0126851 -0.0160467 0.0148739 0.035234 0.0487921 0.0437542 0.0437 0.0417875 0.0263882 0.0177526 0.0169631 0.00628369 0.0414811 0.0396108 0.0572576 -0.021284 0.0194813 0.0175686 0.0164763 0.00940643 -0.0143737 0.0235097 -0.0222161 -0.0223469 0.00737904 0.00342034 -0.0191038 -0.0178265 0.0225336 -0.0228943 -0.0178226 0.0142213 -0.0233876 -0.0234462 -0.0202701 -0.0193433 -0.0201317 -0.023673 0.00949294 -0.0199357 -0.0192771 -0.0239926 -0.0226761 -0.0240469 -0.0208441 -0.0247681 -0.0247396 -0.0224792 -0.0191107 -0.0248263 -0.0248203 -0.0248271
internal_weight=0 1489.26 1342.77 630.768 441.978 15.7299 1332.3 858.496 592.702 15.6154 202.38 426.248 195.136 577.087 180.767 148.95 61.2845 231.112 1129.92 265.794 97.3416 36.9102 17.5746 396.319 154.239 22.4887 168.453 87.6651 131.751 132.402 113.297 95.8506 82.0514 188.79 242.08 202.082 159.324 47.475 39.4492 83.7863 57.7479 186.037 161.172 70.7942 90.3778 314.994 228.486 138.577 109.562 60.4314 127.934 31.8177 19.9471 72.241 59.2504 58.1038 147.325 136.392 111.849 60.5552 49.8648 11.8706 89.9085 37.425 19.3356 21.4354 53.5014 39.9978 15.9896 69.979 86.5084 23.0064 58.3479 19.1042 17.4466 26.0385 61.3615 28.547 12.9461 49.7073 57.8175 14.3866 20.2717 28.6909 43.6964 15.4289 15.2444 10.547 34.4681 25.3355 32.4819 16.8996 814.929 546.908 9.22834 11.7913 268.021 28.7101 239.311
internal_count=11241 4676 6565 1536 1213 51 6527 3140 2237 53 891 1162 468 2184 691 572 240 694 5636 903 320 119 58 1493 567 77 583 332 490 544 465 381 340 323 926 789 557 166 138 232 153 444 285 139 146 1494 1064 641 525 201 289 119 75 118 97 155 462 431 391 121 100 44 423 123 61 69 184 137 54 347 430 78 207 79 84 79 287 136 41 249 290 60 98 140 220 53 74 51 174 126 164 83 4142 2779 46 57 1363 146 1217
cat_boundaries=0 1 2 3 4 5 6 7 8 9 10 11 12 13 14 15 16 17 18
cat_threshold=1 2 1 1 1 1 2 1 1 1 1 1 2 2 1 1 1 1
is_linear=0
shrinkage=0.05


Tree=11
num_leaves=109
num_cat=21
split_feature=2 2 3 3 2 2 1 2 3 2 0 0 2 2 2 1 2 3 2 2 2 2 2 2 2 1 3 2 2 1 3 2 2 2 2 2 3 2 2 2 0 1 2 2 2 2 2 2 1 2 3 1 2 2 2 3 1 2 2 2 2 2 3 2 1 2 0 2 2 3 2 2 1 3 2 1 2 2 3 2 2 3 2 2 2 2 2 2 3 2 2 2 2 2 3 2 2 2 0 1 2 2 2 2 1 0 1 1
split_gain=416.555 96.6991 19.8362 12.8986 11.3974 11.363 15.7458 10.3572 14.5359 18.9456 7.24073 5.48876 7.06893 23.0746 7.67872 4.76841 9.13792 5.17247 10.4359 20.4078 4.63896 7.01125 4.49113 4.4304 6.79712 4.22787 2.48726 2.72508 4.23328 3.92685 2.11458 6.94822 1.71403 1.71062 1.43081 8.66967 1.0663 3.45841 4.81437 1.05891 0.995745 1.61322 2.31574 1.54798 2.83119 0.937907 0.761368 0.566745 0.537337 0.534947 0.416454 0.405945 0.395717 0.388315 0.356275 0.300825 0.251668 0.202944 0.163244 0.162472 0.162149 0.157643 0.149119 0.130239 0.121468 0.0956618 0.0898496 0.0891839 0.0856526 0.0442067 0.043534 0.0433256 0.0360975 0.0318595 0.0284032 0.0225159 0.0218087 0.0195814 0.015949 0.0146095 0.0125517 0.0119939 0.0110966 0.00945169 0.00869034 0.00680729 0.00659666 0.0060609 0.00501491 0.00481179 0.00425266 0.00254347 0.00236556 0.00200984 0.00193182 0.00134117 0.00101071 0.00078878 0.000554907 0.000947818 0.000485529 0.000303073 0.000289241 0.000135353 5.08031e-05 4.78768e-07 6.58321e-07 2.58738e-07
threshold=13.500000000000002 119.50000000000001 1.0000000180025095e-35 28.500000000000004 334.50000000000006 123.50000000000001 0 72.500000000000014 17.500000000000004 39.500000000000007 1 2 23.500000000000004 21.500000000000004 16.500000000000004 3 74.500000000000014 2.5000000000000004 93.500000000000014 84.500000000000014 46.500000000000007 48.500000000000007 1.0000000180025095e-35 204.50000000000003 208.50000000000003 4 3.5000000000000004 8.5000000000000018 6.5000000000000009 5 7.5000000000000009 84.500000000000014 26.500000000000004 883.50000000000011 150.50000000000003 157.50000000000003 1.0000000180025095e-35 471.50000000000006 414.50000000000006 39.500000000000007 6 7 1.5000000000000002 4.5000000000000009 5.5000000000000009 242.50000000000003 248.50000000000003 94.500000000000014 8 500.00000000000006 12.500000000000002 9 82.500000000000014 471.50000000000006 157.50000000000003 70.500000000000014 10 6.5000000000000009 24.500000000000004 108.50000000000001 95.500000000000014 111.50000000000001 38.500000000000007 109.50000000000001 11 4.5000000000000009 12 91.500000000000014 4.5000000000000009 21.500000000000004 106.50000000000001 47.500000000000007 13 11.500000000000002 54.500000000000007 14 20.500000000000004 2.5000000000000004 7.5000000000000009 11.500000000000002 9.5000000000000018 3.5000000000000004 103.50000000000001 4.5000000000000009 10.500000000000002 1.5000000000000002 2.5000000000000004 78.500000000000014 1.5000000000000002 10.500000000000002 9.5000000000000018 2.5000000000000004 6.5000000000000009 5.5000000000000009 1.5000000000000002 1.5000000000000002 1.5000000000000002 3.5000000000000004 15 16 3.5000000000000004 7.5000000000000009 5.5000000000000009 10.500000000000002 17 18 19 20
decision_type=2 2 2 2 2 2 1 2 2 2 9 9 2 2 2 1 2 2 2 2 2 2 2 2 2 1 2 2 2 1 2 2 2 2 2 2 2 2 2 2 9 1 2 2 2 2 2 2 1 2 2 1 2 2 2 2 1 2 2 2 2 2 2 2 1 2 9 2 2 2 2 2 1 2 2 1 2 2 2 2 2 2 2 2 2 2 2 2 2 2 2 2 2 2 2 2 2 2 9 1 2 2 2 2 1 9 1 1
left_child=2 7 22 10 5 6 -3 8 11 -10 26 39 13 14 -13 16 -9 52 19 -19 32 -22 98 25 -25 50 27 28 29 -4 47 -32 -14 36 78 -36 37 38 -6 58 41 42 -24 91 -45 51 -47 66 -15 53 54 -26 87 56 -7 69 -38 77 76 -33 67 82 -52 -62 71 81 -18 -54 86 -51 -49 -41 -60 83 -66 89 -2 95 -27 90 92 85 -20 -28 88 94 96 -17 -67 -29 -59 -44 102 -79 -12 -43 104 -88 99 -1 -87 -94 -70 -82 -42 107 -107 -100
right_child=1 4 3 -5 33 23 -8 15 9 -11 65 12 20 48 -16 17 30 18 61 -21 21 -23 40 24 45 34 73 75 -30 -31 31 59 -34 -35 35 -37 49 -39 -40 64 68 57 43 44 -46 46 -48 70 -50 55 62 -53 60 -55 -56 -57 -58 79 72 -61 63 -63 -64 -65 74 84 -68 -69 80 -71 -72 -73 -74 -75 -76 -77 -78 93 -80 -81 103 -83 -84 -85 -86 100 97 -89 -90 -91 -92 -93 101 -95 -96 -97 -98 -99 105 -101 -102 -103 -104 -105 -106 106 -108 -109
leaf_value=-0.024677343839783955 -0.016058050991609941 0.11467603958704331 0.0080077882738516411 0.046635688586347146 0.040874301935151444 0.012407487107590702 0.01836099643595979 0.069774949698611491 0.11118982790119276 0.0076088934078584955 -0.024277015562594904 0.018966911995169911 -0.014836997126071602 0.04850074630631393 -0.0061165433871268526 0.0099582954497803421 0.0050500157783027189 0.0073060013301194512 0.012164875531384929 0.1252921277009299 0.034463216199742165 0.0033337678973729594 8.1022281925337094e-06 0.072797044625107041 0.022120508759833464 0.021194573500332284 -0.021610686646213163 -0.020314228810395362 0.029113436440050051 -0.014616288014857669 0.062246802470974021 0.0044295778799897639 -0.0020661344142467713 0.053511262439106637 0.081724166450561742 0.027295779819037282 0.03442221635677116 0.034561831845873726 0.086101468080636248 -0.0071606298243647674 -0.024279589659826888 -0.024128870663447648 -0.023900877878013375 0.015648125068162155 -0.015143868793800858 0.043032761820681706 0.031164474034343088 0.0068397871777874999 0.062510764595273605 0.038049072596839942 0.019433302343271973 0.030853126143497035 0.019348684526861955 0.028012358808644514 0.018145553579966819 0.048477637458022069 0.040523506731146075 -0.018850689701895268 -0.011038261740379746 0.013212954939154524 0.012056935074931843 0.023167690280303327 0.026173355386124864 0.019791698672530479 -0.00016602564909029042 -0.020788926888108003 4.3787863415617078e-05 0.026870125916443173 -0.021844141375523627 0.041426548816975585 0.0098570492240811648 -0.0027078946015337934 -0.006871844193396333 -0.015402054717867318 0.0049202989955931288 -0.015463939285093434 -0.013271117482225779 -0.022200752721710695 0.023847145449216661 -0.01557722888267786 -0.019208755653470286 -0.021237310771910933 0.015073580224559072 -0.019007873978873348 -0.01741804869777638 -0.022809437492390627 -0.023180751205705452 0.0079367201821722282 -0.018955660372884826 -0.018153695447330098 -0.017404713569054438 -0.023113998541261206 -0.02082805395049862 -0.021188186992813617 -0.023501291167179833 -0.023427711975484655 -0.023652249909876175 -0.022539679239013552 -0.024827894002108358 -0.024811362134494516 -0.022075149633727857 -0.020328393416774879 -0.021301005485606626 -0.018860004280740736 -0.024081672948466675 -0.024813683985058222 -0.02482926491427587 -0.024823887765645286
leaf_weight=294.66197553277016 21.233005613088611 8.8146167099475861 51.436915084719658 11.006268605589865 13.539798706769945 52.409558564424515 8.1825433671474457 6.2781073153018943 7.1905967295169857 11.434902697801588 20.433540672063828 52.580099314451218 30.943815052509308 18.334742367267609 72.69210147857666 9.4919248223304731 11.282207876443863 6.6444360315799704 6.3373373150825518 8.1733252406120283 20.760931193828583 140.49625319242477 29.015708923339844 9.8664951324462873 39.618404120206833 21.613267213106159 6.3308550417423266 4.8618457764387131 14.230867952108381 30.583730667829514 7.2721540033817282 18.50927618145943 174.07956777513027 29.273744463920593 8.6100908815860731 48.689533799886703 37.194909363985062 27.601980924606323 10.406596273183821 7.2625255435705212 16.211945235729218 15.655643507838249 18.467904925346375 8.5756574273109418 57.642429515719414 15.647093117237089 99.088244825601578 21.733145624399185 10.920321315526964 18.05441290140152 30.405739575624466 20.039654165506363 9.7592141330242175 13.853635609149931 55.910147428512573 13.689828515052794 30.978002846240997 13.628026917576795 15.148902758955956 7.3579197525978079 11.243447363376619 6.5469758212566367 11.239861547946928 10.548205643892286 5.5384026616811735 7.1850867271423358 43.59316024184227 6.6109202802181235 5.566284194588663 20.907341122627258 26.570447266101837 22.047500088810921 7.9147792607545862 4.6448909491300574 5.4413756132125854 6.7927973717451104 10.486568093299864 26.204562440514565 7.6805973351001731 6.3033379465341559 4.6565187424421293 5.8841134160757056 6.7942421734333038 7.7670457810163498 4.939856454730033 4.3087892979383451 9.4016916751861572 6.0841800570487967 7.7583988457918167 5.4837758392095566 8.1113386154174787 23.133480906486511 5.7755217999219877 6.0280002951622 13.217407435178755 12.084477201104164 11.445233702659609 9.7995227575302124 181.64952823519707 238.88154990971088 4.7144200354814529 6.3954511284828186 4.3800630420446396 6.911549985408783 4.052986308932307 16.497566610574722 11.508716046810152 51.793189197778702
leaf_count=1534 99 26 204 38 26 174 25 20 22 38 106 196 98 64 265 32 41 22 20 23 67 502 116 24 109 65 28 24 41 136 23 58 670 38 23 123 77 38 19 31 84 81 95 38 273 26 228 78 37 31 91 46 33 22 166 21 52 65 68 23 36 20 31 33 22 36 157 21 28 34 93 85 34 19 20 33 47 122 21 31 23 29 21 32 24 22 48 21 38 27 40 119 29 27 68 57 59 50 947 1245 24 32 22 34 21 86 60 270
internal_value=0 0.0183418 -0.0200905 -0.00606561 0.0328623 0.0282291 0.0683094 0.00737901 0.00407966 0.0475976 -0.00895752 0.00276359 0.00478032 0.0137487 0.00441165 0.0164482 0.0107953 0.025584 0.0406937 0.0723859 0.000996737 0.0073415 -0.0227773 0.0266102 0.0324232 0.0220824 -0.00212032 0.000668718 0.00393952 -0.000428242 0.00807901 0.0190673 -0.00399362 0.0422754 0.0308789 0.0354744 0.0405092 0.0466247 0.0605291 -0.00828404 -0.0176668 -0.0159271 -0.0125305 -0.0159048 -0.0111561 0.030139 0.032783 0.00454977 0.0537304 0.0381685 0.017003 0.0250539 0.0158846 0.0356438 0.0153692 0.0421017 0.0371947 -0.0212078 -0.0128093 0.00692801 0.0186258 0.0168297 0.0212524 0.0158009 -0.00213088 -0.0221574 0.00107305 0.0223861 -0.0222909 0.0398615 0.0084995 -0.00381121 -0.00960847 -0.0189934 0.00235466 -0.0177005 -0.0151367 -0.0228495 0.0218901 -0.0176966 -0.0203349 -0.0233535 0.0136698 -0.0201767 -0.0192361 -0.0236453 -0.023585 0.00916865 -0.0198371 -0.019169 -0.0183112 -0.0234633 -0.021033 -0.0220114 -0.0239723 -0.0238234 -0.0240279 -0.0228536 -0.0247666 -0.0247373 -0.0224258 -0.0205655 -0.021605 -0.0190004 -0.02424 -0.0248263 -0.0248201 -0.024827
internal_weight=0 1518.65 1316.02 211.581 653.316 437.816 16.9972 865.337 634.506 18.6255 200.574 615.881 520.808 154.527 125.272 230.831 142.596 88.2342 34.4963 14.8178 366.281 161.257 1104.44 420.819 184.26 236.559 132.133 113.39 96.2515 82.0206 136.318 33.1393 205.023 215.5 86.5935 57.2996 186.227 51.5484 23.9464 95.0731 309.447 224.851 136.835 107.819 66.2181 174.393 114.735 103.179 29.2551 134.678 149.965 59.6581 53.7379 82.0265 108.32 52.6516 68.1729 88.0154 54.7833 25.8672 38.1618 19.6786 41.6456 21.7917 40.2898 68.4416 54.8754 16.3701 84.5968 38.9618 48.3036 29.31 23.0637 18.7428 10.9798 17.1384 31.7196 59.9727 29.2939 28.0427 33.6854 48.5583 13.1316 14.0979 19.8833 42.6742 50.9114 15.5761 14.9435 10.3456 21.7394 41.6014 22.1173 32.2326 33.6509 27.7401 31.7102 19.2012 794.993 533.544 9.02321 12.171 9.94635 11.5681 20.2649 261.449 28.0063 233.443
internal_count=11241 4676 6565 929 1536 1178 51 3140 2365 60 891 2305 1899 562 461 775 493 282 106 45 1337 569 5636 1127 433 694 544 465 381 340 473 104 768 358 232 146 320 83 45 406 1494 1064 641 525 311 409 254 369 101 237 462 155 176 151 340 86 129 423 248 81 123 61 122 69 158 347 198 54 430 65 171 116 102 79 42 84 146 287 86 136 168 249 41 60 98 220 262 53 74 51 105 214 111 149 174 138 164 98 4142 2779 46 61 50 57 105 1363 146 1217
cat_boundaries=0 1 2 3 4 5 6 7 8 9 10 11 12 13 14 15 16 17 18 19 20 21
cat_threshold=1 2 1 1 1 1 2 1 1 1 1 1 1 1 1 2 1 1 1 1 1
is_linear=0
shrinkage=0.05


Tree=12
num_leaves=106
num_cat=20
split_feature=2 2 3 3 2 2 3 3 2 1 0 0 2 2 2 2 2 2 1 2 1 3 2 2 2 2 3 3 2 2 2 2 2 2 2 2 3 2 2 0 1 2 2 2 2 2 3 2 2 2 1 3 3 1 2 1 2 2 2 2 2 3 3 2 2 2 2 2 1 2 3 2 1 2 1 2 1 2 3 2 3 2 2 2 2 2 3 2 2 2 2 3 2 2 2 0 1 2 2 2 2 1 0 1 1
split_gain=396.533 86.6159 19.8152 11.878 9.75773 9.66351 13.7864 16.8531 9.31922 12.1581 7.12028 4.93559 7.46836 20.3824 7.17511 4.56126 4.28498 5.513 3.73799 3.39617 4.74493 4.39746 6.39491 19.0506 3.1764 7.16176 2.41452 2.65472 3.13117 6.3331 1.67783 2.72025 1.66503 1.27818 1.2543 7.932 1.94393 1.24071 7.09663 1.00182 1.6129 2.26669 1.54911 2.7717 0.932161 0.904069 0.831544 3.63084 0.591863 0.584502 0.430708 0.383606 0.374867 0.356315 0.323265 0.245786 0.53464 0.20541 0.145483 0.141898 0.132637 0.132409 0.115406 0.0992924 0.0971151 0.0916531 0.214709 0.0870815 0.057809 0.0354243 0.032015 0.0286499 0.023632 0.0199574 0.0188355 0.0150574 0.0146932 0.0146368 0.014161 0.0126865 0.0122187 0.0120147 0.00955736 0.00874961 0.00694747 0.00673536 0.0050648 0.00427339 0.00259698 0.00239779 0.00204171 0.00197498 0.00137061 0.00103346 0.000803843 0.000568771 0.000971389 0.000494172 0.000306745 0.000293635 0.000136355 5.1983e-05 4.90975e-07 6.75004e-07 2.65184e-07
threshold=13.500000000000002 119.50000000000001 1.0000000180025095e-35 28.500000000000004 353.50000000000006 66.500000000000014 17.500000000000004 23.500000000000004 123.50000000000001 0 1 2 23.500000000000004 21.500000000000004 16.500000000000004 1.0000000180025095e-35 204.50000000000003 208.50000000000003 3 67.500000000000014 4 2.5000000000000004 93.500000000000014 84.500000000000014 46.500000000000007 48.500000000000007 3.5000000000000004 1.5000000000000002 8.5000000000000018 6.5000000000000009 4.5000000000000009 2.5000000000000004 26.500000000000004 883.50000000000011 72.500000000000014 74.500000000000014 7.5000000000000009 150.50000000000003 157.50000000000003 5 6 1.5000000000000002 4.5000000000000009 7.5000000000000009 242.50000000000003 35.500000000000007 1.0000000180025095e-35 471.50000000000006 248.50000000000003 82.500000000000014 7 28.500000000000004 12.500000000000002 8 157.50000000000003 9 503.50000000000006 6.5000000000000009 95.500000000000014 111.50000000000001 45.500000000000007 38.500000000000007 2.5000000000000004 23.500000000000004 4.5000000000000009 500.00000000000006 456.50000000000006 4.5000000000000009 10 72.500000000000014 11.500000000000002 8.5000000000000018 11 2.5000000000000004 12 16.500000000000004 13 11.500000000000002 7.5000000000000009 9.5000000000000018 3.5000000000000004 69.500000000000014 4.5000000000000009 10.500000000000002 1.5000000000000002 2.5000000000000004 1.5000000000000002 9.5000000000000018 2.5000000000000004 6.5000000000000009 5.5000000000000009 1.5000000000000002 1.5000000000000002 1.5000000000000002 3.5000000000000004 14 15 3.5000000000000004 7.5000000000000009 5.5000000000000009 10.500000000000002 16 17 18 19
decision_type=2 2 2 2 2 2 2 2 2 1 9 9 2 2 2 2 2 2 1 2 1 2 2 2 2 2 2 2 2 2 2 2 2 2 2 2 2 2 2 9 1 2 2 2 2 2 2 2 2 2 1 2 2 1 2 1 2 2 2 2 2 2 2 2 2 2 2 2 1 2 2 2 1 2 1 2 1 2 2 2 2 2 2 2 2 2 2 2 2 2 2 2 2 2 2 9 1 2 2 2 2 1 9 1 1
left_child=2 5 15 10 8 6 11 -8 9 -3 26 45 13 14 -13 95 18 -18 52 -7 34 49 23 -23 32 -26 27 30 29 -29 31 -4 -14 46 62 -36 -37 78 -39 40 41 -17 88 -44 53 63 47 -6 -46 69 -15 65 54 -19 -10 56 -53 73 -51 -24 76 -54 81 75 80 66 -48 85 -62 -22 82 -32 -65 92 -30 -2 -47 87 -20 89 84 -21 -28 86 91 93 -66 -59 -43 99 -75 -12 -42 101 -87 96 -1 -86 -91 -69 -81 -41 104 -104 -97
right_child=1 4 3 -5 33 19 7 -9 16 -11 64 12 24 50 -16 39 17 44 37 20 21 22 59 -25 25 -27 70 28 74 -31 71 -33 -34 -35 35 36 -38 38 -40 67 57 42 43 -45 48 60 51 -49 -50 58 -52 55 61 -55 -56 -57 -58 77 -60 -61 68 -63 -64 72 83 -67 -68 79 -70 -71 -72 -73 -74 90 -76 -77 -78 -79 -80 100 -82 -83 -84 -85 97 94 -88 -89 -90 98 -92 -93 -94 -95 -96 102 -98 -99 -100 -101 -102 -103 103 -105 -106
leaf_value=-0.024673548356748162 -0.016924539305288033 0.099561336677331844 -0.006048432302432516 0.043379392739436071 0.060353358665218473 0.045249921002507722 0.10059362168194069 0.0020257949134944628 0.011948326977071754 0.017575216277326163 -0.024263445493155913 0.018144060343636706 -0.01468763666219935 0.045029061056129034 -0.0060017353873661906 7.9012743167329889e-06 0.065942655329179076 0.021093358125072358 0.020229381913012934 -0.0066315889576398085 0.004375335092515256 0.0062704096054228779 0.013147095338280233 0.10761370442836676 0.032454616269069307 0.00089648915545554415 -0.021540374358599148 0.0038596364338430128 -0.019787972460042873 0.049418503089331295 -0.021607649818602775 0.029082206352742963 -0.0020190541586074858 0.049429350002133929 0.063398969691408166 0.0044161570231540624 0.018226535389860857 0.073362500653091342 0.025892228542266256 -0.024266081288790018 -0.024111764649140003 -0.023878422073382543 0.00079834249926817244 -0.019969135444254965 0.040174413905944534 -0.0080580963107063086 0.034652660581794184 0.032544232635509325 0.03003342489266211 0.021340603033418604 0.057218215588241507 0.029858789669578081 0.018581438227826375 0.029161382490964529 0.017372783743320214 0.043047403169028525 0.041969650600887753 -0.018736919965844426 0.015163683554199487 0.02206849355729542 -0.0026055975450632865 0.024855763607448431 0.0023980842138505883 -0.011729575023143504 -0.020704053163441795 0.036174075563945772 0.027031939748752565 -0.02177821630186956 0.0025266902688562218 0.0088583417347152006 -0.015255732710076055 -0.017477902105841603 -0.0078602213272078846 -0.022141745984186986 -0.015165446450352513 -0.014461987116693047 -0.004669465209521848 -0.015431979947577551 0.022700083778833521 -0.019099749414408045 -0.021160211952619516 -0.0037011789617644891 -0.018896163362531974 -0.017287828298988062 -0.022762837192405981 -0.023142091859100003 -0.01884325968825654 -0.01727436017638714 -0.023073890857408692 -0.020743841894306052 -0.021110215709022613 -0.023469711706671465 -0.023394489272390101 -0.023624078942781446 -0.022487485687491628 -0.024827859955260587 -0.024810912363027317 -0.022013676643268622 -0.020235961500396429 -0.021225043916593068 -0.018746355818265923 -0.024063450311387222 -0.02481329103220806 -0.024829265182863484 -0.024823753466431515
leaf_weight=287.47948354482651 9.4236233681440371 9.8856812119483948 40.339854657649994 11.531710281968115 19.920705199241638 8.9209269881248456 8.0275675058364886 9.4317451119422895 53.063880950212479 8.3341706395149231 19.943447560071945 53.586899936199188 30.488090932369232 19.245907753705978 72.248834252357483 29.015944004058838 10.611536264419554 40.504548221826553 22.076240241527561 7.0147465169429797 6.1230337917804745 9.2846898436546343 13.312332689762117 9.2642965316772443 21.488891959190369 110.03054274618626 6.195508539676668 30.912446901202202 4.7845008522272092 10.126927793025969 8.8803700059652346 6.3820941299200049 173.72026830911636 30.882889091968536 6.7318060696125022 103.65035176277161 33.786438673734665 9.3432956933975202 50.036857336759567 15.82306534051895 15.282411977648735 18.03173840045929 28.271840631961823 37.215142846107483 16.335128247737885 10.051012173295019 29.470270603895187 28.572633445262909 120.70623356103897 16.74084547162056 11.62474647164345 16.471445292234421 31.002402782440186 20.667576789855957 56.93392938375473 24.161135613918304 20.397900819778442 13.373535633087164 22.138881504535675 6.7004248201847068 17.948548376560211 11.537930160760878 7.8698709309101096 14.148357748985291 7.0372585356235522 22.99821674823761 13.465942859649656 5.446011960506441 7.9024371802806881 15.719580858945845 4.5738981515169135 7.9677661955356589 5.4723291099071512 25.629211038351063 4.08549565076828 18.189122498035431 4.6924240291118613 6.2059101015329352 7.8659590482711783 4.5679263919591886 5.7604681402444831 6.9766503870487213 7.6208049356937408 4.8545589894056311 4.2116205990314466 9.1862597465515137 7.6127186864614487 7.9713845252990714 22.60490520298481 5.6564731150865537 5.9016215801239005 12.91040328145027 11.804656058549881 11.177704483270647 9.5811156928539276 177.19508148729801 233.02750200033188 4.6114887297153473 6.2667544484138489 4.2877498716115952 6.7824196517467499 3.9565495848655727 16.093239307403564 11.226481497287752 50.523306727409363
leaf_count=1534 44 26 168 38 35 22 23 30 174 25 106 196 98 64 265 116 24 109 65 24 21 31 41 23 67 403 28 122 24 21 39 31 670 38 20 369 104 23 123 84 81 95 126 185 26 44 56 38 263 54 37 30 91 46 166 35 32 65 69 20 72 31 28 65 36 38 21 28 30 53 19 40 24 122 20 85 20 31 21 23 29 24 32 24 22 48 38 40 119 29 27 68 57 59 50 947 1245 24 32 22 34 21 86 60 270
internal_value=0 0.0175452 -0.0199947 -0.00595524 0.0309887 0.00713451 0.00356916 0.047346 0.0270015 0.062059 -0.0088168 0.00225197 0.00419943 0.0132122 0.0042807 -0.0227301 0.0255842 0.0308311 0.021054 0.0149055 0.0138852 0.0225321 0.0357367 0.0568863 -7.42775e-06 0.00605276 -0.00207502 0.000648604 0.00927951 0.0151018 -0.00612759 -0.00124968 -0.00391046 0.0400494 0.0087145 0.0104068 0.0078112 0.029177 0.0333615 -0.0175394 -0.0157846 -0.0123761 -0.0157621 -0.0110035 0.0289513 -0.00866709 0.0383984 0.043968 0.0312422 0.0141465 0.049619 0.0362711 0.0162974 0.0238192 0.014756 0.0391277 0.0365591 -0.0211302 0.0178233 0.016134 -0.00319509 0.0202832 -0.00244579 -0.01337 -0.0220975 0.0336269 0.0322626 -0.0222336 -0.0010367 0.00760164 -0.0188816 -0.0196546 -0.0106504 -0.0228038 -0.0176588 -0.0153024 -0.00697959 -0.0175693 0.0208784 -0.0202426 -0.0233187 -0.00517037 -0.0200819 -0.0191275 -0.023617 -0.0235553 -0.0197371 -0.0181907 -0.0234309 -0.0209523 -0.0219487 -0.0239515 -0.0237992 -0.0240084 -0.0228079 -0.024765 -0.024735 -0.0223713 -0.0204769 -0.0215345 -0.0188886 -0.0242255 -0.0248262 -0.0248199 -0.0248269
internal_weight=0 1547.2 1289.93 210.343 675.247 871.956 597.721 17.4593 468.905 18.2199 198.812 580.262 492.434 156.706 125.836 1079.59 450.686 208.825 241.86 274.235 265.314 99.2841 38.5617 18.549 335.728 131.519 131.87 113.479 49.9094 41.0394 63.5701 46.7219 204.208 206.341 166.03 144.169 137.437 89.3224 59.3802 304.04 221.308 135.14 106.124 65.487 198.213 87.8279 175.458 48.4933 137.041 60.7223 30.8707 126.965 152.538 61.1721 109.998 61.0305 36.8693 86.1687 38.8797 20.0128 40.5944 42.5403 21.8613 47.2334 66.942 65.9344 42.9362 82.732 25.851 21.8426 18.3902 16.8481 19.6207 58.6179 8.87 27.6127 14.7434 27.5508 29.9422 33.0073 47.4374 13.9914 13.8163 19.5045 41.677 49.7247 14.65 21.3449 40.6366 21.657 31.5308 32.8539 27.0871 30.9573 18.7674 775.545 520.507 8.82311 11.9232 9.73376 11.3503 19.7796 255.038 27.3197 227.718
internal_count=11241 4676 6565 929 1536 3140 2237 53 1213 51 891 2184 1800 562 461 5636 1162 468 694 903 881 312 115 54 1238 470 544 465 187 143 278 199 768 323 569 493 473 232 146 1494 1064 641 525 311 444 384 285 73 289 197 101 212 462 155 340 97 62 423 123 61 166 122 76 218 347 115 77 430 102 74 79 79 89 287 44 129 64 136 86 168 249 48 60 98 220 262 74 105 214 111 149 174 138 164 98 4142 2779 46 61 50 57 105 1363 146 1217
cat_boundaries=0 1 2 3 4 5 6 7 8 9 10 11 12 13 14 15 16 17 18 19 20
cat_threshold=1 2 1 1 1 2 1 1 1 1 1 1 1 1 2 1 1 1 1 1
is_linear=0
shrinkage=0.05


Tree=13
num_leaves=107
num_cat=23
split_feature=2 2 3 3 2 3 2 2 2 1 0 0 2 2 2 2 2 2 1 1 2 2 1 3 2 2 3 2 2 1 2 2 1 2 2 3 3 3 0 1 2 2 2 2 2 2 2 2 3 2 2 3 1 3 2 1 2 2 2 2 2 2 2 3 3 2 2 2 0 1 2 2 3 1 1 2 2 2 1 2 3 2 2 2 2 2 3 2 2 2 2 2 3 2 2 2 0 1 2 2 2 2 1 0 1 1
split_gain=377.78 77.8228 19.7883 10.972 8.94761 12.3808 16.7989 8.4277 7.98344 9.6092 6.99936 4.70235 6.97022 18.0936 6.71027 4.63168 3.39515 4.69784 3.31725 3.10414 5.46237 2.99434 4.29965 3.86557 5.41239 15.196 2.3432 2.52988 3.58298 3.76304 2.34124 1.19845 1.23084 1.17232 6.93501 1.79193 1.13031 7.34369 1.0076 1.61199 2.21802 1.54974 2.71773 0.882009 0.8591 6.18019 0.757174 0.705646 0.692218 0.533828 0.397004 0.338231 0.314037 0.305738 0.29387 0.268054 0.213064 0.207854 0.167374 0.150709 0.130866 0.128029 0.127577 0.117953 0.110329 0.0985703 0.0982573 0.0885182 0.0743184 0.0550356 0.0460247 0.0329799 0.0321598 0.0231723 0.0227412 0.020338 0.0150115 0.0146584 0.0142548 0.0128192 0.012446 0.0116068 0.00966152 0.00880628 0.00708979 0.0068763 0.00511366 0.00495181 0.00429265 0.00265135 0.00242987 0.00207367 0.00201896 0.00140061 0.00105666 0.000819075 0.000582985 0.000995546 0.000502889 0.000310379 0.000298035 0.000137319 5.31859e-05 5.03333e-07 6.91943e-07 2.71791e-07
threshold=13.500000000000002 119.50000000000001 1.0000000180025095e-35 28.500000000000004 66.500000000000014 17.500000000000004 38.500000000000007 334.50000000000006 123.50000000000001 0 1 2 23.500000000000004 21.500000000000004 16.500000000000004 1.0000000180025095e-35 204.50000000000003 208.50000000000003 3 4 47.500000000000007 67.500000000000014 5 2.5000000000000004 93.500000000000014 84.500000000000014 3.5000000000000004 8.5000000000000018 6.5000000000000009 6 27.500000000000004 628.50000000000011 7 72.500000000000014 74.500000000000014 7.5000000000000009 3.5000000000000004 5.5000000000000009 8 9 1.5000000000000002 4.5000000000000009 7.5000000000000009 35.500000000000007 471.50000000000006 455.50000000000006 490.00000000000006 242.50000000000003 1.5000000000000002 82.500000000000014 22.500000000000004 12.500000000000002 10 1.0000000180025095e-35 157.50000000000003 11 163.50000000000003 6.5000000000000009 548.00000000000011 372.00000000000006 95.500000000000014 111.50000000000001 45.500000000000007 38.500000000000007 2.5000000000000004 4.5000000000000009 23.500000000000004 4.5000000000000009 12 13 922.50000000000011 72.500000000000014 11.500000000000002 14 15 2.5000000000000004 16.500000000000004 11.500000000000002 16 9.5000000000000018 3.5000000000000004 69.500000000000014 4.5000000000000009 10.500000000000002 1.5000000000000002 2.5000000000000004 1.5000000000000002 10.500000000000002 9.5000000000000018 2.5000000000000004 6.5000000000000009 5.5000000000000009 1.5000000000000002 1.5000000000000002 1.5000000000000002 3.5000000000000004 17 18 3.5000000000000004 7.5000000000000009 5.5000000000000009 10.500000000000002 19 20 21 22
decision_type=2 2 2 2 2 2 2 2 2 1 9 9 2 2 2 2 2 2 1 1 2 2 1 2 2 2 2 2 2 1 2 2 1 2 2 2 2 2 9 1 2 2 2 2 2 2 2 2 2 2 2 2 1 2 2 1 2 2 2 2 2 2 2 2 2 2 2 2 9 1 2 2 2 1 1 2 2 2 1 2 2 2 2 2 2 2 2 2 2 2 2 2 2 2 2 2 9 1 2 2 2 2 1 9 1 1
left_child=2 4 15 10 5 11 -7 8 9 -3 26 43 13 14 -13 96 18 -18 51 30 -21 -6 33 49 25 -25 27 28 29 -4 -14 44 70 64 -35 -36 56 -38 39 40 -17 89 -43 66 45 55 -46 52 -49 71 -15 54 -19 -48 -10 68 -20 75 -55 -57 -51 -26 78 -53 81 80 76 85 -9 -64 -33 -24 82 -68 -29 93 -2 88 -45 90 84 -23 -28 86 92 94 -67 -76 -59 -42 100 -77 -12 -41 102 -87 97 -1 -86 -92 -69 -81 -40 105 -105 -98
right_child=1 7 3 -5 21 6 -8 31 16 -11 65 12 19 50 -16 38 17 47 36 20 -22 22 23 24 61 -27 72 74 -30 -31 -32 32 -34 34 35 -37 37 -39 67 57 41 42 -44 62 46 -47 53 48 -50 60 -52 63 -54 58 -56 59 -58 77 -60 -61 -62 -63 69 -65 -66 83 73 79 -70 -71 -72 -73 -74 -75 87 91 -78 -79 -80 101 -82 -83 -84 -85 98 95 -88 -89 -90 -91 99 -93 -94 -95 -96 -97 103 -99 -100 -101 -102 -103 -104 104 -106 -107
leaf_value=-0.024669657906679354 -0.016789617166908657 0.087773386688883584 0.0077576082682438976 0.040483800234444117 0.042149521379859181 0.099672891015891579 0.0028217068484669115 0.029205941922964551 0.011511511159687647 0.016836459361788486 -0.024249547807080073 0.017371381063961366 0.0090220126659992031 0.050958633629511391 -0.0058883978481979894 7.7052555808420515e-06 0.060150001759894281 0.020134840510996375 0.019498829888482894 -0.0014229066736394672 0.020366753426420803 -0.0065105086533157807 0.0042478343237855338 0.0060760120301892023 0.012651084618808959 0.094101135081137849 -0.021468762665011215 -0.015163958699987724 0.026117945749116574 -0.014462529055788305 -0.0059436768782899227 0.037225117992803688 0.054694061337614654 0.05797901568778812 0.0042872894569735663 0.017448886844892177 0.071116478736386324 0.022228480688255271 -0.024252246815792335 -0.024094253994016851 -0.023855443223177598 0.00077789082066337758 -0.019871107545601605 -0.007922406620153425 0.020233667471323592 0.070970804847967681 0.028258527121167526 0.023825627325145978 0.031831365742334673 0.020365748758724107 0.039826762216006603 0.017782253034192581 0.027609675071397072 0.039090009819911786 0.016645948768396538 0.039548093611778593 0.026177317074350899 -0.018621691937539125 0.03239183473485676 0.033436812276914182 0.014561817538979406 0.021044867017810581 -0.0025476161625231086 0.023636025733081746 0.0023328690858401093 -0.020617754469879273 -0.011575016472127924 -0.021711041950357043 0.033435027753009425 0.0024576575296021436 0.040399930460984029 0.0085612429738718219 -0.015108561591698001 -0.0077263153144115975 -0.020136263512331706 -0.022081575462877697 -0.014310966374086815 -0.015285835894085996 -0.0045751096856624573 -0.018989264887432567 -0.021081747170301521 -0.0036228353523297947 -0.01878298430917541 -0.017156320281998042 -0.022715260617333786 -0.023102591121139066 -0.018729395374738358 -0.017902656082225851 -0.0171427201310792 -0.023032916441681341 -0.020658209659643104 -0.021030871249245603 -0.023437426529887711 -0.023360527133940483 -0.023595268079855083 -0.022434229038364145 -0.024827824792511881 -0.024810450986291598 -0.021951007813146656 -0.0201420651152955 -0.021147725829798666 -0.018631247313034009 -0.024044799557986347 -0.024812889863674407 -0.024829265192297546 -0.024823615533954142
leaf_weight=280.47313824295998 9.2654748409986514 10.920575767755508 51.831812754273415 12.042957484722136 9.3338704109191877 7.7783720195293453 10.549601376056669 31.304830491542816 53.701708227396011 8.4819400608539581 19.465374961495399 54.568058371543884 30.617961123585701 18.031201034784317 71.816514149308205 29.016172170639038 11.334876596927641 41.367999911308289 27.609334766864777 82.576419875025749 44.13449838757515 6.9683812558650988 6.1498828828334835 9.34309169650078 13.48850652575493 10.316882550716398 6.0634818375110644 6.5819701105356216 15.067585796117781 30.130113855004311 178.41153268516064 23.844524383544922 16.445918619632721 7.1724152863025656 104.10909935832024 34.407894849777222 9.9811359345912916 33.341377526521683 15.443723380565642 14.91833308339119 17.606269642710686 28.29442036151886 36.479359120130539 9.9703455567359907 13.965606510639189 12.348536908626555 20.224562227725983 40.228398323059082 82.117977499961853 17.101944535970688 14.410430580377577 31.583857446908951 21.279145956039429 19.522456765174866 57.931671380996704 18.14436674118042 21.045940488576889 13.12529000639916 17.857363700866699 22.720989167690277 22.477147281169891 6.8499369025230399 17.90184260904789 11.828308224678038 7.8887660801410666 6.8930566310882586 13.983373060822487 5.3286894559860247 15.547656804323195 7.9224292039871242 21.900088369846344 15.859449476003645 4.5046496242284766 5.4294839948415765 4.6774776130914706 25.06797227263451 17.927964523434639 6.1108760088682166 4.6705640554428092 4.4815081208944303 5.6398558318614951 6.9508761763572693 7.4781531393527985 4.7713553607463828 4.116834953427313 8.9761117249727249 7.4706130027770996 5.2850291579961777 7.8348666429519644 22.089293643832207 5.5403447449207288 5.778342828154563 12.610927551984785 11.531697794795036 10.916736498475077 9.3680647015571594 172.84987108409405 227.31700904667377 4.5110821425914764 6.1412149369716644 4.1977013647556305 6.6564584672451019 3.8624776303768185 15.698826968669891 10.951167941093445 49.284568727016449
leaf_count=1534 44 26 204 38 22 20 33 61 174 25 106 196 87 56 265 116 24 109 76 297 139 24 21 31 41 23 28 33 41 136 715 34 19 20 369 104 26 81 84 81 95 126 185 44 18 18 27 85 169 54 45 91 46 33 166 29 49 65 27 36 69 20 72 31 28 36 65 28 30 30 26 53 19 24 24 122 85 31 20 23 29 24 32 24 22 48 38 27 40 119 29 27 68 57 59 50 947 1245 24 32 22 34 21 86 60 270
internal_value=0 0.0167982 -0.0198974 -0.00584685 0.0069006 0.00346291 0.0439252 0.0292791 0.0253697 0.0567628 -0.0086777 0.0021879 0.00407427 0.0127045 0.00415429 -0.0226819 0.0239958 0.0289038 0.0200951 -8.36051e-06 0.00616662 0.0143085 0.0133428 0.0214585 0.0335613 0.0522686 -0.00203191 0.000627397 0.00370885 -0.000410761 -0.00375155 0.037016 0.0429627 0.0084206 0.010039 0.00755666 0.0276178 0.0334919 -0.0174108 -0.0156412 -0.0122218 -0.0156186 -0.0108512 -0.00852669 0.0348613 0.0378529 0.0306785 0.0269893 0.029199 0.0135984 0.0460139 0.0156323 0.0226738 0.0332107 0.014176 0.0331907 0.0223876 -0.0210512 0.0358901 0.0361502 0.0170697 0.0154781 -0.00312599 0.0193772 -0.00239114 -0.0220365 -0.0132158 -0.0221753 0.0306093 -0.00101209 0.038745 0.00735598 -0.0187682 -0.0104986 -0.0174446 -0.0227571 -0.0151555 -0.0174406 -0.00685459 -0.0201488 -0.023283 -0.00506849 -0.0199856 -0.0190174 -0.023588 -0.0235249 -0.0196356 -0.0189514 -0.0180689 -0.0233977 -0.0208702 -0.0218848 -0.0239303 -0.0237744 -0.0239884 -0.0227613 -0.0247634 -0.0247327 -0.0223157 -0.0203869 -0.0214628 -0.0187753 -0.0242107 -0.0248261 -0.0248196 -0.0248269
internal_weight=0 1574.97 1264.48 209.142 878.384 599.966 18.328 696.581 462.754 19.4025 197.099 581.638 494.567 158.826 126.385 1055.34 443.352 196.328 247.023 335.74 126.711 278.418 269.084 101.587 39.9984 19.66 131.62 113.574 97.0295 81.9619 209.029 233.827 62.1905 167.497 145.689 138.517 91.9778 43.3225 298.766 217.853 133.486 104.469 64.7738 87.0715 171.636 100.066 71.57 184.994 122.346 61.5884 32.4416 155.046 62.6471 57.6044 111.633 87.7178 48.6553 84.3674 37.3798 40.8654 39.5791 20.3384 40.4652 43.4122 21.808 65.4791 46.6063 80.913 46.8525 25.8243 45.7446 22.0093 18.0463 19.4129 16.5445 57.2963 27.1934 27.071 14.6409 32.3459 46.3441 13.9193 13.5416 19.135 40.7042 48.5671 14.3637 9.96251 20.9602 39.6956 21.208 30.8463 32.0763 26.45 30.2229 18.3442 756.575 507.79 8.62792 11.6816 9.52639 11.138 19.3062 248.784 26.65 222.134
internal_count=11241 4676 6565 929 3140 2237 53 1536 1178 51 891 2184 1800 562 461 5636 1127 433 694 1238 436 903 881 312 115 54 544 465 381 340 802 358 79 569 493 473 232 107 1494 1064 641 525 311 384 279 174 105 409 254 197 101 462 155 87 340 156 125 423 60 65 123 61 166 122 76 347 218 430 91 102 60 74 79 89 84 287 129 136 64 168 249 48 60 98 220 262 74 51 105 214 111 149 174 138 164 98 4142 2779 46 61 50 57 105 1363 146 1217
cat_boundaries=0 1 2 3 4 5 6 7 8 9 10 11 12 13 14 15 16 17 18 19 20 21 22 23
cat_threshold=1 2 1 1 1 1 1 1 2 1 1 1 2 1 1 2 1 2 1 1 1 1 1
is_linear=0
shrinkage=0.05


Tree=14
num_leaves=106
num_cat=21
split_feature=2 2 3 3 2 3 2 2 0 2 1 2 0 2 2 2 2 2 1 1 2 2 1 3 2 2 3 3 2 2 2 2 2 2 2 3 2 2 0 1 2 2 2 3 2 3 2 2 2 2 2 2 1 3 1 2 1 3 2 2 2 2 2 2 3 3 2 2 2 1 3 2 2 1 2 1 2 2 1 2 3 2 2 2 2 2 3 2 2 2 2 3 2 2 2 0 1 2 2 2 2 1 0 1 1
split_gain=360.172 70.1147 19.7577 10.1622 8.29412 11.16 13.742 7.29738 6.87967 6.66923 7.73787 4.70233 4.48055 6.5101 16.1324 6.28057 3.30665 3.8841 2.95339 2.94394 5.27586 2.65154 3.90535 3.41415 4.62098 12.3554 2.2741 2.46963 2.84268 5.2498 2.22783 1.64424 2.53474 1.09643 6.10143 1.65378 1.08828 9.87342 1.01307 1.61046 2.16975 1.54985 2.6642 0.954878 0.860171 0.739464 2.40711 1.23397 0.706576 0.632613 0.499443 0.488323 0.336513 0.305852 0.277825 0.267628 0.223444 0.275833 0.210273 0.198827 0.131369 0.122683 0.117999 0.115775 0.105467 0.105393 0.100027 0.0971886 0.0899623 0.0523946 0.0322938 0.0313907 0.0307251 0.0227114 0.020723 0.0189965 0.0149593 0.0146741 0.0138244 0.0129495 0.0126757 0.0112092 0.00976407 0.00886027 0.00723426 0.00701952 0.00516143 0.0043104 0.00270662 0.00246178 0.0021057 0.00206378 0.00143115 0.00108031 0.000834486 0.000597538 0.00102033 0.000511672 0.000313973 0.000302434 0.000138242 5.44152e-05 5.15939e-07 7.09311e-07 2.78834e-07
threshold=13.500000000000002 119.50000000000001 1.0000000180025095e-35 28.500000000000004 66.500000000000014 17.500000000000004 38.500000000000007 353.50000000000006 0 123.50000000000001 1 1.0000000180025095e-35 2 23.500000000000004 21.500000000000004 16.500000000000004 204.50000000000003 208.50000000000003 3 4 31.500000000000004 67.500000000000014 5 2.5000000000000004 93.500000000000014 84.500000000000014 3.5000000000000004 1.5000000000000002 8.5000000000000018 6.5000000000000009 27.500000000000004 4.5000000000000009 2.5000000000000004 72.500000000000014 74.500000000000014 7.5000000000000009 151.50000000000003 145.50000000000003 6 7 1.5000000000000002 4.5000000000000009 7.5000000000000009 162.00000000000003 35.500000000000007 1.0000000180025095e-35 471.50000000000006 609.50000000000011 242.50000000000003 827.00000000000011 248.50000000000003 82.500000000000014 8 12.500000000000002 9 157.50000000000003 10 23.500000000000004 6.5000000000000009 168.50000000000003 500.00000000000006 45.500000000000007 95.500000000000014 111.50000000000001 2.5000000000000004 38.500000000000007 4.5000000000000009 23.500000000000004 4.5000000000000009 11 11.500000000000002 8.5000000000000018 72.500000000000014 12 2.5000000000000004 13 16.500000000000004 11.500000000000002 14 9.5000000000000018 3.5000000000000004 69.500000000000014 4.5000000000000009 10.500000000000002 1.5000000000000002 2.5000000000000004 1.5000000000000002 9.5000000000000018 2.5000000000000004 6.5000000000000009 5.5000000000000009 1.5000000000000002 1.5000000000000002 1.5000000000000002 3.5000000000000004 15 16 3.5000000000000004 7.5000000000000009 5.5000000000000009 10.500000000000002 17 18 19 20
decision_type=2 2 2 2 2 2 2 2 9 2 1 2 9 2 2 2 2 2 1 1 2 2 1 2 2 2 2 2 2 2 2 2 2 2 2 2 2 2 9 1 2 2 2 2 2 2 2 2 2 2 2 2 1 2 1 2 1 2 2 2 2 2 2 2 2 2 2 2 2 1 2 2 2 1 2 1 2 2 1 2 2 2 2 2 2 2 2 2 2 2 2 2 2 2 2 9 1 2 2 2 2 1 9 1 1
left_child=2 4 11 8 5 12 -7 9 26 10 -3 95 44 14 15 -14 18 -18 53 30 -21 -6 33 51 25 -25 27 31 29 -29 -15 32 -4 64 -35 -36 37 -20 39 40 -13 88 -43 45 67 46 -9 -48 54 56 -50 72 -16 55 -19 -11 60 -58 74 -38 -47 78 -53 -26 81 -55 80 76 85 -63 82 -33 -24 -69 92 -30 -2 87 -46 89 84 -23 -28 86 91 93 -68 -60 -42 99 -76 -10 -41 101 -87 96 -1 -86 -91 -70 -81 -40 104 -104 -97
right_child=1 7 3 -5 21 6 -8 43 66 16 -12 38 13 19 52 -17 17 48 36 20 -22 22 23 24 63 -27 70 28 75 -31 -32 71 -34 34 35 -37 59 -39 68 58 41 42 -44 -45 61 49 47 -49 50 -51 -52 62 -54 65 -56 -57 57 -59 77 -61 -62 69 -64 -65 -66 -67 83 73 79 -71 -72 -73 -74 -75 90 -77 -78 -79 -80 100 -82 -83 -84 -85 97 94 -88 -89 -90 98 -92 -93 -94 -95 -96 102 -98 -99 -100 -101 -102 -103 103 -105 -106
leaf_value=-0.02466567159208681 -0.016653494801761839 0.078311212666288432 -0.0059047758905327657 0.03789248622586365 0.039385065113198621 0.087861793560789228 0.0027437940890537101 0.052178576136441307 -0.024235318773644599 0.011095572482016921 0.016140828398468279 7.5138241916849957e-06 0.016644628430998436 0.0087179784178891273 0.038936652597153273 -0.0057765377342312929 0.055189191658386184 0.019238548908986089 0.01867468552231321 -0.011107517779099997 0.012030335387766482 -0.0063908553055811437 0.0041245816629103564 0.0058888005368520641 0.012179904084050173 0.083420074037845099 -0.021395836651115573 0.0037158752026030029 -0.019589964228719465 0.04401667565251504 -0.0058310928893284264 -0.021584454110570646 0.027627321966266018 0.053314404184213141 0.0041627255353802392 0.016717578406977858 0.018613957374298076 0.083728211903155714 -0.024025707871206555 -0.024076329965807199 -0.023831933449932549 0.00075797913030032586 -0.019771597566559038 0.047410970587777268 -0.0077879315320860164 0.027636139609833649 0.023159370411452024 0.041015079281436148 0.035830459594037099 0.039848972853550803 0.02682665687480984 0.019454628370044066 0.049192929122204354 0.017031221799770038 0.026181657894493296 0.015961268948815523 0.02988390744183669 0.037763500318695804 -0.018505013368257953 0.02447300357232645 0.031778655579452461 -0.0024907786623659459 0.013992368389796415 0.020089540177777181 0.0022695771874626774 0.022503930927817797 -0.020530020829584116 -0.0075936608162453165 -0.021642601654938823 0.0023906779146075771 -0.01496058029464158 -0.017213630615980784 0.0082765986930347819 -0.011420706830400001 -0.022020227039025446 -0.014867858805105183 -0.01415935700531757 -0.015138835503362492 -0.0044822325230287202 -0.018877308116922634 -0.021001904525012712 -0.0035458685711918254 -0.018668343893883079 -0.017023545191220891 -0.022666690129616945 -0.023062237520460788 -0.018614071112055836 -0.017009816255845286 -0.022991059739758079 -0.020571147545387553 -0.020950142609374181 -0.023404419959810886 -0.023325812729487486 -0.023565806026266425 -0.022379890549929074 -0.024827789937694165 -0.024809981255586103 -0.021887128846254853 -0.020046698283532401 -0.02106904106938598 -0.018514688059212175 -0.024238081202595609 -0.02481247978310383 -0.024829266406506768 -0.024823473241481007
leaf_weight=273.63861939311028 9.1112097501754779 11.922436982393265 40.033631563186646 12.54050552845001 9.7356975078582746 8.5936189889907855 10.579411476850508 22.035391449928284 18.999025076627735 54.323467791080475 8.6259549558162689 29.016396880149841 55.524261146783829 30.89544665813446 21.084724962711334 71.394871592521667 12.037591665983198 42.209380179643631 25.630882322788239 33.371333256363869 94.130262866616249 6.9231608510017413 6.1760619580745724 9.4000332057476061 13.660234898328783 11.334858208894728 5.9346938431262988 31.068129599094391 4.6036816239356977 10.921511650085447 177.35425712168217 8.8168900012969988 6.559101775288581 7.6005566120147696 104.55640411376953 35.013542950153351 23.400663614273071 7.5509749650955191 3.7707128673791885 14.563182324171066 17.191233932971954 28.316437929868698 35.761629119515419 14.988415956497191 9.8916686028242093 45.627429902553558 20.731549441814423 18.144301056861877 17.504917502403259 24.00745165348053 128.19960245490074 17.453809201717377 12.885069847106932 32.150512278079987 21.87484148144722 58.904069811105728 22.2901890873909 22.13648796081543 12.883136183023458 37.982200115919113 32.965670466423035 17.856293529272079 22.806849747896194 6.9956203103065482 7.907191038131713 12.111212462186812 6.7523924857378024 5.3876956552267075 5.2142449319362694 7.9419240057468441 4.4371024519205085 7.6912751942872992 15.995808809995649 13.822448521852495 24.520498931407932 3.963445246219635 17.673225179314613 6.0181765407323828 4.64924432337284 4.3972104638814908 5.5222023576498023 6.9257397651672363 7.3390019088983536 4.6901946365833274 4.0243741869926435 8.7711168825626373 7.3319954425096512 7.7017003297805777 21.586328819394112 5.4270651042461378 5.6580879986286154 12.318796783685682 11.265433385968208 10.662167981266977 9.1602395474910736 168.61121585965157 221.74654617905617 4.413138210773468 6.0187555551528931 4.1098615676164627 6.5335885584354401 15.073684036731722 15.314086109399796 10.682606399059296 48.076206743717194
leaf_count=1534 44 26 168 38 22 20 33 35 106 174 25 116 196 87 64 265 24 109 71 115 321 24 21 31 41 23 28 122 24 21 715 39 31 20 369 104 56 19 21 81 95 126 185 19 44 80 26 21 26 28 263 54 37 91 46 166 33 30 65 86 51 72 69 20 28 31 36 24 28 30 19 40 53 65 122 20 85 31 20 23 29 24 32 24 22 48 38 40 119 29 27 68 57 59 50 947 1245 24 32 22 34 84 86 60 270
internal_value=0 0.016096 -0.0197986 -0.00573903 0.00667648 0.00336044 0.0408949 0.0277121 -0.00853894 0.0243259 0.0522129 -0.0226327 0.00212599 0.00395359 0.0122233 0.00403222 0.0231167 0.0275688 0.0191984 -9.16558e-06 0.0059744 0.013745 0.0128298 0.0204614 0.0315971 0.0482718 -0.00198821 0.000608655 0.00884273 0.0141981 -0.00367263 -0.00598853 -0.00118429 0.0081393 0.00968809 0.00731233 0.0261831 0.0334785 -0.0172808 -0.0154968 -0.0120676 -0.0154741 -0.0106995 0.0352224 -0.00838738 0.0343438 0.0389763 0.0314931 0.025984 0.0324247 0.0279084 0.0130788 0.042827 0.0150045 0.0216085 0.0136268 0.0309758 0.0338101 -0.0209708 0.0222394 0.0293737 -0.00305818 0.0163604 0.0148587 -0.00233758 0.0185287 -0.0219743 -0.0130613 -0.0221158 -0.000988033 -0.0186534 -0.0195481 0.00712004 -0.0103474 -0.0227094 -0.0174054 -0.0150078 -0.0173106 -0.00673098 -0.0200536 -0.0232466 -0.0049681 -0.0198878 -0.0189058 -0.0235584 -0.0234939 -0.0195326 -0.0179456 -0.0233638 -0.0207867 -0.0218196 -0.0239085 -0.023749 -0.023968 -0.0227137 -0.0247618 -0.0247303 -0.022259 -0.0202954 -0.0213898 -0.0186606 -0.0241956 -0.024826 -0.0248194 -0.0248268
internal_weight=0 1601.99 1239.65 207.961 884.633 602.147 19.173 717.356 195.421 494.429 20.5484 1031.69 582.974 496.64 160.889 126.919 473.88 221.826 252.054 335.751 127.502 282.486 272.75 103.823 41.3907 20.7349 131.368 113.658 50.5568 41.9896 208.25 63.1009 46.5927 168.927 147.171 139.57 94.5647 33.1819 293.621 214.482 131.872 102.856 64.0781 222.927 86.3337 207.938 60.9112 38.8759 209.789 147.027 145.705 62.4325 33.9698 157.489 64.0842 113.228 123.02 44.4267 82.6102 61.3829 78.5931 40.3391 40.2607 20.6559 21.7561 44.2617 64.0521 45.9946 79.1386 25.7982 17.7108 16.5082 22.1719 19.2101 56.0072 8.56713 26.7844 26.603 14.5409 31.7007 45.2775 13.8489 13.2737 18.7746 39.7553 47.4379 14.0844 20.5848 38.7776 20.7699 30.1786 31.3178 25.8286 29.5066 17.9314 738.069 495.385 8.43751 11.4458 9.32411 10.9308 18.8444 242.684 25.9967 216.687
internal_count=11241 4676 6565 929 3140 2237 53 1536 891 1213 51 5636 2184 1800 562 461 1162 468 694 1238 436 903 881 312 115 54 544 465 187 143 802 278 199 569 493 473 232 90 1494 1064 641 525 311 323 384 304 82 47 444 222 289 197 101 462 155 340 194 63 423 142 131 166 123 61 76 122 347 218 430 102 79 79 74 89 287 44 129 136 64 168 249 48 60 98 220 262 74 105 214 111 149 174 138 164 98 4142 2779 46 61 50 57 105 1363 146 1217
cat_boundaries=0 1 2 3 4 5 6 7 8 9 10 11 12 13 14 15 16 17 18 19 20 21
cat_threshold=2 1 1 1 1 1 2 1 1 1 1 1 2 1 1 2 1 2 1 1 1
is_linear=0
shrinkage=0.05


Tree=15
num_leaves=111
num_cat=21
split_feature=2 2 3 3 2 3 3 0 2 2 1 2 0 2 2 2 2 2 2 2 1 2 1 3 2 2 3 2 3 2 2 2 2 2 2 2 2 2 3 0 1 2 2 2 2 1 2 3 3 1 2 2 2 3 1 2 2 3 2 2 3 2 2 2 2 2 2 3 2 2 2 1 0 3 2 2 1 1 2 3 2 2 3 1 2 3 2 2 2 2 3 2 2 2 2 2 3 2 2 2 0 1 2 2 2 2 1 0 1 1
split_gain=343.619 63.3331 19.7214 9.4349 7.69612 10.0979 12.9782 6.75974 6.37485 5.8172 6.32743 4.7732 4.26954 6.08464 14.4403 5.8828 2.91557 6.65344 2.64577 3.37313 2.63665 2.35724 3.5548 3.02814 3.97515 10.2024 2.20642 2.34887 3.10951 4.68522 1.65565 1.20646 1.07357 2.00476 1.05896 5.51719 1.05223 5.51496 1.56739 1.01824 1.60833 2.12189 1.54945 2.62854 0.896751 0.956616 0.838569 0.547699 2.85457 0.469151 0.447368 0.337682 0.315933 0.277151 0.275415 0.244141 0.212665 0.194355 0.14845 0.156553 0.138391 0.117951 0.106638 0.104914 0.101483 0.0960876 0.0949529 0.0949013 0.0914129 0.0874244 0.0716442 0.0498796 0.0468845 0.0324165 0.0309508 0.0286433 0.022937 0.0222499 0.0211124 0.0197598 0.0149006 0.0146839 0.0143083 0.0134023 0.0130772 0.0129078 0.00986486 0.00891149 0.00738088 0.00716502 0.00520805 0.00509178 0.00432661 0.00276273 0.00249348 0.00213779 0.00210945 0.00146223 0.00110441 0.000850059 0.000612445 0.00104565 0.000520523 0.000317519 0.000306829 0.000139123 5.56705e-05 5.28757e-07 7.26938e-07 2.85784e-07
threshold=13.500000000000002 119.50000000000001 1.0000000180025095e-35 28.500000000000004 66.500000000000014 17.500000000000004 23.500000000000004 0 334.50000000000006 123.50000000000001 1 1.0000000180025095e-35 2 23.500000000000004 21.500000000000004 16.500000000000004 46.500000000000007 48.500000000000007 204.50000000000003 208.50000000000003 3 67.500000000000014 4 2.5000000000000004 93.500000000000014 84.500000000000014 3.5000000000000004 8.5000000000000018 1.5000000000000002 6.5000000000000009 26.500000000000004 4.5000000000000009 469.50000000000006 479.50000000000006 150.50000000000003 157.50000000000003 81.500000000000014 79.500000000000014 1.0000000180025095e-35 5 6 1.5000000000000002 4.5000000000000009 5.5000000000000009 628.50000000000011 7 35.500000000000007 1.5000000000000002 2.5000000000000004 8 82.500000000000014 100.50000000000001 22.500000000000004 12.500000000000002 9 157.50000000000003 6.5000000000000009 1.0000000180025095e-35 372.00000000000006 424.50000000000006 2.5000000000000004 45.500000000000007 95.500000000000014 111.50000000000001 4.5000000000000009 23.500000000000004 113.50000000000001 39.500000000000007 4.5000000000000009 548.00000000000011 399.50000000000006 10 11 11.500000000000002 922.50000000000011 72.500000000000014 12 13 2.5000000000000004 1.5000000000000002 16.500000000000004 11.500000000000002 15.500000000000002 14 9.5000000000000018 3.5000000000000004 4.5000000000000009 10.500000000000002 1.5000000000000002 2.5000000000000004 1.5000000000000002 10.500000000000002 9.5000000000000018 2.5000000000000004 6.5000000000000009 5.5000000000000009 1.5000000000000002 1.5000000000000002 1.5000000000000002 3.5000000000000004 15 16 3.5000000000000004 7.5000000000000009 5.5000000000000009 10.500000000000002 17 18 19 20
decision_type=2 2 2 2 2 2 2 9 2 2 1 2 9 2 2 2 2 2 2 2 1 2 1 2 2 2 2 2 2 2 2 2 2 2 2 2 2 2 2 9 1 2 2 2 2 1 2 2 2 1 2 2 2 2 1 2 2 2 2 2 2 2 2 2 2 2 2 2 2 2 2 1 9 2 2 2 1 1 2 2 2 2 2 1 2 2 2 2 2 2 2 2 2 2 2 2 2 2 2 2 9 1 2 2 2 2 1 9 1 1
left_child=2 4 11 7 5 12 -7 26 9 10 -3 100 46 14 15 -14 30 -18 20 -20 53 -6 36 50 25 -25 27 28 31 -30 -15 -4 54 -34 79 -36 37 38 -23 40 41 -13 93 -44 57 74 65 49 -49 -21 75 72 -16 55 60 -11 78 -35 -56 -60 -10 83 -52 -26 85 80 -53 -55 89 -59 82 -63 -38 86 -46 -24 -29 -67 97 -22 -2 92 -62 -48 94 88 -28 90 96 98 -66 -78 -58 -43 104 -80 -9 -42 106 -91 101 -1 -90 -96 -70 -86 -41 109 -109 -102
right_child=1 8 3 -5 21 6 -8 64 32 18 -12 39 13 16 52 -17 17 -19 19 47 34 22 23 24 63 -27 73 76 29 -31 -32 -33 33 44 35 -37 51 -39 -40 68 56 42 43 -45 45 -47 61 48 -50 -51 62 66 -54 67 58 -57 81 69 59 -61 70 71 -64 -65 87 77 -68 -69 84 -71 -72 -73 -74 -75 -76 -77 91 -79 95 -81 -82 -83 -84 -85 105 -87 -88 -89 102 99 -92 -93 -94 -95 103 -97 -98 -99 -100 -101 107 -103 -104 -105 -106 -107 -108 108 -110 -111
leaf_value=-0.024661586535340511 -0.016516199718729651 0.07054231791812289 -0.0011578911166816887 0.035560268095413648 0.036905135370815224 0.080161018270041559 -0.00047788047556536505 -0.024220747933798897 0.023115804089171875 0.010699169114199346 0.015484845395296046 7.3271349088866501e-06 0.015960023996643556 -0.014584358694795725 0.044186672666328648 -0.0056661601685712246 0.030770645304120766 0.00074432830226168816 0.050892688730503149 0.017400069740253123 0.018840537985958267 0.017539684939498826 0.0040054049705481641 0.0057084396239909978 0.011731869959526537 0.07475630157447298 -0.021321583397225174 -0.014860211964328088 0.0036100017237134423 0.041052030194069299 -0.0018916827552318397 -0.021513655537114731 0.053177260133249971 0.025459689890756212 0.061481467528137705 0.022079034828091187 0.0053541924390212532 0.049755464762173102 -0.0012717523180539269 -0.024223578373032417 -0.024057980643725368 -0.023807878458759639 0.014926753957483364 -0.01461692486267956 0.032793948737964547 0.0474329911804399 -0.0043908276556589619 0.045780587458520261 0.02339311415591366 0.026366453108069884 0.018601427378132005 0.0066478633836165174 0.034682037797139534 0.016410611958362353 0.035007527878723091 0.015315368713269162 -0.018386893806790809 0.033260790027996714 0.02561588071793407 0.033054665010571978 0.02520266825823644 -0.0024350690918679449 0.013452944477388885 0.01919614589805262 -0.020440845687798356 -0.011266694015484245 0.011172430693464819 0.021712815223763504 -0.021572881850294962 0.028745457747671149 0.031124536254550285 0.0023256814949573238 0.0018771823897397724 -0.014811829736367743 0.035297981430331207 0.0080037257450121507 -0.019953324949003412 -0.0074622810861245245 -0.021957686229048062 0.016356142824952208 -0.014007203538264871 -0.014991017753767292 0.027719133535806031 -0.0076546965206593116 -0.018763883002933995 -0.020920671891954151 -0.018552249823523017 -0.016889526212977859 -0.02261711234189058 -0.023021011806173962 -0.01849729802627002 -0.017645625004437365 -0.016875670786095573 -0.02294830902949346 -0.020482645438635351 -0.020868016664048847 -0.023370679678837474 -0.023290331570346129 -0.023535678803292326 -0.022324456222663908 -0.024827750625126682 -0.024809494019121459 -0.021822024117045716 -0.019949856025597307 -0.020988976819701115 -0.018396687123025814 -0.024006168768582595 -0.024812057906990967 -0.024829264061375103 -0.024823325884385995
leaf_weight=266.9716981947422 8.9607326984405535 12.89362895488739 46.540776491165161 13.024814665317534 10.126789957284926 9.5898467898368853 10.401465326547621 18.544112727046016 19.705419152975082 54.929573893547058 8.766314834356308 29.016614675521851 56.456176310777664 30.18074494600296 19.800453931093216 70.983646646142006 22.139732390642166 110.68521663546562 12.720610827207564 41.730142891407013 14.518502175807951 19.027818858623505 6.2015883922576931 9.4555512070655841 13.827632755041124 12.320971906185148 5.8090649694204348 6.381424143910408 31.183788657188416 11.412978172302244 172.75560790300369 8.6286213099956495 14.451327264308928 21.350162506103516 10.629439562559126 54.104372769594193 12.149950087070465 8.837316542863844 26.487723708152771 14.712718248367308 14.216742441058159 16.786377876996994 8.7312624454498273 54.668155670166016 25.678145051002502 18.098440647125244 4.6284520328044891 16.2583067715168 114.62571156024933 22.430359363555908 17.79669114947319 39.395953059196472 15.656205952167509 33.847450733184814 19.521206796169281 59.851796448230743 12.646925806999212 24.477948307991028 14.130603373050691 14.160956323146818 10.323407024145128 17.811872944235802 23.128214478492737 7.137580305337905 6.6151788383722323 13.665484413504601 16.432196021080017 11.242166012525557 5.1026075929403358 19.072763025760651 13.993187189102171 7.9609335362911251 47.987609505653381 4.3712148070335379 23.758366525173187 16.128748804330826 4.5019854605197889 5.3469383418560037 23.986452490091327 17.83566877245903 17.424746856093407 5.9277544170618048 12.474162280559538 9.8149320781230909 4.314981669187544 5.4074351191520682 7.2032657563686371 4.6110267639160147 3.9341809749603254 8.5711501091718674 7.1967793405056 5.0959301590919495 7.5718039274215689 21.095696866512299 5.316564738750456 5.540783464908599 12.033829867839811 11.005698904395103 10.413842439651491 8.9575111865997314 164.47651931643486 216.31271839141846 4.3175966292619705 5.8993007838726044 4.0241764038801193 6.4137339293956757 3.6811983436346081 14.938780933618546 10.420631468296051 46.897480487823486
leaf_count=1534 44 26 199 38 22 23 30 106 34 174 25 116 196 98 56 265 67 403 24 94 40 60 21 31 41 23 28 33 122 21 670 39 16 27 23 123 43 28 90 84 81 95 38 273 34 19 20 33 238 44 54 130 45 94 29 166 65 38 21 20 20 72 69 20 36 65 54 28 28 27 24 30 164 19 26 53 24 24 122 46 85 31 23 44 23 29 32 24 22 48 38 27 40 119 29 27 68 57 59 50 947 1245 24 32 22 34 21 86 60 270
internal_value=0 0.0154351 -0.0196984 -0.00563315 0.00646167 0.00326171 0.0382047 -0.00840181 0.0262714 0.0229309 0.0482592 -0.0225824 0.00206611 0.00383713 0.0117666 0.0039143 -9.90472e-06 0.00574922 0.0217504 0.025946 0.018358 0.0132121 0.0123438 0.0195326 0.0298136 0.0447751 -0.00194651 0.000589011 0.00349382 0.0136419 -0.00377934 -0.00434158 0.0327396 0.0354942 0.0248573 0.028549 0.00786985 0.0136103 0.00659239 -0.0171495 -0.0153515 -0.0119134 -0.0153287 -0.0105482 0.0335646 0.0375979 -0.00824918 0.024319 0.0261741 0.0205347 0.0125858 0.0051793 0.0399898 0.0144111 0.0288607 0.0131062 -0.0208891 0.0293676 0.0316535 0.0293393 0.0264972 -0.00299162 0.0156918 0.0142731 -0.0219108 -0.0129066 0.0079796 0.0177326 -0.0220551 0.0312833 0.0283082 -0.000964526 0.00257966 -0.0185371 0.0339973 0.00689331 -0.0171834 -0.0101968 -0.0226607 0.017471 -0.0148593 -0.0171794 0.0265796 -0.00660877 -0.0199568 -0.0232094 -0.0197886 -0.0187928 -0.0235281 -0.0234621 -0.0194282 -0.0187281 -0.0178209 -0.0233292 -0.0207018 -0.0217532 -0.0238862 -0.023723 -0.0239471 -0.0226651 -0.0247601 -0.0247278 -0.0222011 -0.0202024 -0.0213154 -0.0185444 -0.0241801 -0.024826 -0.0248191 -0.0248268
internal_weight=0 1628.29 1215.43 206.814 890.706 604.263 19.9913 193.789 737.58 486.384 21.6599 1008.62 584.272 498.658 162.896 127.44 335.761 132.825 464.724 207.765 256.959 286.442 276.316 105.997 42.7417 21.7765 131.129 113.746 97.7662 42.5968 202.936 55.1694 251.196 146.887 97.088 64.7338 170.319 54.3529 45.5155 288.602 211.194 130.298 101.281 63.3994 132.436 67.535 85.6141 195.045 130.884 64.1605 63.2552 115.966 35.4567 159.871 104.309 114.781 80.8962 64.9009 47.8128 28.2916 56.4962 40.2162 40.9249 20.9652 62.6601 45.3979 55.8281 45.0896 77.4078 43.5507 36.7908 25.7728 60.1376 17.3835 49.4365 22.3303 15.9793 19.0124 54.7497 32.3542 26.3855 26.1465 22.7976 14.4434 31.0714 44.2372 13.0123 18.423 38.8297 46.3364 13.812 9.59792 20.2187 37.8821 20.3426 29.5272 30.5779 25.2224 28.8078 17.5287 720.018 483.284 8.25178 11.2159 9.12678 10.7287 18.3939 236.733 25.3594 211.374
internal_count=11241 4676 6565 929 3140 2237 53 891 1536 1178 51 5636 2184 1800 562 461 1238 470 1127 433 694 903 881 312 115 54 544 465 381 143 768 238 358 187 232 146 569 178 150 1494 1064 641 525 311 171 79 384 409 271 138 197 391 101 462 171 340 423 92 70 41 101 166 123 61 347 218 184 122 430 65 67 102 207 79 60 74 84 89 287 86 129 136 43 64 168 249 60 98 220 262 74 51 105 214 111 149 174 138 164 98 4142 2779 46 61 50 57 105 1363 146 1217
cat_boundaries=0 1 2 3 4 5 6 7 8 9 10 11 12 13 14 15 16 17 18 19 20 21
cat_threshold=2 1 1 1 1 2 1 1 1 1 1 1 2 1 2 2 1 1 1 1 1
is_linear=0
shrinkage=0.05


Tree=16
num_leaves=110
num_cat=24
split_feature=2 2 3 0 2 3 2 3 2 2 1 2 0 2 2 2 1 2 2 2 1 2 3 2 3 2 2 1 3 3 2 2 0 1 2 2 2 2 2 3 2 2 2 2 2 2 1 2 2 2 1 3 1 1 2 2 2 3 2 2 3 2 3 2 2 2 2 3 2 0 3 1 3 3 3 2 1 1 2 2 2 2 1 2 2 2 2 2 3 2 2 2 2 2 3 2 2 2 0 1 2 2 2 2 1 1 0 1 1
split_gain=328.03 57.3458 19.6807 9.13284 7.14812 9.16499 15.2399 6.08364 5.57576 5.01837 5.24124 4.84424 4.06866 5.69087 12.9713 5.51412 2.80924 4.89335 2.35136 2.8899 2.36185 2.20598 2.14065 2.26331 2.91748 4.19703 2.10315 3.24214 2.69593 3.79666 6.93488 1.17932 1.02308 1.60558 2.07446 1.54854 2.60231 1.01092 5.33529 1.52131 0.994964 7.78312 0.923452 1.68031 0.817212 0.768818 0.80453 0.527799 1.4293 0.410432 0.270231 0.251638 0.239494 0.228836 0.223074 0.215893 0.215028 0.169175 0.127914 0.136004 0.121487 0.113377 0.108631 0.0965753 0.0949556 0.0928693 0.090091 0.0853167 0.0755346 0.0629548 0.0547921 0.0474846 0.0454173 0.0325279 0.0288445 0.0267194 0.0229612 0.0217881 0.0215061 0.0148357 0.0146878 0.0132023 0.0129885 0.0106971 0.00996382 0.00895983 0.00752964 0.00731278 0.00525345 0.00512566 0.00434122 0.00281975 0.00252496 0.00216989 0.00215599 0.00149388 0.00112899 0.000865798 0.000627744 0.00107162 0.000529434 0.000321017 0.00031122 0.000139961 0.000105301 5.69518e-05 5.4214e-07 7.4519e-07 2.92626e-07
threshold=13.500000000000002 119.50000000000001 1.0000000180025095e-35 0 66.500000000000014 17.500000000000004 37.500000000000007 28.500000000000004 334.50000000000006 123.50000000000001 1 1.0000000180025095e-35 2 23.500000000000004 21.500000000000004 16.500000000000004 3 31.500000000000004 204.50000000000003 208.50000000000003 4 27.500000000000004 3.5000000000000004 8.5000000000000018 1.5000000000000002 6.5000000000000009 67.500000000000014 5 2.5000000000000004 9.5000000000000018 94.500000000000014 4.5000000000000009 6 7 1.5000000000000002 4.5000000000000009 7.5000000000000009 72.500000000000014 74.500000000000014 7.5000000000000009 151.50000000000003 145.50000000000003 469.50000000000006 479.50000000000006 35.500000000000007 628.50000000000011 8 242.50000000000003 246.50000000000003 82.500000000000014 9 12.500000000000002 10 11 157.50000000000003 168.50000000000003 6.5000000000000009 1.0000000180025095e-35 372.00000000000006 424.50000000000006 2.5000000000000004 45.500000000000007 2.5000000000000004 95.500000000000014 23.500000000000004 4.5000000000000009 4.5000000000000009 38.500000000000007 548.00000000000011 12 23.500000000000004 13 3.5000000000000004 11.500000000000002 36.500000000000007 72.500000000000014 14 15 2.5000000000000004 16.500000000000004 11.500000000000002 9.5000000000000018 16 69.500000000000014 4.5000000000000009 10.500000000000002 1.5000000000000002 2.5000000000000004 1.5000000000000002 10.500000000000002 9.5000000000000018 2.5000000000000004 6.5000000000000009 5.5000000000000009 1.5000000000000002 1.5000000000000002 1.5000000000000002 3.5000000000000004 17 18 3.5000000000000004 7.5000000000000009 5.5000000000000009 10.500000000000002 19 20 21 22 23
decision_type=2 2 2 9 2 2 2 2 2 2 1 2 9 2 2 2 1 2 2 2 1 2 2 2 2 2 2 1 2 2 2 2 9 1 2 2 2 2 2 2 2 2 2 2 2 2 1 2 2 2 1 2 1 1 2 2 2 2 2 2 2 2 2 2 2 2 2 2 2 9 2 1 2 2 2 2 1 1 2 2 2 2 1 2 2 2 2 2 2 2 2 2 2 2 2 2 2 2 9 1 2 2 2 2 1 1 9 1 1
left_child=2 4 11 7 5 12 -7 22 9 10 -3 98 44 14 15 -14 21 -18 20 -20 51 -15 23 24 31 -26 -6 37 49 30 -30 -4 33 34 -13 91 -37 62 -39 -40 41 -22 52 -44 64 57 74 53 -49 75 -16 54 60 -21 -11 -42 78 -45 -54 -60 -10 82 83 -51 79 87 72 -53 -59 70 -62 -63 86 84 -47 -29 89 -66 95 -2 90 92 -46 -28 -24 88 94 96 -68 -25 -58 -36 102 -80 104 -35 105 -89 99 -1 -88 -94 -67 -83 -5 -34 108 -108 -100
right_child=1 8 3 66 26 6 -8 -9 42 18 -12 32 13 16 50 -17 17 -19 19 47 40 -23 73 76 25 -27 27 28 29 -31 -32 -33 65 56 35 36 -38 38 39 -41 55 -43 43 45 61 46 -48 48 -50 63 -52 67 58 -55 -56 -57 80 68 59 -61 69 71 -64 -65 77 81 85 -69 -70 -71 -72 -73 -74 -75 -76 -77 -78 -79 93 -81 -82 103 -84 -85 -86 -87 100 97 -90 -91 -92 -93 101 -95 -96 -97 -98 -99 106 -101 -102 -103 -104 -105 -106 -107 107 -109 -110
leaf_value=-0.024657399848229847 -0.01637775910694704 0.064046395896686592 -0.0011304665557239431 -0.023994432408790595 0.034668346932416785 0.088166326732513636 0.00079621820861231884 0.033692341683377057 0.022020226621493964 0.010321070814349917 0.014865396159999954 7.1449820781352023e-06 0.015314193552029981 0.0087225861181069644 0.034086953047244323 -0.0055572709128799917 -0.010858395576376783 0.011534775707723228 0.04713541365961417 0.017409669693476761 0.017130270465733941 -0.0057598402726479377 -0.021245991615701995 -0.019855056951521694 0.0035075207743739678 0.038402235269969887 -0.0064797444758829155 0.0038901414089751148 0.061340444176796377 0.0081001493549939987 0.011994495587937845 -0.021441551685649901 -0.024208726979258095 -0.024039200751801666 -0.023783269917560093 0.00087756541998857448 -0.019594647466201702 0.048563087876825818 0.0038065039140248815 0.01572054410552897 0.016281505264175305 0.072231714051682092 0.049137452846553992 0.02419551048647442 -0.0043008886584615319 0.031190818644903823 0.04408539699958211 0.040454097121249685 0.023226106816619192 0.017801022053724382 0.042894572005105769 0.015654479071185261 0.03294903115638164 0.023557739940632431 0.014705222883555342 0.022230484076657439 -0.018267342593739088 0.031360447195995372 0.024340094087230289 0.031172607922098874 0.022750558427016107 -0.0023804712253080139 0.0022425508789284954 0.012941384814401411 -0.011113024504856794 -0.021501869499189648 -0.020350219705932149 0.020478748880416144 0.027227351420183701 0.029741918534515795 0.027433547591505115 0.0022626011618953907 -0.018664866481147954 -0.01466234879777405 0.03370912899967677 0.0077419885403552276 -0.01471096293537391 -0.0073321994908634187 -0.021893934871365442 -0.013854549702487996 -0.014842421306720878 -0.018648999554844597 -0.0075227261690572651 -0.0037091973522964147 -0.018434709885297492 -0.016754289463355384 -0.0225665095680572 -0.022978901243580527 -0.018379083331410983 -0.017517739816031535 -0.016740310607832213 -0.022904643829453911 -0.020392697664669737 -0.020784484502044499 -0.023336188647575699 -0.023254068018925739 -0.023504871066415481 -0.02226790949795444 -0.024827712616926428 -0.024808996785368662 -0.021755678630450609 -0.019851535778199075 -0.02090752016999467 -0.018277254380942871 -0.024274629021278207 -0.023986169553867738 -0.024811625567607611 -0.024829263948563912 -0.024823179297404019
leaf_weight=260.46828299760818 8.8139510601758975 13.836024224758148 46.486917763948441 4.4443808495998383 10.507502287626265 8.3261991739273089 12.460526347160338 13.214184314012526 20.166231453418732 55.520429641008377 8.9031161963939667 29.016825556755066 57.364447027444839 30.891203507781029 22.820318669080734 70.582578614354134 32.776271358132362 95.413046002388 13.384753763675688 44.036979585886002 26.574284613132477 176.69157250225544 5.6865175068378466 4.4130460917949659 31.296566247940063 11.891253054141997 6.9566981494426745 6.2264780700206783 15.665522038936617 15.336169362068174 13.052064746618269 8.4449707269668561 14.36060571670532 13.878797382116318 16.391449496150017 28.184711962938309 34.552743509411812 8.0926060378551465 105.85705903172493 35.874451726675034 24.728318721055984 8.4453586339950544 15.240609169006346 21.90070915222168 4.6081737577915192 34.082988262176514 18.97758936882019 13.389563143253325 119.36332565546036 18.130833059549332 14.083389490842817 33.243864297866821 20.216698586940765 23.061064839363098 60.775504738092422 39.79215070605278 12.416513085365301 25.305795729160309 14.497246861457826 14.63686418533325 11.04306221008301 17.768552303314209 7.9150849878787986 23.441459089517593 13.512383639812469 4.9937084764242226 6.4813316017389315 12.652560621500013 19.628974497318268 12.42482805252075 14.379339873790739 7.9794694483280209 5.5776127427816382 4.3069462478160849 17.063169300556183 16.258356720209122 6.2872961163520804 5.307186335325242 23.465506747365001 17.182376548647881 5.8395542055368415 4.2347705513238889 9.7400886565446836 6.9792989194393158 7.0708610713481903 4.5338025689125052 3.8461998552083951 8.3760875016450882 7.0648821145296097 5.0067979842424393 7.4450963735580435 20.61709988117218 5.2087749391794187 5.4263564050197592 11.755852729082106 10.752334669232368 10.171607777476313 8.7597550451755524 160.44321317970753 211.01213067770004 4.2243985533714294 5.7827766239643097 3.9405935406684875 6.2968209981918335 13.655975386500364 3.5938792973756817 14.572679489850998 10.165080428123474 45.747657716274261
leaf_count=1534 44 26 199 26 22 16 37 37 34 174 25 116 196 87 64 265 115 321 24 109 71 715 28 24 122 21 24 21 40 38 37 39 84 81 95 126 185 20 369 104 56 19 16 27 20 40 19 17 237 54 37 91 29 46 166 86 65 38 21 20 20 72 28 69 65 28 36 31 27 22 25 30 30 19 20 53 33 24 122 85 31 23 44 24 32 24 22 48 38 27 40 119 29 27 68 57 59 50 947 1245 24 32 22 34 80 21 86 60 270
internal_value=0 0.0148118 -0.0195967 -0.00552823 0.00625542 0.00316634 0.0357926 0.00135928 0.0249427 0.0218443 0.0447904 -0.0225311 0.00200809 0.00372461 0.0113328 0.00380035 -1.07028e-05 0.00580915 0.0207458 0.0246433 0.0175704 -0.00360465 -0.00190492 0.000570846 0.00339176 0.0131154 0.0127074 0.0118827 0.0186652 0.0281862 0.0389128 -0.004253 -0.017017 -0.0152053 -0.0117594 -0.0151824 -0.0103975 0.00761145 0.00907673 0.00682213 0.0236333 0.0304186 0.0308837 0.0333885 -0.00811212 0.031636 0.0352933 0.023137 0.0249637 0.0121174 0.0374482 0.0138494 0.0273328 0.0195227 0.0126122 0.0199505 -0.0208059 0.0277988 0.0298932 0.0277727 0.0251548 -0.00292632 -0.00243536 0.0150608 -0.0127518 -0.0219933 -0.0216447 0.0169844 0.029555 0.026825 0.0253993 -0.000941555 -0.0228776 -0.0184194 0.032031 0.00667534 -0.0170509 -0.0100468 -0.022611 -0.01471 -0.0170468 -0.0198586 -0.00648798 -0.00509222 -0.0196878 -0.0186783 -0.0234971 -0.0234297 -0.0193222 -0.0186127 -0.0176949 -0.0232938 -0.0206154 -0.0216856 -0.0238634 -0.0236965 -0.0239257 -0.0226154 -0.0247583 -0.0247252 -0.0221421 -0.020108 -0.0212397 -0.0184267 -0.0242058 -0.0241642 -0.0248259 -0.0248189 -0.0248267
internal_weight=0 1653.89 1191.81 205.69 896.615 606.322 20.7867 144.105 757.271 497.707 22.7391 986.115 585.535 500.623 164.851 127.947 335.772 128.189 474.968 213.236 261.732 207.583 130.891 113.827 98.1197 43.1878 290.294 279.786 108.111 44.0538 28.7176 54.9319 283.706 207.987 128.763 99.746 62.7375 171.675 149.824 141.732 99.5401 35.0196 259.564 152.2 84.9122 136.959 70.1237 199.851 132.753 64.0571 36.9037 162.192 107.364 67.098 116.296 64.5205 79.2242 66.8355 49.3508 29.1341 58.0135 40.0963 21.8511 41.5723 44.8159 75.7194 61.5844 45.8964 44.9348 37.8472 25.4224 25.748 43.5044 17.0643 51.1462 22.4848 15.7071 18.8196 53.523 25.9963 25.7012 30.4574 14.3483 13.936 12.7574 18.08 37.9268 45.2619 13.5462 9.41984 19.8616 37.0085 19.9259 28.8919 29.8562 24.6311 28.1261 17.1358 702.409 471.48 8.0706 10.9916 8.9343 10.5316 18.1004 17.9545 230.929 24.7378 206.191
internal_count=11241 4676 6565 929 3140 2237 53 581 1536 1178 51 5636 2184 1800 562 461 1238 436 1127 433 694 802 544 465 381 143 903 881 312 115 77 238 1494 1064 641 525 311 569 493 473 232 90 358 187 384 171 79 409 254 197 101 462 171 155 340 142 423 92 70 41 101 166 76 123 218 430 348 122 65 67 45 102 250 79 60 74 84 89 287 129 136 168 64 48 60 98 220 262 74 51 105 214 111 149 174 138 164 98 4142 2779 46 61 50 57 106 105 1363 146 1217
cat_boundaries=0 1 2 3 4 5 6 7 8 9 10 11 12 13 14 15 16 17 18 19 20 21 22 23 24
cat_threshold=2 1 1 1 1 1 2 1 1 1 1 1 2 1 1 1 2 2 1 2 1 1 1 1
is_linear=0
shrinkage=0.05


Tree=17
num_leaves=103
num_cat=19
split_feature=2 2 3 0 2 3 2 3 2 2 2 0 2 2 2 2 2 2 2 2 2 3 2 3 2 2 1 2 2 3 2 2 0 1 2 2 2 2 2 3 2 3 3 2 2 3 2 1 3 2 2 1 3 1 2 2 3 2 2 2 2 3 2 3 2 3 1 3 1 1 2 2 2 1 2 2 2 2 2 2 2 3 2 2 2 2 3 2 2 2 2 0 1 2 2 2 2 1 1 0 1 1
split_gain=313.329 52.0401 19.6353 8.91352 6.6456 8.33701 12.7502 5.59317 4.91543 4.911 4.276 3.87751 5.32584 11.6889 5.17196 2.74999 6.11529 2.3295 11.1756 2.11674 2.44164 2.07658 2.18089 2.73895 3.77244 1.88259 2.96272 2.51883 4.80187 6.63417 1.61143 1.15257 1.02759 1.60221 2.02748 1.54711 2.54891 0.947298 4.74833 1.40827 0.796112 0.689198 0.637927 2.03204 0.911528 0.628733 0.435829 0.358334 0.264606 0.25744 0.217359 0.173109 0.215414 0.154074 0.108958 0.105549 0.10386 0.102171 0.0943306 0.0938834 0.0913181 0.0722276 0.0590538 0.0578606 0.054604 0.0461208 0.045204 0.0326275 0.0236997 0.0229762 0.0219039 0.0146857 0.0133245 0.0125831 0.0103316 0.0103071 0.0100608 0.00900522 0.00768052 0.00746282 0.00666189 0.00529757 0.005158 0.00435423 0.00287763 0.00255618 0.00220339 0.00220201 0.00152608 0.00115403 0.0008817 0.000643408 0.00109823 0.000538403 0.000324461 0.0003156 0.000140755 0.000107732 5.8258e-05 5.55664e-07 7.63911e-07 3.00503e-07
threshold=13.500000000000002 119.50000000000001 1.0000000180025095e-35 0 66.500000000000014 17.500000000000004 37.500000000000007 28.500000000000004 1.0000000180025095e-35 353.50000000000006 123.50000000000001 1 23.500000000000004 21.500000000000004 16.500000000000004 46.500000000000007 48.500000000000007 150.50000000000003 152.50000000000003 204.50000000000003 208.50000000000003 3.5000000000000004 8.5000000000000018 1.5000000000000002 6.5000000000000009 67.500000000000014 2 84.500000000000014 93.500000000000014 2.5000000000000004 26.500000000000004 4.5000000000000009 3 4 1.5000000000000002 4.5000000000000009 7.5000000000000009 72.500000000000014 74.500000000000014 7.5000000000000009 35.500000000000007 165.50000000000003 1.0000000180025095e-35 471.50000000000006 609.50000000000011 4.5000000000000009 827.00000000000011 5 30.500000000000004 22.500000000000004 6.5000000000000009 6 23.500000000000004 7 45.500000000000007 500.00000000000006 2.5000000000000004 109.50000000000001 4.5000000000000009 20.500000000000004 4.5000000000000009 12.500000000000002 142.50000000000003 1.5000000000000002 77.500000000000014 3.5000000000000004 8 11.500000000000002 9 10 2.5000000000000004 11.500000000000002 9.5000000000000018 11 69.500000000000014 77.500000000000014 4.5000000000000009 10.500000000000002 1.5000000000000002 2.5000000000000004 16.500000000000004 1.5000000000000002 10.500000000000002 9.5000000000000018 2.5000000000000004 6.5000000000000009 1.5000000000000002 5.5000000000000009 1.5000000000000002 1.5000000000000002 3.5000000000000004 12 13 3.5000000000000004 7.5000000000000009 5.5000000000000009 10.500000000000002 14 15 16 17 18
decision_type=2 2 2 9 2 2 2 2 2 2 2 9 2 2 2 2 2 2 2 2 2 2 2 2 2 2 1 2 2 2 2 2 9 1 2 2 2 2 2 2 2 2 2 2 2 2 2 1 2 2 2 1 2 1 2 2 2 2 2 2 2 2 2 2 2 2 1 2 1 1 2 2 2 1 2 2 2 2 2 2 2 2 2 2 2 2 2 2 2 2 2 9 1 2 2 2 2 1 1 9 1 1
left_child=2 4 8 7 5 11 -7 21 91 10 45 40 13 14 -13 30 -17 48 -19 47 -21 22 23 31 -25 -6 37 63 29 -29 -14 -4 33 34 -10 84 -37 56 -39 -40 59 42 43 -11 -45 -3 51 -20 53 -15 70 55 -53 61 73 -44 74 -30 79 80 65 -12 -55 64 -28 78 -56 76 -61 -24 88 83 85 -42 -27 -65 -23 81 86 89 -2 -62 -71 -52 -36 95 97 -72 -35 98 -81 92 -1 -80 -87 -60 -74 -5 -34 101 -101 -93
right_child=1 9 3 60 25 6 -8 -9 32 41 17 12 15 49 -16 16 -18 18 19 20 -22 67 69 24 -26 26 27 28 57 -31 -32 -33 58 50 35 36 -38 38 39 -41 54 -43 46 44 -46 -47 -48 -49 -50 -51 71 52 -54 62 66 -57 -58 -59 72 68 77 -63 -64 75 -66 -67 -68 -69 -70 82 87 -73 96 -75 -76 -77 -78 -79 93 90 -82 -83 -84 -85 -86 94 -88 -89 -90 -91 -92 99 -94 -95 -96 -97 -98 -99 -100 100 -102 -103
leaf_value=-0.024653110802829448 -0.016238202727973793 0.035122165811095972 -0.0011036600171816422 -0.024261001352728837 0.032641009813883647 0.078630464631015667 0.00077582277517156649 0.031753457702977897 6.9671463893300635e-06 0.044425371991113127 0.0096843124316568253 0.014704112406192286 -0.014437110249257774 0.038786542402884039 -0.0054498728928701855 0.029126493305606523 0.00070109440883610232 0.085127620306263821 0.014346310726355414 0.043822032378568146 0.022326587483280053 -0.02116904633048752 -0.014561013070336937 0.0034083046252270884 0.036020034036834701 -0.0063604579329720303 0.0062318136836353238 0.014518740061781952 0.011633157759964907 0.06410939020350552 -0.0018364691521746746 -0.02136813009003254 -0.023965704055911807 -0.024019977394021817 -0.023758094395486477 0.0008550158447817118 -0.019491064976389541 0.04508408767255264 0.0036977089111616479 0.015088064660474907 -0.0042124082630870269 0.039537616463702532 0.023156912932736973 0.019431436871512529 0.034049549187440999 0.051734123976313898 0.032975573033322721 0.019109498194354511 0.021447050450477935 0.030528209922497419 -0.018146372803423488 0.025005805056678338 0.031582808630296555 0.016315030313366598 -0.002326968865454269 0.026703211610676809 0.0021819090837138164 0.016263495410668172 -0.021429549127209499 -0.011569549740765813 -0.020258136202594763 0.014456357457965432 0.011532806531729457 0.0028542683686845036 0.011501880003192392 -0.018548728498806715 0.0022013723713864095 -0.014512179420094296 -0.0081943291992091563 -0.019755306868475129 -0.021828960353712963 -0.014693087495871086 -0.018532662619146916 -0.0073920427481421851 -0.0036307132593804527 0.0056117447218286629 -0.018315734564322974 -0.016617858765739055 -0.022514867016845352 -0.022935889146141267 -0.014372946921060307 -0.018259438743471874 -0.017388530122520767 -0.016603758469736492 -0.022860053960541544 -0.020301294769200395 -0.023300936440802 -0.020699536033331675 -0.023217010050231367 -0.023473372299872029 -0.02221023311690699 -0.024827675607318512 -0.024808488978540627 -0.02168807845811193 -0.01975173200570433 -0.020824663618233288 -0.018156400505509509 -0.023974158082863989 -0.024193520190074855 -0.024811184203085267 -0.024829265785622636 -0.024823024304504462
leaf_weight=254.12432786822319 8.6707740128040331 14.33718127012253 46.434397414326668 13.328472375869753 10.878167957067488 9.0936229228973406 12.470451667904852 13.66698634624481 29.017032980918884 24.502300322055817 45.156825482845306 58.249697953462601 29.753108143806458 21.481246680021286 70.191420391201973 22.81437885761261 110.87265485525131 6.8198240101337424 99.892268627882004 14.030754923820494 226.0598104596138 5.5669763237237948 6.1954808831214905 31.406532675027847 12.356785655021666 6.9117665290832537 12.586275845766069 13.194090485572817 28.220396608114243 13.795924663543699 172.34076192975044 8.2658247351646406 3.508701279759407 13.549140751361847 16.006206721067429 28.209457606077194 33.88228565454483 8.4953067898750287 106.26077249646187 36.442873775959015 4.5883971899747849 16.1381955742836 49.886481881141663 22.477699816226959 20.290823221206665 9.4504368305206281 26.86210560798645 65.294294714927673 8.3428758382797223 16.830991268157959 12.191755160689359 24.472062587738037 25.341833412647247 22.152680307626728 17.726305365562439 36.212465703487396 7.9328547418117514 20.617650806903839 4.8874805569648796 17.487916946411133 6.350768133997919 9.6181806921958906 9.1102875471115095 7.5146549046039564 8.0643104612827283 5.4744728803634635 7.9975440502166775 4.2442570924758902 7.4023788422346142 4.3262888789176923 22.957337513566021 5.7535209357738486 4.1565280854701978 9.6670916527509672 6.9534593224525452 6.1724221408367157 6.941706046462059 4.4584748148918143 3.7603764832019797 8.1858088970184326 10.687134832143782 6.9362220168113708 4.9198539704084396 7.3215007781982413 20.150238186120987 5.1036298573017103 11.484692096710203 5.3147364109754553 10.505183547735214 9.9353136569261569 8.5668495297431946 156.50881384313107 205.84153644740582 4.133486345410347 5.6691117584705353 3.8590606451034546 6.1827778220176697 4.3390098214149502 14.017128646373751 14.215556234121323 9.9157959222793579 44.62603434920311
leaf_count=1534 44 32 199 80 22 16 37 37 116 35 141 196 98 56 265 67 403 17 268 24 444 28 33 122 21 24 41 39 82 23 670 39 21 81 95 126 185 20 369 104 20 18 80 26 21 19 28 141 20 45 65 33 31 59 72 51 28 58 28 85 36 27 21 24 26 30 30 19 34 24 122 31 23 44 24 19 32 24 22 48 55 38 27 40 119 29 68 27 57 59 50 947 1245 24 32 22 34 26 84 86 60 270
internal_value=0 0.0142232 -0.0194935 -0.00542457 0.0060573 0.00307411 0.0336073 0.00131941 -0.0224788 0.0237133 0.0210039 0.00195198 0.00361601 0.0109202 0.00369022 -1.13537e-05 0.00555203 0.0200308 0.0216536 0.0205855 0.0235828 -0.00186403 0.000553383 0.00329322 0.0126164 0.0122291 0.0114449 0.017854 0.0229416 0.039867 -0.00369159 -0.00416585 -0.0168832 -0.0150583 -0.0116056 -0.0150353 -0.0102475 0.00736358 0.00876843 0.00660652 -0.00797624 0.0295493 0.0288486 0.0329443 0.0263668 0.0417218 0.027156 0.0162291 0.0129452 0.0351586 -0.0207213 0.0260058 0.0283517 0.0121208 -0.00286225 0.0246485 -0.00238091 0.0135879 -0.0219302 -0.0125969 -0.0215751 0.0105223 0.0149215 0.00661888 0.00828984 -0.0228324 -0.000919108 -0.0183003 -0.0105658 -0.0169172 -0.0225602 -0.016913 -0.0197589 -0.00636862 -0.00499148 0.0040978 -0.0195856 -0.0185623 -0.0234655 -0.0233965 -0.0152084 -0.0192148 -0.0184959 -0.0175676 -0.0232576 -0.0205277 -0.0238401 -0.0216166 -0.0236693 -0.0239039 -0.0225648 -0.0247566 -0.0247226 -0.0220819 -0.0200121 -0.0211627 -0.0183077 -0.0241906 -0.0241479 -0.0248258 -0.0248186 -0.0248266
internal_weight=0 1678.82 1168.75 204.591 902.367 608.326 21.5641 144.325 964.163 776.449 530.265 586.762 502.534 166.753 128.441 335.781 133.687 506.478 412.097 405.277 240.091 130.658 113.905 98.4635 43.7633 294.041 283.163 110.166 75.8281 26.99 202.094 54.7002 278.931 204.858 127.265 98.2482 62.0917 172.997 151.199 142.704 84.2275 246.184 230.046 67.2708 42.7685 23.7876 162.775 165.187 94.3808 38.3122 77.5932 135.913 49.8139 86.038 39.9793 86.0989 21.7981 48.838 74.0724 44.2482 60.266 54.775 31.263 34.3377 20.6506 42.5205 25.7238 16.7529 24.8903 15.4416 52.3264 25.2668 29.8586 14.2555 13.8652 13.6871 12.5087 17.7455 37.046 44.2138 19.3579 13.287 9.24614 19.5133 36.1564 19.5193 29.1522 28.2721 24.0543 27.4611 16.7527 685.232 459.966 7.89386 10.7727 8.74654 10.3393 17.6675 17.5258 225.266 24.1314 201.135
internal_count=11241 4676 6565 929 3140 2237 53 581 5636 1536 1213 2184 1800 562 461 1238 470 1162 894 877 468 544 465 381 143 903 881 312 202 62 768 238 1494 1064 641 525 311 569 493 473 384 323 305 82 47 51 223 409 268 101 423 195 64 248 166 131 76 140 430 218 348 168 80 110 67 250 102 79 119 84 287 136 168 64 48 43 60 98 220 262 99 74 51 105 214 111 174 149 138 164 98 4142 2779 46 61 50 57 106 105 1363 146 1217
cat_boundaries=0 1 2 3 4 5 6 7 8 9 10 11 12 13 14 15 16 17 18 19
cat_threshold=2 1 1 2 1 1 1 1 1 1 2 2 2 1 1 2 1 1 1
is_linear=0
shrinkage=0.05


Tree=18
num_leaves=105
num_cat=21
split_feature=2 2 3 0 2 3 2 3 2 2 0 2 2 2 2 2 1 2 2 2 3 2 3 2 1 2 2 1 2 2 3 2 0 1 2 2 2 2 2 2 2 2 2 2 2 2 1 3 2 2 1 2 3 2 1 3 2 2 2 2 2 2 2 3 3 2 3 3 2 1 3 1 2 2 1 2 2 2 1 2 2 2 2 3 2 2 2 2 3 2 2 2 2 0 1 2 2 2 2 1 1 0 1 1
split_gain=299.446 47.3247 19.5851 8.69847 6.18311 7.60519 10.798 5.15245 4.98672 4.34449 3.69548 4.98727 10.5639 4.85407 3.46685 2.82806 2.68017 4.56125 2.51028 2.183 2.01418 2.10148 2.57279 3.40124 1.99635 1.95888 1.69031 2.71137 2.27976 4.21618 5.58518 1.12622 1.03177 1.59824 1.98097 1.54516 2.49603 0.920562 4.86075 1.60884 0.894822 5.63023 0.775279 0.7672 0.719792 1.62381 0.647091 0.625321 0.311522 0.272057 0.221759 0.219656 0.214289 0.201406 0.20002 0.148338 0.159718 0.104688 0.0957962 0.0932346 0.0931273 0.0925404 0.0847877 0.0761546 0.0712218 0.0545699 0.0609038 0.0468262 0.0455241 0.0430323 0.0327152 0.022982 0.0223058 0.0213375 0.0209485 0.0146775 0.0145884 0.0134437 0.0121862 0.0101557 0.00904757 0.00783354 0.00761514 0.00534035 0.00518875 0.00436558 0.0029364 0.0025871 0.00225166 0.00223412 0.00155886 0.00117954 0.000897757 0.000659476 0.0011255 0.000547426 0.000327848 0.000319968 0.000141503 0.000110213 5.95934e-05 5.69665e-07 7.83101e-07 3.07997e-07
threshold=13.500000000000002 119.50000000000001 1.0000000180025095e-35 0 66.500000000000014 17.500000000000004 37.500000000000007 28.500000000000004 1.0000000180025095e-35 465.00000000000006 1 23.500000000000004 21.500000000000004 16.500000000000004 123.50000000000001 204.50000000000003 2 47.500000000000007 475.50000000000006 27.500000000000004 3.5000000000000004 8.5000000000000018 1.5000000000000002 6.5000000000000009 3 208.50000000000003 67.500000000000014 4 84.500000000000014 93.500000000000014 2.5000000000000004 4.5000000000000009 5 6 1.5000000000000002 4.5000000000000009 7.5000000000000009 81.500000000000014 79.500000000000014 73.500000000000014 150.50000000000003 156.50000000000003 35.500000000000007 628.50000000000011 242.50000000000003 245.50000000000003 7 1.5000000000000002 106.50000000000001 500.00000000000006 8 6.5000000000000009 12.500000000000002 157.50000000000003 9 1.0000000180025095e-35 548.00000000000011 45.500000000000007 4.5000000000000009 23.500000000000004 109.50000000000001 4.5000000000000009 90.500000000000014 8.5000000000000018 39.500000000000007 72.500000000000014 1.5000000000000002 3.5000000000000004 143.50000000000003 10 11.500000000000002 11 2.5000000000000004 922.50000000000011 12 11.500000000000002 16.500000000000004 9.5000000000000018 13 4.5000000000000009 10.500000000000002 1.5000000000000002 2.5000000000000004 1.5000000000000002 10.500000000000002 9.5000000000000018 2.5000000000000004 6.5000000000000009 1.5000000000000002 5.5000000000000009 1.5000000000000002 1.5000000000000002 3.5000000000000004 14 15 3.5000000000000004 7.5000000000000009 5.5000000000000009 10.500000000000002 16 17 18 19 20
decision_type=2 2 2 9 2 2 2 2 2 2 9 2 2 2 2 2 1 2 2 2 2 2 2 2 1 2 2 1 2 2 2 2 9 1 2 2 2 2 2 2 2 2 2 2 2 2 1 2 2 2 1 2 2 2 1 2 2 2 2 2 2 2 2 2 2 2 2 2 2 1 2 1 2 2 1 2 2 2 1 2 2 2 2 2 2 2 2 2 2 2 2 2 2 9 1 2 2 2 2 1 1 9 1 1
left_child=2 4 8 7 5 10 -7 20 93 14 42 12 13 -12 47 24 19 -18 -11 -13 21 22 31 -24 52 -17 -6 37 65 30 -30 -4 33 34 -10 86 -37 38 39 -28 68 -42 59 49 54 -46 73 -3 62 -20 -14 72 53 -16 -27 -51 -57 78 82 76 -31 67 -39 -50 -54 -29 -67 81 -26 -59 79 -23 90 -45 -61 85 -2 87 -44 -22 83 88 91 -63 -73 -53 -36 97 99 -74 -35 100 -84 94 -1 -83 -89 -60 -79 -5 -34 103 -103 -95
right_child=1 9 3 61 26 6 -8 -9 32 18 11 16 50 -15 15 25 17 -19 43 -21 70 71 23 -25 40 44 27 28 29 60 -32 -33 58 51 35 36 -38 48 -40 -41 41 -43 57 46 45 -47 -48 -49 63 55 -52 75 64 -55 -56 56 -58 69 77 74 -62 80 -64 -65 -66 66 -68 -69 -70 -71 -72 84 89 -75 -76 -77 -78 98 -80 -81 -82 95 92 -85 -86 -87 -88 96 -90 -91 -92 -93 -94 101 -96 -97 -98 -99 -100 -101 -102 102 -104 -105
leaf_value=-0.024648712020623062 -0.016097560746304185 0.049003824250562197 -0.0010774607043654578 -0.023953410773932954 0.030795406677188754 0.070806989484298186 0.00075596544746216697 0.029984987088914828 6.7960284293326395e-06 0.048591176639603988 0.014127061491307406 0.0087221679705784348 0.030136945119084203 -0.0053439696787365206 0.0094628295699333946 0.040878558863802907 -0.0014028541157503681 0.018197708924747199 0.017997342991196354 -0.0056885593644695268 -0.021090736949483657 -0.014410403104427422 0.0033122248752877215 0.033867245717156422 0.016021108872653615 0.015764162199953569 0.014083234227278011 0.0030879285487065439 0.013951583711052307 0.011211442379723631 0.058586514730778638 -0.021293375538112173 -0.023944756698074606 -0.024000304633270748 -0.023732342587521861 0.00083306460641029232 -0.019385997698909124 0.00086917843379492052 0.045170597583568006 -0.0045941569180114796 0.060423028746316845 0.01914770079735743 -0.0041253784322945099 0.027531093913341843 0.041156041969812297 0.022524491954820754 0.038900646796064225 0.032699328312182106 0.0096129481671216876 0.02220936609100449 0.037823497425815977 -0.018023995325987061 0.014462457088452136 0.013573208461236408 0.021387701336919918 0.030803572983322109 0.0244276651395752 -0.0022745457549328495 -0.021355908506253934 -0.010798349628037714 0.015600588801363325 -0.020164589301642888 0.0041848825914058627 0.0043165684181169853 0.018923499297747805 0.0095739311587227111 0.0045716169890086472 -0.018431145401758813 0.011817086057188156 0.002141933385290284 -0.014361364564006758 -0.019654072457845121 -0.021762747518804405 0.029510183593827566 -0.0070584106297368306 -0.014543056295971569 -0.013556847885721108 -0.01841488105482561 -0.0072626685818373282 -0.018195335267352702 -0.016480262768329638 -0.022462167410679457 -0.022891960389382779 -0.018138375790609305 -0.017258014713742578 -0.016466043254864407 -0.022814519118821271 -0.020208432065420681 -0.023264906357533727 -0.020613161529197673 -0.023179139591923775 -0.023441168463990449 -0.022151412125984864 -0.024827634715307523 -0.024807965410927627 -0.02161920727821344 -0.019650444771162283 -0.020740394003090315 -0.018034137784293056 -0.024247046280918672 -0.024177951904339981 -0.024810728815923468 -0.024829264726122454 -0.02482286695777659
leaf_weight=247.93596974015236 8.5311130732297915 9.5847095251083392 46.383176580071449 4.2362226247787476 11.23910081386566 9.8375222682952899 12.480130285024641 14.107924073934553 29.017236948013306 16.022052943706512 59.112536787986755 30.891589805483818 24.460242718458176 69.809926062822342 56.909960299730301 14.659282088279722 82.505736216902733 46.359376162290573 14.405483007431028 176.03356504440308 5.4503673464059847 6.1059219837188721 31.513758108019829 12.809990286827086 25.804783433675766 45.822076112031937 25.971095263957977 9.1001576483249647 13.387049525976183 28.550605833530426 14.709338724613188 8.0910734087228757 3.4256126582622528 13.227567359805107 15.63041031360626 28.23358678817749 33.228277117013931 32.074590355157852 9.4161448478698713 20.734921783208847 9.5813892483711225 59.998305559158325 4.5691095590591431 28.259112119674683 12.301407873630522 236.98868852853775 20.521511971950531 15.217185616493223 28.879248976707458 20.58463317155838 15.223290205001829 11.972514301538473 35.5256687104702 62.567023396492004 24.143857717514038 18.655110597610474 20.744654297828674 17.685104608535767 4.7838583290576988 13.209337934851646 20.955707162618637 6.2234077900648135 48.336728930473328 8.8720459938049299 11.958873867988585 15.411118477582933 10.054573088884352 5.3738643527030936 8.5807828009128553 8.0151689946651477 4.1831083744764319 4.2416604459285718 22.461632117629055 26.288915038108826 5.225420594215394 5.6696019470691672 16.728594094514847 4.0802061855792982 9.5958954840898496 6.8157208114862442 4.3849966675043097 3.6766581237316123 8.0001970529556274 6.8107197433710098 4.8350445330142975 7.2009402513504019 19.694828063249588 5.0010641068220121 11.22018179297447 5.2058546841144553 10.264094352722168 9.7048141360282916 8.3786755800247192 152.67090825736523 200.79774476587772 4.0448042452335358 5.5582355260848999 3.7795281112194061 6.071534126996994 13.009001240134245 13.682074248790743 13.86719074845314 9.6726259589195251 43.531918376684189
leaf_count=1534 44 20 199 26 22 16 37 37 116 16 196 87 64 265 174 24 297 139 19 715 28 33 122 21 67 109 85 30 39 82 23 39 21 81 95 126 185 110 28 65 18 128 20 34 14 407 19 31 97 24 37 65 94 166 46 26 27 72 28 65 58 36 160 24 28 49 31 30 19 30 19 24 122 26 24 31 85 23 44 32 24 22 48 38 27 40 119 29 68 27 57 59 50 947 1245 24 32 22 34 80 84 86 60 270
internal_value=0 0.0136665 -0.0193888 -0.00532222 0.00586683 0.00298505 0.0316341 0.00128094 -0.0224254 0.0225731 0.00189758 0.003511 0.0105274 0.00358374 0.0206784 0.0199271 -1.20457e-05 0.00564847 0.0297825 -0.0035372 -0.00182383 0.000536578 0.00319801 0.0121429 0.0161315 0.0230067 0.0117745 0.0110282 0.0170918 0.0218492 0.0373194 -0.00408014 -0.0167483 -0.0149106 -0.0114521 -0.0148875 -0.010098 0.00712572 0.0123985 0.00579149 0.0215705 0.0248315 -0.00784155 0.0277662 0.0221861 0.0234439 0.0313322 0.0390002 0.00462137 0.0241675 0.0330856 -0.0206353 0.0127446 0.0116153 0.0177047 0.0256493 0.0274465 -0.0027994 -0.0218659 -0.0124418 0.0130693 -0.0215041 0.00286231 0.00836823 0.015586 0.00641128 0.00759888 -0.0227863 0.014972 -0.000897174 -0.0181797 -0.0167822 -0.0225085 0.0284849 -0.00973825 -0.016778 -0.0144149 -0.0196578 -0.00625069 -0.0194819 -0.0184449 -0.0234331 -0.0233626 -0.0191058 -0.0183777 -0.0174389 -0.0232206 -0.0204384 -0.0238162 -0.0215464 -0.0236415 -0.0238815 -0.0225131 -0.0247547 -0.02472 -0.0220206 -0.0199147 -0.0210842 -0.0181872 -0.0241749 -0.0241313 -0.0248257 -0.0248183 -0.0248266
internal_weight=0 1703.09 1146.27 203.518 907.966 610.274 22.3177 144.538 942.749 795.125 587.956 504.396 168.606 128.922 629.644 604.842 335.79 128.865 165.481 206.925 130.43 113.981 98.798 44.3237 270.927 333.915 297.692 286.453 112.169 77.6027 28.0964 54.4742 274.272 201.807 125.804 96.7871 61.4619 174.285 56.1222 46.706 103.965 69.5797 83.5597 149.459 319.256 249.29 75.0695 24.8019 118.163 74.3899 39.6835 76.0022 166.962 119.477 69.9659 59.9844 39.3998 39.8653 72.4658 43.6945 49.5063 58.9799 80.4113 37.7513 47.4845 34.5658 25.4657 41.5607 34.3856 25.7003 16.4492 15.1826 51.1591 54.548 18.4348 24.8431 25.2597 29.2744 14.165 12.2661 17.4191 36.1869 43.1914 13.0341 9.0767 19.1735 35.3252 19.1227 28.4654 27.6675 23.4917 26.8125 16.3789 668.476 448.734 7.72146 10.5593 8.56339 10.1517 17.2452 17.1077 219.743 23.5398 196.203
internal_count=11241 4676 6565 929 3140 2237 53 581 5636 1536 2184 1800 562 461 1345 1294 1238 436 191 802 544 465 381 143 694 600 903 881 312 202 62 238 1494 1064 641 525 311 569 178 150 232 146 384 175 576 421 79 51 391 96 101 423 462 340 155 77 53 166 430 218 140 348 270 121 122 110 80 250 86 102 79 84 287 60 89 136 129 168 64 60 98 220 262 74 51 105 214 111 174 149 138 164 98 4142 2779 46 61 50 57 106 105 1363 146 1217
cat_boundaries=0 1 2 3 4 5 6 7 8 9 10 11 12 13 14 15 16 17 18 19 20 21
cat_threshold=2 1 1 1 1 2 1 1 1 1 1 2 1 2 2 1 2 2 1 1 1
is_linear=0
shrinkage=0.05


Tree=19
num_leaves=106
num_cat=19
split_feature=2 2 3 0 2 2 2 3 2 2 2 3 2 3 3 2 3 2 2 1 2 2 2 2 2 2 2 3 2 3 2 2 2 1 3 2 2 2 3 2 2 1 0 1 2 2 2 2 2 3 3 3 2 2 2 3 2 3 3 2 2 1 3 2 2 3 3 0 3 0 1 3 3 0 1 2 2 2 2 2 2 2 3 2 2 2 2 3 2 2 2 3 2 0 1 2 3 2 2 2 1 1 0 1 1
split_gain=286.322 43.4085 19.5302 8.48763 7.55405 6.58338 5.46319 34.6942 9.73514 5.05808 5.00615 4.75506 4.05411 6.61576 11.9421 3.9497 9.04771 3.69677 4.38584 3.58812 4.55844 3.77536 6.55384 3.45028 2.46935 15.5139 2.37229 1.9534 2.02494 2.418 3.07518 1.70882 5.06368 1.90276 2.72386 1.6171 1.60257 7.48791 2.35322 1.23084 1.10026 1.08318 1.03561 1.59365 1.93494 1.5427 2.44367 0.841188 1.40771 0.652146 0.606237 0.537101 0.384023 0.24157 0.221917 0.221892 0.207605 9.46218 6.81419 0.200924 0.157293 0.145889 0.104925 0.0972651 0.0937571 0.0937493 0.0694915 0.0545936 0.047533 0.0462783 0.0460935 0.0435637 0.0327908 0.0297472 0.0229784 0.0227117 0.0146632 0.0135598 0.0102484 0.0090868 0.00798865 0.00776973 0.00538173 0.00521784 0.00437525 0.00299604 0.00261771 0.00230081 0.00226618 0.0015922 0.00120553 0.0009556 0.000913967 0.000675921 0.00115345 0.000556498 0.000488538 0.000331173 0.000324321 0.000142202 0.000112743 6.09549e-05 5.84095e-07 8.02777e-07 3.15376e-07
threshold=13.500000000000002 80.500000000000014 1.0000000180025095e-35 0 204.50000000000003 81.500000000000014 23.500000000000004 17.500000000000004 21.500000000000004 1.0000000180025095e-35 46.500000000000007 28.500000000000004 16.500000000000004 1.0000000180025095e-35 1.5000000000000002 48.500000000000007 1.0000000180025095e-35 19.500000000000004 20.500000000000004 1 85.500000000000014 117.50000000000001 120.50000000000001 207.50000000000003 92.500000000000014 93.500000000000014 469.50000000000006 3.5000000000000004 8.5000000000000018 1.5000000000000002 6.5000000000000009 26.500000000000004 27.500000000000004 2 3.5000000000000004 122.50000000000001 55.500000000000007 56.500000000000007 1.0000000180025095e-35 479.50000000000006 4.5000000000000009 3 4 5 1.5000000000000002 4.5000000000000009 7.5000000000000009 242.50000000000003 245.50000000000003 3.5000000000000004 115.50000000000001 127.50000000000001 649.50000000000011 215.50000000000003 6.5000000000000009 5.5000000000000009 22.500000000000004 1.0000000180025095e-35 1.0000000180025095e-35 100.50000000000001 34.500000000000007 6 3.5000000000000004 4.5000000000000009 4.5000000000000009 8.5000000000000018 1.0000000180025095e-35 7 3.5000000000000004 8 9 3.5000000000000004 11.500000000000002 10 11 2.5000000000000004 11.500000000000002 9.5000000000000018 4.5000000000000009 10.500000000000002 1.5000000000000002 2.5000000000000004 1.5000000000000002 10.500000000000002 9.5000000000000018 2.5000000000000004 6.5000000000000009 1.5000000000000002 5.5000000000000009 1.5000000000000002 1.5000000000000002 2.5000000000000004 3.5000000000000004 12 13 3.5000000000000004 1.5000000000000002 7.5000000000000009 5.5000000000000009 10.500000000000002 14 15 16 17 18
decision_type=2 2 2 9 2 2 2 2 2 2 2 2 2 2 2 2 2 2 2 1 2 2 2 2 2 2 2 2 2 2 2 2 2 1 2 2 2 2 2 2 2 1 9 1 2 2 2 2 2 2 2 2 2 2 2 2 2 2 2 2 2 1 2 2 2 2 2 9 2 9 1 2 2 9 1 2 2 2 2 2 2 2 2 2 2 2 2 2 2 2 2 2 2 9 1 2 2 2 2 2 1 1 9 1 1
left_child=2 6 9 11 5 -3 7 8 12 93 31 27 13 41 -15 16 -12 70 -19 21 -21 59 -23 -6 49 -26 47 28 29 40 -31 61 -33 60 -35 -24 65 -38 -39 -28 -4 -2 43 44 -11 85 -47 53 -49 -22 -50 52 -41 71 75 -55 58 -58 -10 69 -34 67 -61 81 68 73 -63 -8 80 -7 -14 -25 78 -17 -30 89 84 86 -29 82 87 90 -66 -76 -56 -46 98 100 -77 -45 101 -18 -83 94 -1 -82 -69 -88 -65 -79 -5 -44 104 -104 -95
right_child=1 4 3 64 23 19 10 -9 56 42 15 -13 17 14 -16 36 91 18 -20 20 24 22 35 26 25 -27 39 72 74 30 -32 32 33 34 -36 -37 37 38 -40 51 -42 -43 63 54 45 46 -48 48 50 -51 -52 -53 -54 55 76 -57 57 -59 -60 62 -62 66 -64 77 79 -67 -68 96 -70 -71 -72 -73 -74 -75 83 88 -78 99 -80 -81 95 92 -84 -85 -86 -87 97 -89 -90 -91 -92 -93 -94 102 -96 -97 -98 -99 -100 -101 -102 -103 103 -105 -106
leaf_value=-0.024644207370288669 -0.0069800721196601649 0.063875789691088772 -0.0010518554448980481 -0.023932178533943659 0.052448227607739144 0.0048276144318792867 -0.012027390276010727 0.13382522377494566 0.0082083729798514762 6.6267117890037074e-06 0.052218982593386414 0.028365780163654233 -0.017328524786305557 0.082002456338289009 0.0066143552299096978 -0.0018136487442963767 -0.0065350059462317093 0.019958860135730026 -0.014947407458079537 0.05391734376559279 0.011176570148033879 0.05661167629015517 -0.0061108992417266798 0.014463117901614956 0.10741722117586375 0.017616693120676583 0.040976611226883737 -0.021011051660435199 -0.014259176255146777 0.003219167516963415 0.031912640912054889 0.0202623268604574 -0.011556326697451567 -0.0042960687104912909 0.018727147297894112 0.014625643075263015 0.054183866582115853 0.010727069656346688 -0.0012606704634006843 0.023102499704009329 -0.021217277785335859 0.0095892662744851975 -0.024162014060743867 -0.02398016754161135 -0.023705996684982394 0.00081169556126930011 -0.019279444787697175 0.038495469678953405 0.020919068344609795 -0.0068139002435794668 0.032108106899261822 0.03481764905023628 0.028515347470979471 0.015219625814638245 -0.017900225280168231 0.02168811305300071 0.053056942771389004 -0.017437311173211827 0.06085339283964869 0.0083678149680673271 -0.0077384933920616851 -0.01288153536059806 0.0037874615820306205 -0.021280935112207622 -0.020069573223630257 0.0014717135955133326 -0.005876084312789783 -0.017392732516843114 -0.018312127598947382 0.0014035258450004965 -0.014035025745264607 0.010057219088139065 -0.014209946675583089 -0.0052978448794867745 -0.019551352756022947 -0.021695279543486139 -0.014392369242081943 -0.018295667115295948 -0.018073523528273478 -0.016341529003043264 -0.022408396061818079 -0.022847100927823535 -0.01801590660064362 -0.017126216088136342 -0.016327194984303097 -0.022768024410543094 -0.020114101814482237 -0.023228086363048159 -0.020525352314483387 -0.023140444388728192 -0.0234082454199942 -0.0056745800464038341 -0.022091431977931245 -0.024827594065887651 -0.024807432284222761 -0.021549052474401947 -0.017910072682876414 -0.01954767203065786 -0.020654703822707784 -0.017910483003545322 -0.024232755513630386 -0.023923323805185175 -0.024810263200312779 -0.024829264904551042 -0.024822709279509612
leaf_weight=241.8993684053421 29.634114235639572 6.9124845862388602 46.333227977156639 4.1359561681747437 10.442234396934508 12.365681022405624 5.7137275338172913 5.5491797924041739 14.50366121530533 29.017434000968933 13.688156396150591 14.537356019020079 28.316896378993988 7.7870805859565762 16.142954528331757 7.2314170151948929 6.658270910382269 21.319220334291458 15.571559369564055 9.4059355258941633 9.5942178666591662 9.2610810697078687 9.9430499076843244 10.186400175094606 4.9528911709785453 166.1782414317131 17.130655705928802 5.3366187214851397 6.0185640603303909 31.618312388658524 13.251259982585905 21.808247834444046 44.145076125860214 53.386096432805061 16.917826727032661 172.66764521598816 7.6673236042261115 69.488752216100693 99.637886703014374 68.139217138290405 7.9206083118915549 14.784281626343725 13.35523599386215 12.913881674408913 15.263832360506056 28.257117539644241 32.59031817317009 12.818248033523558 233.27170440554619 10.60570967197418 12.768527150154112 18.443952262401581 63.123141348361969 28.805915951728821 11.758654743433004 24.563183397054672 11.412823274731638 8.1662541925907117 10.667618304491041 28.385931581258774 69.375649258494377 8.5554964840412122 22.345949441194534 4.6827776879072243 6.0991720855236071 6.904318004846572 6.0384867489337912 10.711428627371793 5.2757249027490607 48.854068547487259 17.001899689435959 12.489162802696226 4.1234625577926627 40.077839687466621 4.1591084450483304 21.978086575865749 5.5877455025911322 4.0057570934295637 6.6928280293941498 4.3133230507373801 3.5949929654598227 7.8191369771957406 6.6882979571819305 4.7523171901702881 7.0833396911621085 19.250587567687035 4.9010148644447309 10.962157875299452 5.099644035100936 10.028917595744133 9.4799676686525363 6.2616215795278549 8.1951166689395905 148.92711159586906 195.87763890624046 3.9582972824573517 7.9505332708358756 5.4500799477100372 3.7019465565681458 5.9630202353000641 12.697365358471876 3.3445611745119121 13.527369022369385 9.4354185461997986 42.464629858732224
leaf_count=1534 106 20 199 26 17 43 29 7 38 116 33 37 118 28 53 29 24 83 61 23 28 25 16 22 11 397 16 28 33 122 21 53 196 216 54 468 30 222 330 87 39 53 84 81 95 126 185 14 391 16 20 19 65 64 65 50 31 22 28 96 293 29 67 28 36 23 24 35 30 164 70 26 19 149 24 122 31 23 32 24 22 48 38 27 40 119 29 68 27 57 59 22 50 947 1245 24 22 32 22 34 80 21 86 60 270
internal_value=0 0.0131395 -0.0192826 -0.00522119 0.0197096 0.0154114 0.00357372 0.0105431 0.00704036 -0.0223709 0.000786383 0.00124379 0.000954435 0.00995278 0.0311464 0.00565068 0.0238927 -0.00652672 0.00522496 0.0147474 0.0199348 0.0113202 0.0155776 0.0240018 0.0182642 0.0202157 0.0234098 -0.00178434 0.000520393 0.003106 0.0116932 -0.0043367 -0.0025174 -0.0052199 0.0012442 0.0134965 0.00354952 0.00585566 0.00366471 0.0282809 -0.00399584 -0.00146511 -0.0166121 -0.0147621 -0.0112988 -0.0147389 -0.00994926 0.0209831 0.0223413 0.00173091 0.0214997 0.0268281 0.0257055 0.0163598 -0.0205479 0.0181968 0.0275159 0.0236544 0.0305194 0.00402341 -0.00922314 -0.0139367 0.0063503 -0.0218004 -0.0214318 -0.00397097 -0.00998292 -0.0163038 -0.0227392 0.00209515 -0.0160929 0.0120365 -0.0180577 -0.00476527 -0.016646 -0.0224556 -0.0166418 -0.0195551 -0.0193767 -0.018326 -0.0234 -0.0233279 -0.0189954 -0.0182581 -0.0173089 -0.0231828 -0.0203478 -0.0237918 -0.0214749 -0.0236131 -0.0238586 -0.006118 -0.0224604 -0.0247529 -0.0247172 -0.0219581 -0.0176131 -0.0198159 -0.0210044 -0.0180653 -0.0241589 -0.0241142 -0.0248256 -0.0248181 -0.0248265
internal_weight=0 1726.73 1124.33 202.469 1023.66 511.473 703.076 200.858 195.308 921.86 502.218 144.744 150.558 68.3484 23.93 257.616 26.608 82.2096 36.8908 504.56 200.737 303.823 191.872 512.182 191.331 171.131 501.74 130.206 114.053 99.1234 44.8696 244.603 205.633 183.825 70.3039 182.611 231.008 176.794 169.127 166.837 54.2538 44.4184 269.728 198.83 124.379 95.3619 60.8474 334.903 258.858 20.1999 246.04 149.706 131.262 76.0447 74.4503 53.3691 44.7504 19.5791 25.1713 111.952 113.521 38.9697 50.7319 70.8986 57.7253 54.2136 14.594 24.3757 40.6245 61.2197 45.3188 22.6756 16.1529 47.3093 14.93 50.0205 24.4297 28.7046 12.0294 17.1008 35.3488 42.194 12.7875 8.91143 18.842 34.5144 18.7358 27.7955 27.0777 22.9428 26.1798 12.9199 16.0143 652.132 437.777 7.55329 18.662 10.3511 8.38472 9.96878 16.8333 16.6998 214.355 22.9628 191.392
internal_count=11241 4676 6565 929 2165 1374 2511 698 691 5636 1813 581 572 240 81 862 79 332 144 1354 475 879 509 791 452 408 774 544 465 381 143 951 812 759 270 484 783 582 552 187 238 159 1494 1064 641 525 311 587 425 44 411 171 152 162 423 114 119 53 66 370 489 139 163 430 348 201 53 86 250 207 188 48 79 178 84 287 136 168 60 98 220 262 74 51 105 214 111 174 149 138 164 46 98 4142 2779 46 57 61 50 57 106 105 1363 146 1217
cat_boundaries=0 1 2 3 4 5 6 7 8 9 10 11 12 13 14 15 16 17 18 19
cat_threshold=2 1 1 1 2 1 1 1 1 1 1 2 2 1 2 1 1 1 1
is_linear=0
shrinkage=0.05


Tree=20
num_leaves=121
num_cat=25
split_feature=2 2 3 2 0 1 2 2 3 0 2 3 3 2 3 2 2 2 2 3 2 3 2 2 0 1 2 1 2 3 2 2 2 3 1 3 2 2 2 3 2 2 2 2 2 3 2 2 2 2 2 3 2 1 2 2 1 3 3 2 0 1 2 2 2 2 3 1 2 3 2 3 2 3 1 3 1 2 2 2 3 1 3 2 2 1 2 2 2 3 2 2 2 1 2 2 2 2 3 1 2 3 2 2 2 1 2 3 2 3 3 3 2 1 3 0 1 1 0 0
split_gain=261.581 38.2165 18.8012 11.1328 8.67404 8.68756 9.18872 7.02086 5.45925 5.10866 4.14581 8.34047 4.52786 3.94204 7.27944 3.25864 12.1871 8.55044 5.37118 5.82405 5.28775 4.32497 3.96978 5.94797 2.79653 2.45776 3.09658 2.4342 2.3491 6.12598 2.28493 5.69817 2.2024 7.41446 3.97022 3.73648 3.45462 1.85106 1.63137 1.44511 1.37352 6.25984 1.32482 0.998317 1.01126 0.665783 1.30085 0.606264 0.513402 0.483643 2.34953 0.405252 0.710545 0.277562 0.222976 0.220079 0.355892 0.182074 0.181537 0.134645 0.125954 0.103649 0.100392 0.100191 0.0960647 0.0908748 0.088132 0.0869458 0.0731913 0.0855145 0.0704774 0.0596693 0.0546484 0.0503736 0.0502195 0.0498341 0.0482386 0.0465428 0.0448244 0.0409173 0.0406745 0.0403002 0.0400383 0.0392347 0.0387301 0.0281698 0.0223533 0.0211616 0.0168675 0.015872 0.0144085 0.0118079 0.0103938 0.010097 0.00887601 0.00816934 0.00710445 0.00387455 0.00332772 0.00310258 0.00262369 0.00251663 0.00243452 0.00186286 0.0017467 0.00162414 0.00130044 0.00112518 0.0011174 0.00084963 0.000697548 0.000688882 0.000525599 9.8406e-05 7.80982e-05 6.9728e-05 2.35021e-05 5.00266e-07 3.15598e-07 2.58105e-07
threshold=14.500000000000002 119.50000000000001 1.0000000180025095e-35 1.0000000180025095e-35 0 1 7.5000000000000009 303.50000000000006 5.5000000000000009 2 3.5000000000000004 1.5000000000000002 1.5000000000000002 317.50000000000006 13.500000000000002 27.500000000000004 21.500000000000004 37.500000000000007 23.500000000000004 2.5000000000000004 38.500000000000007 1.0000000180025095e-35 64.500000000000014 65.500000000000014 3 4 13.500000000000002 5 123.50000000000001 5.5000000000000009 7.5000000000000009 4.5000000000000009 16.500000000000004 1.0000000180025095e-35 6 1.0000000180025095e-35 18.500000000000004 45.500000000000007 25.500000000000004 57.500000000000007 150.50000000000003 152.50000000000003 22.500000000000004 469.50000000000006 482.00000000000006 1.0000000180025095e-35 204.50000000000003 93.500000000000014 252.50000000000003 2.5000000000000004 1.5000000000000002 1.5000000000000002 1.0000000180025095e-35 7 25.500000000000004 581.00000000000011 8 5.5000000000000009 25.500000000000004 345.50000000000006 9 10 4.5000000000000009 4.5000000000000009 7.5000000000000009 110.50000000000001 2.5000000000000004 11 8.5000000000000018 4.5000000000000009 76.500000000000014 6.5000000000000009 34.500000000000007 16.500000000000004 12 3.5000000000000004 13 34.500000000000007 433.00000000000006 66.500000000000014 7.5000000000000009 14 1.5000000000000002 139.50000000000003 4.5000000000000009 15 12.500000000000002 36.500000000000007 17.500000000000004 4.5000000000000009 9.5000000000000018 9.5000000000000018 1.5000000000000002 16 2.5000000000000004 7.5000000000000009 5.5000000000000009 9.5000000000000018 2.5000000000000004 17 7.5000000000000009 1.5000000000000002 36.500000000000007 23.500000000000004 29.500000000000004 18 1.5000000000000002 1.5000000000000002 12.500000000000002 3.5000000000000004 1.5000000000000002 1.0000000180025095e-35 3.5000000000000004 19 1.5000000000000002 20 21 22 23 24
decision_type=2 2 2 2 9 1 2 2 2 9 2 2 2 2 2 2 2 2 2 2 2 2 2 2 9 1 2 1 2 2 2 2 2 2 1 2 2 2 2 2 2 2 2 2 2 2 2 2 2 2 2 2 2 1 2 2 1 2 2 2 9 1 2 2 2 2 2 1 2 2 2 2 2 2 1 2 1 2 2 2 2 1 2 2 2 1 2 2 2 2 2 2 2 1 2 2 2 2 2 1 2 2 2 2 2 1 2 2 2 2 2 2 2 1 2 9 1 1 9 9
left_child=2 9 3 115 5 6 8 28 10 37 12 -12 -4 14 -9 16 32 67 21 38 -19 42 27 -24 25 26 30 -22 29 -3 31 -5 33 34 -11 36 -34 54 -20 51 58 -42 -18 53 -45 46 -43 70 -47 50 -27 52 -7 60 88 66 -57 62 61 -55 78 83 92 94 96 82 -46 72 69 -53 76 -63 80 -61 -37 77 79 -69 -15 -39 -17 -72 -49 -30 -54 87 -32 104 111 91 99 -8 98 103 106 -64 -51 -66 107 -65 -101 -97 -74 -90 -56 -96 113 -6 -92 -70 -94 -2 -107 -26 -93 116 -1 119 -119 -117
right_child=1 7 4 24 57 39 89 13 -10 15 11 -13 -14 43 -16 17 18 20 19 -21 22 -23 23 -25 63 49 -28 -29 40 -31 86 -33 35 -35 -36 74 -38 47 -40 -41 41 45 -44 44 55 48 -48 65 -50 64 -52 68 84 59 85 56 -58 -59 -60 73 -62 71 95 90 97 -67 -68 75 109 -71 81 -73 102 -75 -76 -77 -78 -79 -80 -81 -82 -83 -84 -85 -86 -87 -88 -89 93 -91 108 114 110 -95 105 101 -98 -99 -100 100 -102 -103 -104 -105 -106 112 -108 -109 -110 -111 -112 -113 -114 -115 -116 117 -118 118 -120 -121
leaf_value=-0.024800727501029921 -0.015740837985381877 0.047479178903608851 -0.0078680563076910359 -0.011729194998203012 -0.024102102838738388 -0.002004446180551961 -0.021181064569068726 0.020053236325206638 0.051011057616711777 -0.020069235618970584 0.079202825685793787 0.0081574162354146728 0.025254008210646647 0.019096256631463488 0.073327464264621708 -0.012143538645555499 0.014020899248531088 0.049573956450367239 0.010840151780743414 -0.016805206078183175 -0.0027346553659381937 0.059251014684016959 0.054358029045678095 0.0099553491422965795 -0.023877688028430599 -0.023905557964779667 0.023189193282814612 0.0088602072908327712 0.0082368910937920779 6.8170932240476905e-05 -0.01971423654999388 0.016326553195077288 -0.015461515843877286 0.041256443335891874 0.018905918028115965 -0.018442367541042098 0.018028416847975182 -0.0019350434461953385 0.031441180386295349 0.015477936600399379 0.057671715151260475 0.01368110704681498 0.036518347721928211 0.038737665378816712 0.020384170417337262 0.013976915046214441 0.025246070429291841 0.0090462711014352368 0.019493055901292227 -0.02157845791939236 0.0092756868066505172 -0.022406491037563262 -0.022787762073704611 0.028311531016059696 -0.0099911722996566532 0.02501710938391849 0.031298626408115253 -0.010487543149449685 0.017600285212358974 0.021518721328923119 0.022725517440668006 0.013660354429994293 -0.019959792520365238 -0.019140959267431742 -0.01785305308497661 0.012686493093520594 0.024750632620247005 -0.0075027232561085721 -0.015023667755792159 -0.015160346096666166 -0.0013864263665959717 0.0088938965190355577 -0.007291253640434172 0.024748731236511442 -0.014362813058146604 -0.01056212755745505 0.00088200973983886422 -0.0025660717911016938 0.015833929477430765 -0.0058800093214895124 -0.0073402319866578865 0.0032590949900710058 0.0038864838192591115 0.010857850777668605 -0.016729356619182349 -0.0044080613096464383 -0.015452049973711707 -0.0061008087618508854 -0.013588396245830782 -0.015810429333350112 -0.018198879580998289 -0.0181793031651553 -0.021984162495602318 -0.010564712887196376 -0.0213535819335956 -0.01840374035460942 -0.019971873056103862 -0.016518619296778985 -0.022474090048911599 -0.021087755863221719 -0.019512717359063798 -0.016861157092231318 -0.0087136106106136171 -0.012337430979201189 -0.0088009667845735991 -0.022959757347514639 -0.023360650488858693 -0.023394326852876009 -0.01710480898013686 -0.015958334428729164 -0.021063231405545543 -0.014825392633896385 -0.022258544940759836 -0.024173224857134738 -0.018450297187720739 -0.024827523459107343 -0.02477709796084622 -0.024819303670242668 -0.024829263729521656 -0.024820730094367832
leaf_weight=238.01091250777245 3.6812990009784716 19.057459920644764 26.186803102493286 61.946806877851486 15.03760522603989 11.977258682250978 5.4496476352214875 13.687805473804476 11.577529549598692 16.352449655532837 6.4629598855972317 11.449198842048643 17.027034357190132 40.790880978107452 12.063291132450102 34.181666359305382 11.817044287919998 7.5219542086124411 15.305617704987524 11.263180091977118 115.94033764302731 16.242315948009491 7.7690116465091696 258.18938767910004 3.7319973707199097 13.230499923229218 8.7154923379421216 74.25609365105629 39.544456988573074 10.604562968015669 27.993612796068195 25.567801997065544 11.531755059957502 13.121426969766615 10.88224768638611 19.291986912488937 23.176655501127243 18.249536424875263 25.823147743940353 4.0496912896633139 9.4408188462257367 44.943267703056335 14.66442996263504 17.231413245201111 16.790606081485748 207.05042186379433 52.976732820272446 6.7552723586559322 52.974371522665024 21.551024705171589 8.9399028420448303 16.965369015932087 5.3463876545429212 14.025881230831144 5.0517371743917483 59.885716140270233 36.167449474334717 3.8598298430442801 9.6969760954380018 30.985494196414948 22.071996867656708 27.967562973499298 5.8672728836536434 5.1699986457824707 7.9057132899761227 8.2638053894042951 37.069069266319275 16.528206557035453 5.0582906454801542 5.357344761490821 7.8904863297939301 8.5804117023944837 8.4562702476978284 19.773956596851349 12.387691706418993 8.4413197040557844 8.7822698950767499 6.7139494866132727 14.192898750305174 10.272982627153395 5.0598023533821097 11.432988077402117 8.478396147489546 22.348237037658691 5.2073831707239151 7.4107525795698193 3.4560015797615042 8.9223501682281476 9.801522955298422 4.1205087304115287 6.1835511773824674 5.1453506052494031 4.8028143942356092 4.8575112521648434 3.7002860903739929 5.2947092801332456 10.108935177326201 17.438033223152161 5.4982484281063071 8.5313431620597893 3.8315296769142142 5.2813358902931213 4.6697072237730017 4.2735148370265952 7.9081250727176666 4.7670945525169355 9.731515109539032 8.9616847336292267 3.7485254406929016 4.6818536520004272 3.5954559743404388 4.6519128233194351 6.0816515982151031 11.484459608793257 5.5011574029922485 142.97405326366425 188.62257151305676 41.883782386779785 9.8176307678222638 15.497488021850584
leaf_count=1547 20 38 107 325 97 52 25 24 38 55 31 35 58 68 20 158 29 32 54 32 456 36 17 770 24 85 29 231 119 20 162 114 51 39 36 65 89 74 65 11 19 107 36 16 20 451 102 22 98 122 52 66 26 21 25 64 34 20 23 40 36 70 35 31 46 25 48 72 25 26 17 20 39 24 44 23 31 28 20 30 18 39 26 65 28 33 20 41 48 17 36 25 30 24 23 29 54 87 34 52 23 30 20 22 39 30 62 57 20 17 22 24 38 74 29 932 1229 273 64 101
internal_value=0 0.0129566 -0.0180681 -0.0211767 -0.00457271 0.00172781 0.0112377 0.0205987 0.019529 0.00571411 0.0135661 0.0337916 0.00518264 0.0262146 0.0450099 0.00733513 0.0127656 0.0053338 0.0257804 0.0150509 0.00799357 0.038938 0.00730792 0.0112524 -0.0127457 -0.00987077 -0.00557897 0.00179219 0.0168776 0.0305291 -0.00768657 -0.00353258 0.00116849 0.0103801 -0.00449582 -0.0044311 0.0069015 -0.00317568 0.0237747 -0.0133405 0.0160261 0.017484 0.0264791 0.0246482 0.0272663 0.016424 0.019938 0.00171292 0.0151007 -0.0167919 -0.0105257 -0.0154783 -0.0103393 0.021563 -0.0101013 0.0259478 0.0273823 -0.0209808 0.011073 0.0239752 0.0195349 0.01043 -0.0217261 -0.0216269 -0.019229 0.00846473 0.0233894 -0.00933918 -0.0190894 -0.0206675 -0.0010887 0.0125413 -0.01059 0.022777 -0.0168471 -0.00727172 -0.00235822 -0.00607668 0.0182542 -0.00335591 -0.0115242 0.00136216 0.00617456 0.00918327 -0.0197985 -0.00707243 -0.0192459 -0.00797476 -0.0133553 -0.0185794 -0.0193075 -0.0192882 -0.0231418 -0.0125302 -0.0232397 -0.0184635 -0.0210655 -0.0169349 -0.0235836 -0.0201695 -0.0205996 -0.0176334 -0.00779727 -0.0132086 -0.00926491 -0.0222581 -0.0238121 -0.0238378 -0.017786 -0.0154729 -0.0215899 -0.0152298 -0.0225667 -0.0241007 -0.0183193 -0.0248019 -0.0247903 -0.0248255 -0.0248212 -0.0248269
internal_weight=0 1726.19 1120.38 910.622 209.763 151.564 92.9202 839.922 72.7035 886.272 61.126 17.9122 43.2138 334.736 25.7511 749.588 201.86 547.728 95.1157 52.3919 463.677 42.7238 456.155 265.958 273.816 206.854 127.68 190.196 505.185 29.662 118.964 87.5146 106.744 40.3561 27.2347 66.3881 34.7084 136.684 41.1288 58.6436 475.523 367.386 26.4815 308.985 167.144 357.945 97.92 80.1257 260.025 79.1741 22.1704 54.5939 22.531 141.841 56.5587 149.913 96.0532 58.199 108.138 64.7853 77.0558 98.4407 54.3391 66.962 57.0037 23.4975 53.8597 84.0509 32.0629 22.3227 56.6283 36.548 52.3674 50.7595 31.6797 31.6835 37.3048 23.2422 54.9838 28.5225 39.2415 19.3235 15.2337 61.8927 10.5538 29.293 31.4496 21.8822 27.2658 20.2167 27.4649 16.0962 37.8958 18.9325 39.497 16.4433 31.66 25.3437 29.4975 17.5329 12.3629 10.576 13.126 14.075 12.9599 14.549 24.948 23.9993 9.93208 9.74014 8.39827 8.33321 10.8487 15.2165 10.6465 636.806 426.633 210.173 51.7014 158.472
internal_count=11227 4602 6625 5655 970 616 365 1567 269 3035 231 66 165 435 44 2495 631 1864 252 151 1506 101 1474 787 1509 1096 650 687 1132 58 621 439 379 130 91 249 140 540 119 251 1074 777 65 391 182 758 209 264 549 446 137 240 106 209 276 166 98 354 297 85 124 274 334 413 309 73 68 358 134 92 191 90 235 64 109 123 135 100 88 104 176 56 48 184 54 138 182 105 138 96 162 79 240 94 251 94 176 133 188 106 75 59 59 70 64 91 160 154 56 42 52 44 68 98 54 4146 2776 1370 337 1033
cat_boundaries=0 1 2 3 4 5 6 7 8 9 10 11 12 13 14 15 16 17 18 19 20 21 22 23 24 25
cat_threshold=2 1 1 2 1 1 1 1 1 2 1 1 1 1 2 1 1 2 2 2 2 1 1 1 1
is_linear=0
shrinkage=0.05


Tree=21
num_leaves=120
num_cat=27
split_feature=2 2 3 2 0 1 2 2 2 0 3 2 3 3 2 2 2 2 3 3 2 2 2 0 1 1 2 1 2 2 2 3 1 3 2 2 3 2 2 3 2 2 2 3 2 2 2 2 2 2 2 3 2 1 1 2 3 3 1 0 1 2 2 2 2 1 2 2 3 2 2 1 3 1 2 3 3 2 2 2 2 1 3 2 1 2 2 2 3 2 2 2 2 1 2 2 2 3 1 2 3 2 2 2 1 2 2 3 2 3 3 2 1 3 0 1 1 0 0
split_gain=249.872 34.9229 18.6807 11.2327 8.44527 8.25729 8.62702 6.26651 13.8928 4.80666 4.76483 3.72947 7.00152 4.20815 3.01163 11.1266 8.09813 4.70581 7.10806 5.4177 4.70404 3.69729 5.23273 2.78063 2.75843 2.41434 2.91523 2.29622 2.24073 5.41293 2.07708 6.72111 3.79782 3.60479 3.25454 2.0285 5.37999 1.78106 1.45003 1.39302 1.34795 5.34827 0.870089 0.953277 0.823745 0.643847 3.78022 0.632741 0.571195 0.481934 2.29228 0.403252 0.698103 0.251104 0.240373 0.218704 0.18271 0.166005 0.14588 0.112858 0.102168 0.101772 0.101654 0.0967917 0.0919591 0.0849919 0.0840437 0.0735978 0.0862486 0.0671629 0.0535679 0.0502157 0.0485531 0.0460989 0.0449911 0.0448763 0.0411432 0.0406823 0.0403694 0.039355 0.0391051 0.0381983 0.0373403 0.031008 0.0273225 0.0224587 0.0206059 0.0167581 0.0159351 0.014518 0.0119159 0.0105895 0.00905214 0.00836395 0.00822147 0.00719699 0.00388072 0.00339574 0.00313448 0.00265409 0.00252467 0.00241129 0.0023717 0.00170896 0.00165118 0.00132884 0.00123216 0.00114984 0.00112119 0.000846839 0.000708065 0.000535212 0.000100645 7.85091e-05 7.14828e-05 2.40859e-05 5.13057e-07 3.23611e-07 2.64578e-07
threshold=14.500000000000002 119.50000000000001 1.0000000180025095e-35 1.0000000180025095e-35 0 1 7.5000000000000009 313.50000000000006 318.50000000000006 2 5.5000000000000009 3.5000000000000004 1.5000000000000002 1.5000000000000002 27.500000000000004 21.500000000000004 37.500000000000007 23.500000000000004 1.5000000000000002 2.5000000000000004 38.500000000000007 64.500000000000014 65.500000000000014 3 4 5 13.500000000000002 6 7.5000000000000009 4.5000000000000009 16.500000000000004 1.0000000180025095e-35 7 1.0000000180025095e-35 18.500000000000004 123.50000000000001 5.5000000000000009 45.500000000000007 25.500000000000004 57.500000000000007 150.50000000000003 152.50000000000003 469.50000000000006 1.0000000180025095e-35 492.50000000000006 204.50000000000003 207.50000000000003 600.50000000000011 93.500000000000014 2.5000000000000004 1.5000000000000002 1.5000000000000002 1.0000000180025095e-35 8 9 25.500000000000004 5.5000000000000009 22.500000000000004 10 11 12 4.5000000000000009 4.5000000000000009 7.5000000000000009 348.50000000000006 13 110.50000000000001 8.5000000000000018 4.5000000000000009 76.500000000000014 34.500000000000007 14 3.5000000000000004 15 34.500000000000007 8.5000000000000018 16.500000000000004 143.50000000000003 433.00000000000006 66.500000000000014 4.5000000000000009 16 1.5000000000000002 139.50000000000003 17 12.500000000000002 36.500000000000007 18.500000000000004 4.5000000000000009 9.5000000000000018 9.5000000000000018 1.5000000000000002 2.5000000000000004 18 7.5000000000000009 5.5000000000000009 9.5000000000000018 2.5000000000000004 19 7.5000000000000009 1.5000000000000002 16.500000000000004 36.500000000000007 29.500000000000004 20 1.5000000000000002 23.500000000000004 1.5000000000000002 12.500000000000002 3.5000000000000004 1.5000000000000002 3.5000000000000004 21 1.5000000000000002 22 23 24 25 26
decision_type=2 2 2 2 9 1 2 2 2 9 2 2 2 2 2 2 2 2 2 2 2 2 2 9 1 1 2 1 2 2 2 2 1 2 2 2 2 2 2 2 2 2 2 2 2 2 2 2 2 2 2 2 2 1 1 2 2 2 1 9 1 2 2 2 2 1 2 2 2 2 2 1 2 1 2 2 2 2 2 2 2 1 2 2 1 2 2 2 2 2 2 2 2 1 2 2 2 2 1 2 2 2 2 2 1 2 2 2 2 2 2 2 1 2 9 1 1 9 9
left_child=2 9 3 114 5 6 10 35 -9 37 11 13 -13 -4 15 30 65 18 24 38 -18 27 -23 25 -17 26 28 -22 29 -5 31 32 -11 34 -32 36 -3 55 -19 51 57 -42 53 47 -45 54 -47 -44 69 50 -27 52 -7 59 -43 87 61 60 -46 78 83 91 92 95 -55 70 82 68 -53 73 75 -35 74 79 -67 -16 -66 -62 -10 -39 -54 -71 -50 -37 86 -30 103 101 90 98 -8 97 105 106 -63 -51 -65 107 99 -64 -96 -2 -72 -57 -94 112 -89 -6 -91 -69 -93 -106 -25 -92 115 -1 118 -118 -116
right_child=1 7 4 23 56 39 88 8 42 14 -12 12 -14 -15 16 17 20 19 -20 -21 21 22 -24 62 -26 49 -28 -29 85 -31 33 -33 -34 71 -36 40 -38 48 -40 -41 41 45 43 44 58 46 -48 -49 66 63 -52 67 80 64 -56 84 -58 -59 -60 -61 77 94 89 96 76 72 -68 109 -70 81 102 -73 -74 -75 -76 -77 -78 -79 -80 -81 -82 -83 -84 -85 -86 -87 -88 93 -90 108 113 110 104 -95 100 -97 -98 -99 -100 -101 -102 -103 -104 -105 111 -107 -108 -109 -110 -111 -112 -113 -114 -115 116 -117 117 -119 -120
leaf_value=-0.024800010244996961 -0.015490420948359422 0.044126258399990154 -0.007734079001792616 -0.011574636459155858 -0.02408436412074132 -0.0019586499951653675 -0.021102967356739066 0.088345022375019538 0.01826540218097495 -0.019972739938333942 0.04723938039472713 0.071281044476021946 0.0078894245559488676 0.024005039439563419 -0.011972786902969391 0.01581001240791367 0.045975432052203655 0.010455577873351688 0.076806578624803695 -0.016669220989153643 -0.0026741514068527594 0.050168463283191904 0.0096107743528554401 -0.023854691926715729 0.044545404891723532 -0.023883210106126856 0.022088497212218811 0.0085630298927546842 -0.019612397650414674 0.015660076046323492 -0.015315550863794892 0.038585457758800956 0.018086831305872981 -0.018323485698063958 0.017262684797245281 0.0079656474366624937 6.6473668461178973e-05 -0.0018906992448406005 0.029699495344955175 0.014858867105086583 0.053048343712999262 0.012167584046986701 0.038679788564799616 0.013498258346810607 0.023966915115913871 0.045925796307330083 0.016269346420519703 0.026620427239372458 0.0087412059025163639 -0.021507548406817394 0.0089608014394761577 -0.022351592853807015 -0.022740706463575788 0.026234898711687105 0.015963802810505742 -0.0098421795327851818 -0.010336341849442043 0.016574639145600107 0.027797475752343415 0.021739770361108517 0.013078148284529226 -0.019861621811036703 -0.021008018663852504 -0.017727387892871909 0.020662043304837785 -0.007372238221300057 0.012213555887009809 -0.01487523897043932 -0.01501264525946667 0.0031677014457495351 -0.0071629124868949554 -0.014211400664045044 -0.010410637700282749 0.00085934215222758592 -0.0025088692319457668 -0.006572090431475274 0.023610981683122503 0.0091843739040616164 0.015195142044280453 -0.0057682593223563226 -0.016592709909343032 -0.0013539021123624795 0.0037750972131542202 0.010296779348526051 -0.0043178447119343859 -0.015306028680823973 -0.0059862007406887045 -0.013237590550725258 -0.015666704142734363 -0.018077109784448646 -0.018057306098907839 -0.021920921700713289 -0.021278564630893448 -0.010300861425050975 -0.018284391604199125 -0.019873886312095121 -0.016380198422621027 -0.022420560365704223 -0.01903103122366441 -0.01940795899326786 -0.016725666685999122 -0.013965069602291836 -0.0085725716380094363 -0.0086592796536009414 -0.0229163370278785 -0.023325940359032848 -0.012182359304975313 -0.023360361000081889 -0.016971546971172917 -0.015815633492890453 -0.020983065619454809 -0.022200682168901 -0.024157172249256079 -0.018331511014645523 -0.024827481962213127 -0.024775790710774574 -0.024819054133579578 -0.024829265829873971 -0.024820518047526708
leaf_weight=232.18066850304604 5.5088398754596728 19.984117031097416 25.981571555137634 61.224466934800148 14.67949998378754 11.953274428844454 5.3354321718215969 8.4742546677589399 41.577319025993347 16.027540117502213 12.18343412876129 6.9956618696451214 11.542976990342138 17.462510466575623 34.462215185165405 22.301457822322845 7.9042445123195639 15.472435072064398 8.7745423913001996 11.07548141479492 115.62371464073658 8.2030085325241071 260.77259057760239 3.6439415216445923 13.351517558097838 12.917967960238457 8.9199589788913709 74.916940242052078 27.447143822908405 25.988662049174309 11.354827880859373 13.674092441797255 11.089944005012514 18.939457446336746 23.598283797502518 39.871524930000305 10.60528591275215 18.214256957173351 26.647955715656281 4.1128599643707267 10.001293629407881 100.85355421900749 20.368723511695862 17.17333972454071 73.266639351844788 11.350728273391722 201.46038919687271 23.342398464679718 6.8166594803333309 21.090968310832981 9.0232119560241699 16.589461416006095 5.2259330749511701 15.472420692443846 71.092800140380859 5.001515671610834 3.8195613175630561 10.759410768747328 37.615419387817383 21.453612387180328 27.640960961580276 5.751324504613879 8.3533197343349475 7.7658245861530331 30.128227174282074 16.404663473367698 8.3693119585514051 4.9828647524118406 5.2767381817102423 11.470309853553772 8.3948372155427915 12.211041212081911 8.3526306152343732 8.7900193035602552 6.6967431157827368 4.3296729177236548 19.472473382949829 8.8578770160675031 14.419416606426237 10.212754637002943 5.1209918111562729 7.8795543015003213 8.5114112198352796 22.212416768074036 7.378157481551173 3.4030094742774954 8.8680822998285276 8.0271011441946012 4.055873990058898 6.072035223245619 5.0526567399501783 4.6983808279037458 3.6221094578504562 4.2556158304214504 5.1981580257415754 9.9090436398982984 17.152347475290298 5.3760585188865653 5.0719809383153942 3.7574907690286627 5.19303297996521 4.8914041519165039 4.6291939020156851 7.8388313353061676 4.6588902175426465 9.5068146586418152 4.2211144566535941 8.754465714097023 3.6849529296159744 4.6077320873737335 3.5205160081386566 5.9477784633636475 11.210171997547148 5.4005900025367737 139.46805739402771 184.00646387040615 40.857047438621521 9.5768671035766584 15.1175629645586
leaf_count=1547 29 38 107 325 97 52 25 14 68 55 38 31 35 58 161 54 32 54 17 32 456 17 770 24 30 85 29 231 162 114 51 39 36 65 89 119 20 74 65 11 19 256 20 19 84 17 376 22 22 122 52 66 26 22 143 25 20 25 37 34 69 35 52 46 38 72 25 25 26 39 39 44 23 31 28 15 23 20 20 30 28 17 26 64 33 20 41 39 17 36 25 30 23 21 29 54 87 34 31 23 30 27 20 39 30 62 22 57 20 17 22 38 74 29 932 1229 273 64 101
internal_value=0 0.0124656 -0.0179456 -0.0210987 -0.00448629 0.00167242 0.0108193 0.0196698 0.0251714 0.00553623 0.0186542 0.0130354 0.0318106 0.00502358 0.00709571 0.0122768 0.00517152 0.0244804 0.0364926 0.0144482 0.00773068 0.00707283 0.0108477 -0.0125918 0.026571 -0.0097239 -0.00547339 0.00174409 -0.00755576 -0.00345896 0.00113177 0.0100043 -0.00440793 -0.00434331 0.00667936 0.0163488 0.0288508 -0.00310742 0.0226305 -0.0131869 0.0155902 0.0169509 0.023468 0.0258644 0.0236882 0.0160126 0.0178511 0.0322399 0.0016671 -0.0166562 -0.0103763 -0.0153327 -0.0101894 0.0205799 0.0137372 -0.00995185 -0.0208992 0.0106775 0.0252664 0.0186562 0.0100339 -0.021658 -0.0215569 -0.0191203 0.0228695 -0.0091939 0.00818387 -0.0189789 -0.0205806 -0.00106294 -0.0104385 -0.0167115 -0.00714365 -0.00230523 -0.00596242 -0.01137 0.0218198 0.0121332 0.0174748 -0.00328376 -0.0196979 0.00132644 0.00598361 0.00879968 -0.00694644 -0.0191374 -0.00783984 -0.0132011 -0.0184622 -0.0191999 -0.0191803 -0.0231023 -0.0232023 -0.0122104 -0.0183449 -0.0209854 -0.0168001 -0.0235539 -0.0200746 -0.0205116 -0.0175054 -0.014773 -0.00766395 -0.00912004 -0.0222003 -0.0237875 -0.0128739 -0.0238139 -0.0176596 -0.015327 -0.0215192 -0.022515 -0.024083 -0.018199 -0.0248012 -0.0247893 -0.0248254 -0.024821 -0.0248268
internal_weight=0 1748.92 1100.45 891.579 208.872 151.881 94.0107 857.455 322.764 891.464 74.1662 61.9827 18.5386 43.4441 755.209 204.519 550.69 97.6234 44.4275 53.1959 467.42 459.516 268.976 270.372 35.653 204.843 126.983 190.541 118.063 87.2131 106.895 40.7916 27.1175 66.1036 34.9531 534.69 30.5894 136.255 42.1204 57.8699 504.101 394.759 314.29 171.767 128.055 384.757 212.811 43.7111 80.2643 77.8594 21.9412 53.757 22.3002 142.523 171.946 55.9907 56.991 109.342 110.882 77.4503 98.5828 53.1714 65.5295 55.9182 65.0731 83.27 23.6974 31.4568 21.8662 56.5669 51.8159 31.1505 31.454 37.217 23.1014 38.7919 49.6007 36.4988 55.9967 28.427 10.3469 19.3499 15.3281 62.0839 29.0866 30.8502 21.7084 26.9041 19.8446 26.9398 15.7887 37.0289 38.5897 16.5038 16.1425 31 24.9182 28.81 17.1828 12.1108 10.3912 10.4002 13.024 12.8403 14.2288 24.3609 12.2482 23.434 9.75699 9.5906 8.2189 10.6067 14.8541 10.4532 621.207 416.187 205.02 50.4339 154.586
internal_count=11227 4602 6625 5655 970 616 365 1567 401 3035 269 231 66 165 2495 631 1864 252 101 151 1506 1474 787 1509 84 1096 650 687 621 439 379 130 91 249 140 1166 58 540 119 251 1108 811 387 182 140 792 393 42 264 446 137 240 106 205 399 276 354 297 121 122 272 334 413 309 83 358 73 134 92 191 235 109 123 135 100 176 61 89 88 104 54 56 48 183 138 182 105 138 96 162 79 240 251 82 94 176 133 188 106 75 59 56 59 64 91 160 61 154 56 42 52 68 98 54 4146 2776 1370 337 1033
cat_boundaries=0 1 2 3 4 5 6 7 8 9 10 11 12 13 14 15 16 17 18 19 20 21 22 23 24 25 26 27
cat_threshold=2 1 1 2 1 1 1 1 1 1 1 2 1 1 1 1 1 1 1 1 2 2 2 1 1 1 1
is_linear=0
shrinkage=0.05


Tree=22
num_leaves=121
num_cat=27
split_feature=2 2 3 2 0 1 2 2 0 3 2 3 3 2 3 2 2 2 2 2 3 3 2 2 0 1 1 2 2 2 1 2 3 1 3 2 2 1 2 3 2 2 2 2 2 3 2 2 2 2 2 3 2 1 2 2 1 3 3 2 2 3 2 2 0 1 1 2 2 3 2 3 2 1 3 1 3 2 2 2 2 2 1 3 2 1 2 2 2 3 2 2 2 2 2 1 2 2 3 1 2 3 3 2 1 2 2 2 3 2 3 3 2 1 3 0 1 1 0 0
split_gain=238.783 31.9648 18.5564 11.3309 8.22214 7.85178 8.11015 5.61332 4.52411 4.18095 3.36526 5.94011 3.9161 3.12414 5.9847 2.7855 10.1757 7.67203 4.20253 4.13871 5.84878 5.04798 3.44599 4.62716 2.76379 2.399 2.37078 2.74691 2.1967 5.14426 2.1667 1.95972 6.11113 3.63524 3.47778 3.06867 1.86718 2.83236 1.71342 1.34324 1.29319 1.13141 4.71841 0.796158 0.890767 0.577327 1.10491 0.538322 0.480042 2.23675 0.452378 0.401098 0.685673 0.21833 0.21442 0.197558 0.285471 0.183293 0.152342 0.103148 0.103117 0.0978971 0.0974925 0.0947959 0.0930942 0.0875818 0.0830464 0.0778012 0.073981 0.0869637 0.0640015 0.0541164 0.0524856 0.0501914 0.0472862 0.0440496 0.0439885 0.0434779 0.0406129 0.0394725 0.0378436 0.0364413 0.0362095 0.0348458 0.0337185 0.0264913 0.0225566 0.0200567 0.0165979 0.0159926 0.0146235 0.0120212 0.0107873 0.00923063 0.00827106 0.00824398 0.00728891 0.00388533 0.00346478 0.00316578 0.00268412 0.00253176 0.00241634 0.00239799 0.00167836 0.0016713 0.00135777 0.00121806 0.00117494 0.00112455 0.000843684 0.000718589 0.000544915 0.000102928 7.88934e-05 7.32678e-05 2.46898e-05 5.25816e-07 3.31668e-07 2.71211e-07
threshold=14.500000000000002 119.50000000000001 1.0000000180025095e-35 1.0000000180025095e-35 0 1 7.5000000000000009 303.50000000000006 2 5.5000000000000009 3.5000000000000004 1.5000000000000002 1.5000000000000002 317.50000000000006 13.500000000000002 27.500000000000004 21.500000000000004 37.500000000000007 38.500000000000007 23.500000000000004 1.5000000000000002 2.5000000000000004 64.500000000000014 65.500000000000014 3 4 5 13.500000000000002 7.5000000000000009 4.5000000000000009 6 16.500000000000004 1.0000000180025095e-35 7 1.0000000180025095e-35 18.500000000000004 123.50000000000001 8 45.500000000000007 57.500000000000007 25.500000000000004 150.50000000000003 152.50000000000003 469.50000000000006 482.00000000000006 1.0000000180025095e-35 195.50000000000003 93.500000000000014 2.5000000000000004 1.5000000000000002 250.50000000000003 1.5000000000000002 1.0000000180025095e-35 9 25.500000000000004 581.00000000000011 10 5.5000000000000009 25.500000000000004 4.5000000000000009 4.5000000000000009 2.5000000000000004 7.5000000000000009 345.50000000000006 11 12 13 110.50000000000001 8.5000000000000018 4.5000000000000009 76.500000000000014 6.5000000000000009 34.500000000000007 14 3.5000000000000004 15 8.5000000000000018 34.500000000000007 403.00000000000006 4.5000000000000009 66.500000000000014 433.00000000000006 16 1.5000000000000002 140.50000000000003 17 12.500000000000002 36.500000000000007 18.500000000000004 4.5000000000000009 9.5000000000000018 9.5000000000000018 1.5000000000000002 2.5000000000000004 7.5000000000000009 18 5.5000000000000009 9.5000000000000018 2.5000000000000004 19 7.5000000000000009 1.5000000000000002 1.0000000180025095e-35 16.500000000000004 20 29.500000000000004 1.5000000000000002 23.500000000000004 1.5000000000000002 12.500000000000002 3.5000000000000004 1.5000000000000002 3.5000000000000004 21 1.5000000000000002 22 23 24 25 26
decision_type=2 2 2 2 9 1 2 2 9 2 2 2 2 2 2 2 2 2 2 2 2 2 2 2 9 1 1 2 2 2 1 2 2 1 2 2 2 1 2 2 2 2 2 2 2 2 2 2 2 2 2 2 2 1 2 2 1 2 2 2 2 2 2 2 9 1 1 2 2 2 2 2 2 1 2 1 2 2 2 2 2 2 1 2 2 1 2 2 2 2 2 2 2 2 2 1 2 2 2 1 2 2 2 2 1 2 2 2 2 2 2 2 2 1 2 9 1 1 9 9
left_child=2 8 3 115 5 6 9 36 38 10 12 -12 -4 14 -9 16 31 66 -19 20 25 40 30 -24 26 -18 27 28 29 -5 -20 32 33 -10 35 -33 37 -3 54 51 -21 58 -43 53 -45 46 -44 70 49 -28 -47 52 -7 64 88 61 -57 59 65 92 93 -46 96 -55 81 84 72 83 69 -53 75 -67 76 -36 77 80 -17 -68 -65 -54 -40 -15 -72 -49 -38 87 -30 105 103 91 99 -8 98 106 -61 107 -50 -64 108 -62 -101 -96 -74 -2 -95 -56 113 -90 -6 -92 -70 -94 -106 -26 -93 116 -1 119 -119 -117
right_child=1 7 4 24 57 39 89 13 15 -11 11 -13 -14 43 -16 17 19 18 22 21 -22 -23 23 -25 60 -27 48 -29 86 -31 -32 34 -34 -35 73 -37 41 -39 47 -41 -42 42 45 44 55 50 -48 67 62 -51 -52 68 79 63 85 56 -58 -59 -60 94 90 -63 97 78 -66 71 74 -69 110 -71 82 -73 102 -75 -76 -77 -78 -79 -80 -81 -82 -83 -84 -85 -86 -87 -88 -89 95 -91 109 114 111 104 101 -97 -98 -99 -100 100 -102 -103 -104 -105 112 -107 -108 -109 -110 -111 -112 -113 -114 -115 -116 117 -118 118 -120 -121
leaf_value=-0.024799275887557953 -0.015344631686528868 0.039322890736261412 -0.0076013493816272223 -0.011420327844706995 -0.024066206181059542 -0.0019138093234172229 -0.021023496914215303 0.017520240165997483 -0.019874766915070226 0.043914062613090575 0.064668668853833947 0.0076323078357259603 0.022846728467520856 0.017485405854227726 0.063918112232602506 -0.011817934286054746 0.01517255821199999 0.042793850163058228 -0.002614826178082346 0.01008857647753255 0.069292537877333041 -0.016532059050896233 0.046498763614292143 0.0092813643025574308 -0.023831164023105131 0.041522903557119309 -0.023860343821509061 0.021063514139050162 -0.019509071780399252 0.015030948626752416 0.0082783115422897912 -0.015168721137085384 0.036185177488720362 0.017317592993788915 -0.018203178157601453 0.016542300809940826 0.0077466607845908877 0.0085910551886942636 -0.0018472882267549472 0.014273506193772054 0.028103832980340165 0.049024731733049776 0.011596908810251886 0.035010660181486193 0.017919091999677939 0.012811213355473984 0.022362636636315218 0.0084490381615153539 -0.021435332987705519 0.0086593695439393797 0.017797438449642464 -0.02229558928116606 -0.022692667288907613 0.025205109362344453 -0.0096939455360154098 0.022609192493400293 0.028081220775879236 -0.010185761136486138 0.016174756066518796 -0.019761969828439543 -0.018919628292162257 0.022399121775110317 -0.017600367214754747 0.019450732437127916 0.020501646783356704 0.012678247895137726 -0.0072430652034355713 0.011763882948117175 -0.014726064213235721 -0.014864159837795843 0.0030791557588403917 0.0081891581852762494 -0.0081581910316793592 -0.014059428495443388 -0.01025974635931726 0.00083727632983728907 -0.0064517077546248072 -0.0024527998034314558 0.022233007056564905 -0.016454903762066615 -0.005657992887681291 0.014591562587164653 -0.0013220972166734257 0.0036673164052814901 0.010189408493261316 -0.0042290880943947782 -0.015159143535758441 -0.005873064123816019 -0.013083124743104938 -0.015522027047128515 -0.017953940509512281 -0.017933912333979094 -0.021856463859076247 -0.021202201825223026 -0.018163622439383909 -0.01015043309134233 -0.019774418891059367 -0.01624066167484282 -0.022365945476240424 -0.020926893121161243 -0.019301714974764916 -0.01658898843038524 -0.0067856160546334518 -0.013812285607969994 -0.022871994087497762 -0.0085186515790310283 -0.023290460826247594 -0.012027348001012406 -0.023325642934145699 -0.016837051349838809 -0.015671943928670152 -0.020901507783366774 -0.022141674100739948 -0.024140738565946483 -0.018211298775574616 -0.024827435115320384 -0.02477444878790043 -0.02481879649624643 -0.024829263666511975 -0.024820296399531597
leaf_weight=226.49339359998703 5.4241633266210574 19.184657871723175 25.781402811408043 60.519900009036064 14.330176785588268 11.929885268211367 5.2240182161331203 14.506496429443361 15.710601657629015 12.772782921791075 7.5125221759080913 11.63440480828285 17.886770710349083 42.343723297119141 13.342289388179777 34.052065715193748 22.656845450401306 8.2761290967464429 115.3149311542511 15.635057210922239 9.4750421345233899 10.892392233014105 8.6250385940074903 263.29089993238449 3.5580450296401978 13.959712088108061 12.613100185990334 9.1191795170307142 26.91408455371857 26.398849189281464 75.561212211847305 11.182247668504713 14.212025344371794 11.292351007461546 18.595580697059631 24.009189605712891 41.637286156415939 12.307019531726839 18.179851621389393 4.1744286119937888 27.451256275177002 10.546169966459273 38.18282824754715 18.304636120796204 17.758833944797516 210.0911377966404 63.416712939739227 6.8765064775943783 20.642196059226993 9.1044304966926575 58.058726638555527 16.222773939371116 5.1084327101707441 14.896688699722288 4.9525313526392001 62.925440430641174 38.366736769676208 3.7802843898534766 10.034097284078596 5.6382208466529837 4.9763685613870621 38.914745569229126 7.6293700039386776 29.412725687026978 23.154817938804626 28.69987279176712 16.284169703722007 8.472157806158064 4.9092918634414655 5.1981120556592932 11.506701916456223 8.7635502815246564 7.027234733104704 12.038732573390009 8.2661255002021772 8.7975761890411359 4.3013111650943747 6.6799631267786017 23.672316193580627 5.0367215424776077 10.154014348983763 14.640195012092589 7.8688933253288278 8.5436035990715009 21.381568014621735 7.346368312835696 3.3513197302818289 8.8151547908782941 7.9215419143438321 3.9928269386291495 5.9632565528154355 4.962238132953642 4.5965087264776212 3.5458503365516663 5.1039764285087568 4.2120043039321926 9.7140562534332258 16.873676955699921 5.2568655610084525 8.1796633303165489 3.6852686554193488 5.1068984419107437 5.8973655700683594 4.8235701620578766 4.553339481353758 7.7712454497814178 9.2876260280609131 4.170003280043602 8.5523284524679184 3.6229412853717804 4.5354311764240265 3.4474144577980042 5.8171884119510651 10.942610770463942 5.3024909198284149 136.04805529117584 179.5035704523325 39.85549758374691 9.3420085906982404 14.746955469250677
leaf_count=1547 29 29 107 325 97 52 25 24 55 38 31 35 58 68 20 161 54 32 456 54 17 32 17 770 24 30 85 29 162 114 231 51 39 36 65 89 123 29 74 11 65 19 89 16 20 445 120 22 122 52 104 66 26 21 25 64 34 20 23 35 31 48 46 36 36 70 72 25 25 26 39 20 33 44 23 31 15 28 28 28 30 20 17 26 61 33 20 41 39 17 36 25 30 23 29 21 54 87 34 52 23 30 26 27 30 39 62 22 57 20 17 22 38 74 29 932 1229 273 64 101
internal_value=0 0.0119992 -0.0178217 -0.0210193 -0.00440077 0.00161948 0.0104223 0.0188003 0.00536486 0.0178363 0.0125337 0.0300112 0.00487038 0.0236782 0.0397494 0.00686579 0.0118124 0.00501511 0.00747856 0.0232747 0.0342787 0.0138786 0.00684701 0.0104619 -0.0124378 0.0252184 -0.00957779 -0.0053692 -0.00742617 -0.00338658 0.00169739 0.00109647 0.00964641 -0.00432131 -0.00425684 0.00646597 0.0155107 0.0273128 -0.00304041 -0.0130331 0.0215665 0.0147534 0.0160475 0.0222985 0.0245692 0.015107 0.0183167 0.0016226 -0.0165193 -0.0102274 0.0138908 -0.0151862 -0.01004 0.0195963 -0.00980315 0.0233592 0.0246818 -0.0208162 0.0103002 -0.0215885 -0.0214856 0.0209953 -0.0190101 0.0216805 0.0178282 0.00971361 -0.00904956 0.00791459 -0.0188668 -0.0204922 -0.00103777 0.0116281 -0.0102875 -0.0165748 -0.00701692 -0.00225331 -0.0112161 -0.00584964 0.0206914 -0.0195958 -0.00321293 0.0167419 0.0012917 0.0057997 0.00857546 -0.00682183 -0.0190274 -0.00770614 -0.0130465 -0.0183436 -0.0190908 -0.0190709 -0.0230619 -0.0231641 -0.0182248 -0.0120554 -0.0209038 -0.016664 -0.0235235 -0.0199781 -0.0204221 -0.0173761 -0.0075319 -0.0146234 -0.0221413 -0.00897612 -0.0237625 -0.012719 -0.0237894 -0.0175318 -0.0151803 -0.0214472 -0.0224623 -0.0240648 -0.0180772 -0.0248005 -0.0247883 -0.0248253 -0.0248208 -0.0248267
internal_weight=0 1771.07 1081 873.002 207.997 152.185 95.0695 874.543 896.523 75.5879 62.8151 19.1469 43.6682 352.24 27.8488 760.687 207.111 553.576 471.068 100.07 46.0916 53.9787 462.792 271.916 267.012 36.6166 202.88 126.303 117.184 86.9187 190.876 107.041 41.215 27.003 65.8258 35.1914 522.304 31.4917 135.836 57.1151 43.0863 490.812 380.296 324.391 176.27 369.749 101.6 80.3993 76.5768 21.7175 268.15 52.9406 22.075 148.12 55.4366 157.966 101.292 55.8127 110.516 52.0324 64.1322 56.6736 54.8593 67.9817 80.1387 100.482 82.5082 23.8923 30.8656 21.4209 56.507 37.4634 51.278 30.6343 31.2303 37.1314 38.3534 22.9641 53.085 10.1452 28.3339 56.9839 19.3756 15.4201 63.0189 28.8853 30.2654 21.5389 26.5513 19.4816 26.4275 15.4887 36.1833 37.7047 15.8491 16.3035 30.3563 24.503 28.1394 16.8413 11.8649 10.2109 12.9246 10.2477 13.9164 12.7238 23.7883 12.0915 22.8825 9.5862 9.44472 8.04392 10.3705 14.5007 10.2647 605.989 405.997 199.993 49.1975 150.795
internal_count=11227 4602 6625 5655 970 616 365 1567 3035 269 231 66 165 435 44 2495 631 1864 1506 252 101 151 1474 787 1509 84 1096 650 621 439 687 379 130 91 249 140 1132 58 540 251 119 1074 777 391 182 758 209 264 446 137 549 240 106 209 276 166 98 354 297 334 413 68 309 85 124 274 358 73 134 92 191 90 235 109 123 135 176 100 64 54 104 88 56 48 184 138 182 105 138 96 162 79 240 251 94 82 176 133 188 106 75 59 59 56 91 64 160 61 154 56 42 52 68 98 54 4146 2776 1370 337 1033
cat_boundaries=0 1 2 3 4 5 6 7 8 9 10 11 12 13 14 15 16 17 18 19 20 21 22 23 24 25 26 27
cat_threshold=2 1 1 2 1 1 1 1 1 1 1 2 1 1 1 1 1 1 1 2 2 2 2 1 1 1 1
is_linear=0
shrinkage=0.05


Tree=23
num_leaves=118
num_cat=26
split_feature=2 2 3 2 0 1 2 2 2 0 3 2 3 2 0 2 2 2 2 2 3 3 2 2 1 2 2 2 1 2 3 3 2 2 1 1 3 2 2 2 2 3 2 2 3 2 2 2 2 2 3 2 2 1 3 3 1 2 2 2 0 1 1 2 3 2 2 2 2 3 3 1 2 2 2 2 3 1 2 3 1 3 1 2 2 2 3 2 2 2 1 2 2 2 2 3 1 2 3 2 2 1 2 2 3 2 3 3 3 2 1 3 0 1 1 0 0
split_gain=228.278 29.3047 18.4281 11.4273 8.00441 7.46914 7.63337 5.1447 10.9779 4.25988 3.68616 3.04506 5.08522 3.81324 2.74606 2.57915 9.32341 7.27037 3.76872 3.65574 4.86904 4.71064 3.21398 4.25921 2.32712 2.59041 2.15287 4.89092 2.09729 2.08063 1.91029 2.70651 1.64806 1.63089 2.49402 1.56937 1.29561 1.15691 1.09837 4.08635 0.682233 0.81695 0.760929 0.541678 0.516439 1.03314 0.519185 0.507492 0.477967 2.18285 0.398792 0.673265 0.21013 0.201115 0.183822 0.139903 0.111984 0.104578 0.104519 0.098166 0.0913881 0.0869629 0.0811108 0.0743404 0.087659 0.0730678 0.072089 0.0609864 0.0514024 0.0460342 0.0430995 0.042087 0.0420029 0.0398318 0.0367391 0.036382 0.0352659 0.0343274 0.032967 0.0325373 0.0286542 0.0269599 0.0256763 0.0226466 0.0195145 0.016449 0.0160443 0.0147248 0.0121236 0.0109873 0.0097535 0.0094115 0.00831805 0.00738014 0.00388838 0.00353484 0.00319643 0.00271372 0.00253788 0.00235938 0.0018067 0.00170567 0.00163376 0.00138722 0.00120051 0.00112749 0.000840171 0.00072911 0.000704377 0.000554707 0.000105256 7.92514e-05 7.51073e-05 2.53096e-05 5.38895e-07 3.39929e-07 2.78011e-07
threshold=14.500000000000002 119.50000000000001 1.0000000180025095e-35 1.0000000180025095e-35 0 1 7.5000000000000009 313.50000000000006 318.50000000000006 2 5.5000000000000009 3.5000000000000004 1.5000000000000002 1.0000000180025095e-35 3 27.500000000000004 21.500000000000004 37.500000000000007 38.500000000000007 23.500000000000004 1.5000000000000002 2.5000000000000004 64.500000000000014 81.500000000000014 4 13.500000000000002 7.5000000000000009 4.5000000000000009 5 48.500000000000007 6.5000000000000009 1.5000000000000002 45.500000000000007 123.50000000000001 6 7 57.500000000000007 25.500000000000004 150.50000000000003 152.50000000000003 469.50000000000006 1.0000000180025095e-35 492.50000000000006 600.50000000000011 1.0000000180025095e-35 204.50000000000003 252.50000000000003 93.500000000000014 2.5000000000000004 1.5000000000000002 1.5000000000000002 1.0000000180025095e-35 25.500000000000004 8 5.5000000000000009 22.500000000000004 9 4.5000000000000009 4.5000000000000009 7.5000000000000009 10 11 12 8.5000000000000018 4.5000000000000009 348.50000000000006 110.50000000000001 76.500000000000014 34.500000000000007 3.5000000000000004 8.5000000000000018 13 34.500000000000007 4.5000000000000009 143.50000000000003 66.500000000000014 16.500000000000004 14 433.00000000000006 1.5000000000000002 15 4.5000000000000009 16 12.500000000000002 36.500000000000007 17.500000000000004 4.5000000000000009 9.5000000000000018 9.5000000000000018 1.5000000000000002 17 2.5000000000000004 7.5000000000000009 5.5000000000000009 9.5000000000000018 2.5000000000000004 18 7.5000000000000009 1.5000000000000002 36.500000000000007 23.500000000000004 19 29.500000000000004 1.5000000000000002 1.5000000000000002 12.500000000000002 3.5000000000000004 1.5000000000000002 1.0000000180025095e-35 3.5000000000000004 20 1.5000000000000002 21 22 23 24 25
decision_type=2 2 2 2 9 1 2 2 2 9 2 2 2 2 9 2 2 2 2 2 2 2 2 2 1 2 2 2 1 2 2 2 2 2 1 1 2 2 2 2 2 2 2 2 2 2 2 2 2 2 2 2 2 1 2 2 1 2 2 2 9 1 1 2 2 2 2 2 2 2 2 1 2 2 2 2 2 1 2 2 1 2 1 2 2 2 2 2 2 2 1 2 2 2 2 2 1 2 2 2 2 1 2 2 2 2 2 2 2 2 1 2 9 1 1 9 9
left_child=2 9 3 112 5 6 10 33 -9 32 11 13 -13 -4 24 16 30 62 -19 20 28 37 29 -24 25 26 27 -5 -18 -20 31 35 52 34 -3 -11 50 -21 55 -40 53 43 -43 -42 45 -41 -46 67 49 -26 51 -7 85 60 58 61 -44 91 89 93 78 81 68 64 -52 -55 79 71 70 72 -17 75 -64 -53 -63 -34 -67 -69 -10 -49 -33 -35 84 -28 102 108 88 96 -8 95 100 103 -60 -50 -61 104 97 -59 -94 -70 -87 -93 -54 110 -6 -89 -65 -91 -2 -103 -16 -90 113 -1 116 -116 -114
right_child=1 7 4 14 54 36 86 8 40 15 -12 12 -14 -15 57 17 19 18 22 21 -22 -23 23 -25 48 -27 83 -29 -30 -31 -32 80 47 38 -36 -37 -38 -39 39 44 41 42 56 -45 46 -47 -48 66 59 -51 63 73 82 65 -56 -57 -58 87 92 94 -62 74 69 106 -66 76 -68 77 99 -71 -72 -73 -74 -75 -76 -77 -78 -79 -80 -81 -82 -83 -84 -85 -86 90 -88 105 111 107 -92 101 98 -95 -96 -97 -98 -99 -100 -101 -102 109 -104 -105 -106 -107 -108 -109 -110 -111 -112 -113 114 -115 115 -117 -118
leaf_value=-0.024798523948975481 -0.015316185800466516 0.036849197057844639 0.012387042497250918 -0.011266315453355635 -0.02404762028524933 -0.0018699112332445967 -0.020942638380954583 0.075718898903762544 0.016751947519734481 -0.0025981370977712511 0.040960588971236361 0.059064129506527868 0.0073854947832362227 -0.023619458507775141 -0.023807093572218899 -0.011663255216067196 0.014570208878187977 0.039961040705752383 0.0070987494446705032 0.009738075864105241 0.062991426940386702 -0.016393748836224794 0.017760487867422556 0.0050393663292670051 -0.023836947367688724 0.020106959924984655 -0.019404261118041076 0.014436293324942354 0.038824185533979115 -0.0033426164936842559 0.02131863030009256 -0.018941796048231596 -0.00180479471395077 0.0090197864567036542 0.0083051692175537366 0.012071457263557732 0.013719337204233335 0.02663691740725076 0.045491378041938188 0.012140621189774927 0.034864271616599753 0.011818022024256483 0.021759500181138123 0.024021154997865203 0.012366945244221737 0.022081764913372711 0.017182894259318206 0.0081690529147140974 -0.021361797524242603 0.0083706307715075753 -0.022238464759421081 -0.022643628071984685 -0.0095465111575260397 0.023716489118315316 -0.010035843481509002 0.015264224179447616 0.025030536300323959 -0.020844367715428483 -0.019660834430787883 -0.017472009414536988 0.01981359665754381 0.012148935633757523 -0.00711522531515839 -0.014576182702767476 -0.014714930530642302 0.018824454399472307 0.011335927500632392 0.0029933536086197438 -0.0068977911210755102 -0.010109497602131222 -0.0063327578424283541 0.00081579540887199802 -0.002397847645468792 -0.016315964333306687 0.0084885607643321453 -0.0055492144819462175 0.021496175806198909 -0.0012909979307752361 0.014020527919633119 0.0035630018396204327 -0.015122358563024286 0.006885504205701074 -0.0041417837734958572 -0.015011436458766046 -0.005761405567145883 -0.013127818326387056 -0.015376432962473008 -0.017829386628788097 -0.017809135395900802 -0.021790774293025429 -0.010103031617387048 -0.021124478827621557 -0.018041443387141896 -0.019673466740297282 -0.016100038441832869 -0.02231023073356489 -0.018806755747082862 -0.019193986793949548 -0.016451150474060438 -0.0083146797659959214 -0.011872444885002888 -0.022826711300061902 -0.0083791135249385914 -0.023254200803632254 -0.0232901564100726 -0.016701346646726851 -0.015527300186549768 -0.020818547948662076 -0.014369350757304609 -0.022081502938582638 -0.024123913578035294 -0.018089673422886757 -0.024827390270318293 -0.024773073736726728 -0.024818535566066151 -0.024829264645215603 -0.024820072362026588
leaf_weight=220.94558387994766 3.5169702917337444 19.95408296585083 34.544748097658157 59.83267605304718 13.989420160651211 11.907075703144075 5.1153377443552044 9.5383910536766034 43.090632259845734 46.338730797171593 13.346185356378554 8.0144001543521899 11.723541691899298 9.3415534794330579 3.4742549657821655 33.652009591460228 23.003229379653931 8.6379837989807111 91.462246939539909 15.793591246008871 10.154873460531233 10.713798895478247 109.17880469560623 165.6027312874794 12.315709143877029 9.3132991492748243 26.394104272127155 26.798645943403244 14.551562607288359 99.74087581038475 10.499131947755812 11.948452010750771 18.146299555897716 39.519967883825302 12.413205116987227 30.058063834905624 4.2344396114349356 28.233685851097107 11.076076447963713 46.815993517637253 21.670660138130188 17.960717797279358 76.73807430267334 24.584419310092926 216.01222002506256 59.163126766681671 75.530508160591125 6.934852451086047 20.204432398080829 9.1836111545562744 15.865080118179327 4.993814140558241 4.9047536700963992 16.275083839893341 3.7419748902320853 11.111071109771727 39.702864408493042 8.0102671682834643 5.5278921723365775 7.4962652325630215 22.379256188869476 28.335541546344757 16.16664773225785 4.8375271260738355 5.1214179396629325 31.396465003490448 8.5724118053913099 11.542187452316284 8.2707177698612195 8.181750684976576 4.2736497968435279 8.804945230484007 6.6635984182357779 4.9545209854841232 9.0428659319877607 10.096725285053251 20.361412644386292 7.8584969341754922 14.855384290218351 8.5749931931495649 8.3367505669593811 23.651570379734039 7.31536537408829 3.3008995652198783 8.7635343819856626 9.4157274812459892 3.9313286244869223 5.8571478724479658 4.8740391731262189 4.4971351325511923 4.7052237391471907 3.4714619368314743 5.0121066868305189 9.5238533914089185 16.601850390434265 5.1405957937240592 4.8831025958061245 3.6148187816143027 5.0228789299726486 4.5569045245647422 4.1201496571302423 4.4503775238990766 7.7053261697292328 9.0738124847412109 8.3551489412784576 3.5624523311853409 4.4649062156677246 3.3761060982942581 4.4490940570831299 5.6898016035556793 10.681611627340315 5.2067995667457581 132.71190822124481 175.11110760271549 38.878502279520035 9.1129093170165998 14.385436773300169
leaf_count=1547 20 29 123 325 97 52 25 14 68 173 38 31 35 42 24 161 54 32 320 54 17 32 307 480 85 29 162 114 30 367 23 45 74 118 29 108 11 65 19 107 20 19 84 22 451 106 128 22 122 52 66 26 25 22 20 25 37 52 35 46 34 69 72 25 26 38 25 39 39 23 15 31 28 28 20 30 23 17 20 26 30 65 33 20 41 48 17 36 25 30 24 23 29 54 87 34 31 23 30 20 22 30 39 62 57 20 17 22 24 38 74 29 932 1229 273 64 101
internal_value=0 0.0115563 -0.0176965 -0.0209386 -0.00431623 0.0015688 0.0100451 0.0179858 0.0228395 0.00519995 0.0170699 0.0120585 0.0283691 0.00472277 -0.0122838 0.00664516 0.0113718 0.00486431 0.0072366 0.022157 0.0322741 0.0133395 0.00662999 0.0100938 -0.00943247 -0.00526639 -0.00729783 -0.00331544 0.023968 0.00165202 0.00106251 -0.00113719 -0.00297463 0.0150124 0.0259023 0.00317357 -0.012879 0.0205749 0.0143349 0.0155358 0.0213065 0.0233698 0.0213973 0.0291012 0.0147012 0.0176903 0.0136146 0.00157937 -0.0163813 -0.0100792 -0.015039 -0.00989142 -0.00965522 0.018794 -0.0207318 0.00994012 0.0228748 -0.021413 -0.0215178 -0.0188984 0.0170998 0.00935179 -0.00890617 -0.0187533 -0.0204025 0.0207944 0.00765626 -0.00101316 -0.0101372 -0.00689156 -0.0110626 -0.00220245 -0.00573834 -0.0194923 0.0112634 -0.0031434 0.0198755 0.00125792 0.0160517 0.00562249 -0.0173721 0.00822071 -0.0066986 -0.018916 -0.0075737 -0.0128918 -0.0182235 -0.0189802 -0.0189601 -0.0230207 -0.012064 -0.0231251 -0.0181034 -0.0208209 -0.0165268 -0.0234924 -0.0198803 -0.0203312 -0.0172454 -0.00740113 -0.0127457 -0.0220811 -0.00883318 -0.0237368 -0.0237644 -0.0174028 -0.0150327 -0.0213739 -0.0147874 -0.0224086 -0.0240462 -0.017954 -0.0247998 -0.0247873 -0.0248252 -0.0248206 -0.0248267
internal_weight=0 1792.63 1062.02 854.88 207.14 152.477 96.0979 891.18 338.553 901.447 76.9704 63.6242 19.7379 43.8863 263.734 766.02 209.632 556.388 474.623 102.451 47.7097 54.7411 465.985 274.782 200.965 125.64 116.326 86.6313 37.5548 191.203 107.181 96.682 135.427 552.626 32.3673 76.3968 56.3788 44.0273 520.259 408.598 329.015 180.657 134.402 46.2551 397.522 105.979 291.543 80.5309 75.3257 21.4993 52.1443 21.8554 54.8961 148.358 54.6633 111.661 116.441 62.7691 50.9213 53.8264 80.3253 100.55 81.7653 30.2889 20.9865 68.033 24.0823 56.4487 50.7533 31.012 37.9257 37.048 22.8302 9.94834 37.3784 28.243 51.7579 19.4007 57.946 15.5098 20.2852 63.1715 28.689 29.695 21.3736 26.2072 19.1275 25.9278 15.1962 35.3584 18.2411 36.8413 15.5629 29.7283 24.0981 27.4852 16.5082 11.6251 10.035 12.8276 13.5359 13.6116 12.6101 23.2297 22.3446 9.4196 9.30243 7.87324 7.96606 10.1402 14.1559 10.0808 591.145 396.057 195.089 47.9914 147.097
internal_count=11227 4602 6625 5655 970 616 365 1567 401 3035 269 231 66 165 1509 2495 631 1864 1506 252 101 151 1474 787 1096 650 621 439 84 687 379 356 540 1166 58 281 251 119 1108 811 387 182 140 42 792 213 579 264 446 137 240 106 276 205 354 297 121 413 334 309 122 272 358 134 92 83 73 191 235 123 176 135 100 54 89 104 61 56 88 48 75 183 138 182 105 138 96 162 79 240 94 251 94 176 133 188 106 75 59 59 70 91 64 160 154 56 42 52 44 68 98 54 4146 2776 1370 337 1033
cat_boundaries=0 1 2 3 4 5 6 7 8 9 10 11 12 13 14 15 16 17 18 19 20 21 22 23 24 25 26
cat_threshold=2 1 1 2 1 1 1 1 1 1 2 1 1 1 1 1 1 1 1 2 2 2 1 1 1 1
is_linear=0
shrinkage=0.05


Tree=24
num_leaves=115
num_cat=25
split_feature=2 2 3 2 0 1 2 2 2 0 3 2 2 3 2 0 2 2 2 2 2 3 3 2 2 1 2 2 2 1 2 3 1 3 2 1 2 2 2 3 2 2 2 2 2 2 2 2 3 2 2 3 1 2 1 3 2 2 3 2 0 1 2 3 2 2 2 2 1 3 3 2 1 2 2 1 3 3 2 1 2 2 2 3 2 2 2 2 2 1 2 2 3 1 2 3 3 2 1 2 2 3 2 2 3 3 2 1 3 0 1 1 0 0
split_gain=218.316 26.9019 18.2958 11.5218 7.79187 7.10768 7.19253 4.62628 11.1989 4.01304 3.26399 3.03659 2.76233 4.38736 3.65164 2.72742 2.39221 8.55383 6.89153 3.3912 3.24188 4.40206 4.09429 2.99955 3.97397 2.2834 2.44462 2.10928 4.6518 2.04111 1.84938 5.65522 3.4043 3.33089 2.89204 1.8422 1.7697 3.37443 1.58493 1.24999 1.03799 0.984071 3.5916 0.607779 0.793099 0.478563 0.475713 2.1305 0.396335 0.660883 0.205837 0.184296 0.180468 0.178495 0.232487 0.130326 0.106036 0.105883 0.105524 0.0988113 0.0823211 0.0791869 0.0746752 0.0883335 0.0668551 0.0650478 0.0581108 0.0503195 0.0489197 0.0447978 0.0422103 0.0405659 0.0402079 0.0401827 0.034969 0.0325461 0.0315311 0.0303991 0.0298853 0.0248778 0.0227287 0.0189795 0.0163071 0.0160901 0.0148219 0.0122231 0.0111894 0.00959473 0.00836233 0.00799659 0.00747057 0.00388983 0.0036059 0.00322641 0.00274288 0.00254301 0.00240127 0.00238125 0.00173309 0.00159637 0.0014172 0.00122653 0.00118318 0.00112999 0.000836299 0.000739623 0.000564586 0.000107632 7.958e-05 7.69932e-05 2.59455e-05 5.52213e-07 3.48565e-07 2.84982e-07
threshold=14.500000000000002 119.50000000000001 1.0000000180025095e-35 1.0000000180025095e-35 0 1 7.5000000000000009 314.50000000000006 318.50000000000006 2 5.5000000000000009 120.50000000000001 3.5000000000000004 1.5000000000000002 1.0000000180025095e-35 3 27.500000000000004 21.500000000000004 37.500000000000007 38.500000000000007 23.500000000000004 2.5000000000000004 1.5000000000000002 64.500000000000014 65.500000000000014 4 13.500000000000002 7.5000000000000009 4.5000000000000009 5 16.500000000000004 1.0000000180025095e-35 6 1.0000000180025095e-35 18.500000000000004 7 122.50000000000001 124.50000000000001 45.500000000000007 57.500000000000007 25.500000000000004 150.50000000000003 152.50000000000003 469.50000000000006 482.00000000000006 93.500000000000014 2.5000000000000004 1.5000000000000002 1.5000000000000002 1.0000000180025095e-35 25.500000000000004 5.5000000000000009 8 581.00000000000011 9 25.500000000000004 4.5000000000000009 4.5000000000000009 2.5000000000000004 7.5000000000000009 10 11 8.5000000000000018 4.5000000000000009 110.50000000000001 348.50000000000006 76.500000000000014 34.500000000000007 12 3.5000000000000004 8.5000000000000018 34.500000000000007 13 4.5000000000000009 66.500000000000014 14 16.500000000000004 1.5000000000000002 433.00000000000006 15 12.500000000000002 36.500000000000007 18.500000000000004 4.5000000000000009 9.5000000000000018 9.5000000000000018 1.5000000000000002 2.5000000000000004 7.5000000000000009 16 5.5000000000000009 9.5000000000000018 2.5000000000000004 17 7.5000000000000009 1.5000000000000002 1.0000000180025095e-35 16.500000000000004 18 29.500000000000004 1.5000000000000002 1.5000000000000002 23.500000000000004 12.500000000000002 3.5000000000000004 1.5000000000000002 3.5000000000000004 19 1.5000000000000002 20 21 22 23 24
decision_type=2 2 2 2 9 1 2 2 2 9 2 2 2 2 2 9 2 2 2 2 2 2 2 2 2 1 2 2 2 1 2 2 1 2 2 1 2 2 2 2 2 2 2 2 2 2 2 2 2 2 2 2 1 2 1 2 2 2 2 2 9 1 2 2 2 2 2 2 1 2 2 2 1 2 2 1 2 2 2 1 2 2 2 2 2 2 2 2 2 1 2 2 2 1 2 2 2 2 1 2 2 2 2 2 2 2 2 1 2 9 1 1 9 9
left_child=2 9 3 109 5 6 10 11 -9 38 12 -3 14 -14 -4 25 17 30 61 -20 22 40 35 29 -25 26 27 28 -5 -21 31 32 -11 34 -32 -19 -13 -38 50 48 -22 55 -43 52 -45 66 47 -27 49 -7 82 57 60 58 -55 -39 87 86 -46 90 78 67 63 -50 77 -54 72 70 -35 71 -18 -63 74 -51 -40 -68 -67 -47 -10 81 -29 99 97 85 93 -8 92 100 -59 -84 -48 -61 101 94 -58 -90 -69 -2 106 -52 107 -6 -91 -86 -64 -88 -89 -17 -87 110 -1 113 -113 -111
right_child=1 7 4 15 51 39 83 8 43 16 -12 36 13 -15 -16 56 18 20 19 23 21 -23 -24 24 -26 46 -28 80 -30 -31 33 -33 -34 68 -36 -37 37 41 45 -41 -42 42 -44 44 53 64 59 -49 62 73 79 -53 65 54 -56 -57 84 88 -60 91 -62 69 104 -65 -66 76 75 96 -70 -71 -72 -73 -74 -75 -76 -77 -78 -79 -80 -81 -82 -83 89 -85 103 108 105 98 95 102 -92 -93 -94 -95 -96 -97 -98 -99 -100 -101 -102 -103 -104 -105 -106 -107 -108 -109 -110 111 -112 112 -114 -115
leaf_value=-0.024797751344441548 -0.015054300763608641 0.042673114872134259 0.011928885915721998 -0.011112646757486444 -0.024028594185558833 -0.0018269400595985709 -0.020860384008950315 0.077858429274443294 0.016061183372182795 -0.019762163501255304 0.038320242718641796 -0.0025592239418827608 0.054252534456189716 0.0071484488775166253 -0.023590543112720509 -0.024106691281901644 -0.011508797595205913 0.014000312192923659 0.037423001127876485 -0.0025932801019526771 0.0094030911563368208 -0.016254319625683133 0.057630108681704262 0.042059441902669747 0.0086349107958132009 -0.023813010020921219 0.019212454748201886 -0.019297965881973703 0.013873514417867919 0.0079497218622365268 -0.01505514075322221 0.034250541837787835 0.016096961148961041 -0.018061097342347315 0.015760765328793308 0.03640024896981256 0.039987509938921167 0.0090070562662838676 -0.0017632027587601491 0.013194087517805046 0.02528411543849949 0.042364068315011966 0.014136726521620735 0.031839975237241226 0.015828523410005787 0.0079005860642762781 -0.021286928831552719 0.0080938863218823695 -0.022180203938872572 -0.022593572663032451 -0.0093999154933854818 -0.0098866317324704141 0.022578700101996828 0.020529943236097484 0.025346349376343447 0.014905684791558085 -0.020760432365225498 -0.019558213802110515 0.02036906361373295 -0.017342333571771767 0.018937766379138361 -0.0069887359840508688 -0.014425637440325628 -0.014564998306747437 0.010928276321021687 0.018010383242289013 -0.0012605904843346765 -0.0079009446395261439 -0.013939197833075546 -0.0099599332459507136 -0.0062152518243168212 -0.0023439959021808584 0.00079488279318712862 -0.016175922553504276 -0.0054419279223167161 0.0029101949897966241 0.020510982483254045 0.0034620201778166704 0.013479633808427264 -0.0040559229684658032 -0.014862944309101393 -0.0056512306742944997 -0.0098501046481895976 -0.015229958872859734 -0.017703463421454717 -0.017682993870780279 -0.021723836937980759 -0.022780473040538329 -0.017917869751370639 -0.012771176783837586 -0.019571030272444709 -0.015958360054198133 -0.022253398850317237 -0.01869241995365405 -0.019084778845898848 -0.016312181292322248 -0.0065224504757814402 -0.013505207572887597 -0.021045383915767546 -0.0082406967960448312 -0.023217144189213265 -0.023253889415611188 -0.011717698908312937 -0.016564459727059975 -0.015381738671592047 -0.020734174519866214 -0.022020152512755506 -0.023782466288916865 -0.017966646649957351 -0.024827342285886306 -0.024771662054786061 -0.02481826606767612 -0.024829266296193822 -0.024819840671356133
leaf_weight=215.533850684762 5.2630574554204959 9.3560684919357282 34.975317299365997 59.162366017699242 13.657021552324299 11.88483101129532 5.0093230158090618 8.6790468096733075 43.818563878536224 15.361477285623552 13.904203236103056 15.773073494434355 8.5020222663879412 11.810446321964262 9.1234965026378614 10.427012473344803 33.261797145009041 23.340844988822937 8.9901561439037305 115.2031938880682 15.948141455650328 10.539591327309607 10.815120071172712 9.197472155094145 268.37709248065948 12.02561117708683 9.5024561583995801 25.886881917715076 27.188326120376587 76.318667560815811 11.052302956581114 14.677413821220396 11.629147410392759 18.205212965607643 24.471471041440964 15.127625703811644 12.614821702241896 97.898126900196075 18.113578572869304 4.2929335534572592 28.995849937200546 11.591578871011732 405.0213183760643 19.328792989253998 18.671968936920166 6.9917356967926052 19.777407139539722 9.2608066201210022 15.516159161925321 4.8820066750049573 4.858153238892557 3.7046087384223929 16.66568511724472 65.809919059276581 40.457953810691833 10.354570508003233 7.8450267314910906 5.4202705025672904 40.662580072879791 7.3664280176162746 22.82709151506424 16.052027106285102 4.767525836825369 5.0466084182262412 8.6701409220695478 31.993084132671356 7.8483580946922302 6.9204475432634336 11.905819877982141 8.0994539558887464 4.2466713041067115 6.6476393938064566 8.8121312856674177 4.8743389993906021 10.040851563215254 11.576789230108263 20.80384373664856 8.6056004166603071 15.065131545066832 7.2851294428110149 3.2517185807228079 8.7131894081830961 4.1275546699762344 3.8713412284851065 5.7536441385745984 4.7880049347877485 4.4001990109682074 4.3499408662319166 4.9224918931722623 7.7166083604097349 9.3383172154426557 16.336700260639191 5.0271778702735892 4.792125508189204 3.5460976213216782 4.940922737121582 5.8125893920660019 4.6927678138017654 3.39889833331108 7.6410321742296219 8.8652428388595581 8.1628048717975616 4.0715226829051971 3.5034486651420593 4.3961137235164642 3.306547150015831 5.5655393302440643 3.3925198316574088 5.1134571880102158 129.45758855342865 170.82636491954327 37.925471663475037 8.8894281387329084 14.03278413414955
leaf_count=1547 29 15 123 325 97 52 25 12 68 55 38 28 31 35 42 74 161 54 32 456 54 32 17 17 770 85 29 162 114 231 51 39 36 65 89 30 27 262 74 11 65 19 794 16 20 22 122 52 66 26 25 20 22 64 34 23 52 35 48 46 34 72 25 26 25 38 17 33 44 23 15 28 31 28 30 39 23 26 20 33 20 41 21 17 36 25 30 30 29 39 54 87 34 31 23 30 26 27 23 39 62 57 22 20 17 22 38 24 29 932 1229 273 64 101
internal_value=0 0.0111351 -0.0175699 -0.0208564 -0.00423272 0.00152017 0.00968601 0.0172208 0.0217814 0.0050416 0.0163503 0.014426 0.0116078 0.0268644 0.00458036 -0.0121299 0.00643386 0.0109556 0.00471883 0.00700427 0.0211181 0.0128287 0.0304504 0.0064213 0.00974244 -0.00928799 -0.00516499 -0.00717077 -0.00324552 0.00160795 0.00103314 0.00927155 -0.00431195 -0.00419699 0.00617319 0.022809 0.0139483 0.0144327 -0.00291008 -0.0127248 0.0196488 0.0138185 0.0149221 0.0203333 0.0222557 0.00153738 -0.0162421 -0.00993169 -0.0148909 -0.00974354 -0.0095081 -0.020646 0.0179817 0.021137 0.0223636 0.00957127 -0.021339 -0.0214458 0.0189402 -0.0187853 0.0163888 -0.00876379 -0.0186383 -0.0203112 0.00740832 0.0198553 -0.000989112 -0.00998752 -0.0164313 -0.00676758 -0.0109095 -0.00562852 -0.00215262 -0.0193873 -0.00307516 0.00122507 0.0189957 0.00545167 0.0154007 -0.00657678 -0.018803 -0.00744254 -0.012737 -0.018102 -0.0188681 -0.0188477 -0.0229786 -0.0230852 -0.0179805 -0.0117441 -0.0207366 -0.0163885 -0.0234606 -0.0197809 -0.0202388 -0.0171135 -0.00727167 -0.0143241 -0.0220197 -0.00869126 -0.0237106 -0.0237388 -0.0124073 -0.0172724 -0.0148843 -0.0212992 -0.0223537 -0.0240271 -0.0178295 -0.024799 -0.0247862 -0.0248251 -0.0248204 -0.0248266
internal_weight=0 1813.62 1043.5 837.202 206.3 152.758 97.0976 907.393 344.784 906.225 78.3155 562.61 64.4113 20.3125 44.0988 260.537 771.197 212.07 559.127 478.087 104.767 55.4836 49.2836 469.096 277.575 199.097 124.992 115.489 86.3507 191.522 107.303 41.668 26.9906 65.6348 35.5238 38.4685 553.253 537.48 135.028 55.6605 44.944 524.866 416.613 336.105 184.931 80.6592 74.1053 21.2864 51.3676 21.6412 54.369 53.542 151.173 165.602 106.268 108.253 61.4395 49.8374 59.3345 52.8189 81.7108 81.0406 29.7264 20.5628 24.2675 69.4626 56.3917 50.2415 30.111 30.7991 37.5085 22.6997 36.9666 9.75635 28.1544 19.4251 52.7969 15.5973 58.8837 28.4975 29.1386 21.2124 25.8715 18.7821 25.4403 14.9108 34.5538 35.9992 15.2837 15.9157 29.1157 23.7031 26.847 16.1832 11.3911 9.86341 12.733 9.95583 13.3144 12.4992 22.6848 21.8198 11.7881 9.25709 9.16364 7.70675 9.91548 13.8195 9.90146 576.665 386.36 190.305 46.8149 143.49
internal_count=11227 4602 6625 5655 970 616 365 1567 399 3035 269 1168 231 66 165 1509 2495 631 1864 1506 252 151 101 1474 787 1096 650 621 439 687 379 130 91 249 140 84 1153 1125 540 251 119 1098 813 387 182 264 446 137 240 106 276 354 205 166 98 285 413 334 68 309 122 358 134 92 73 83 191 235 109 123 176 100 135 54 104 56 61 48 88 138 182 105 138 96 162 79 240 251 94 82 176 133 188 106 75 59 59 56 91 64 160 154 61 56 42 52 68 98 54 4146 2776 1370 337 1033
cat_boundaries=0 1 2 3 4 5 6 7 8 9 10 11 12 13 14 15 16 17 18 19 20 21 22 23 24 25
cat_threshold=2 1 1 2 1 1 1 1 1 1 2 1 1 1 2 1 2 1 1 1 2 1 1 1 1
is_linear=0
shrinkage=0.05


Tree=25
num_leaves=113
num_cat=23
split_feature=2 2 3 2 0 1 2 2 2 0 3 0 2 2 3 3 1 2 2 2 2 2 2 3 3 2 2 2 2 2 3 3 2 2 1 2 1 3 2 2 2 2 3 2 2 2 2 2 3 2 2 3 1 3 2 2 2 1 1 2 3 0 2 2 2 2 3 3 2 2 1 2 3 2 3 1 2 1 2 2 2 3 2 2 2 2 1 2 2 2 3 1 2 3 2 2 1 2 2 3 2 3 3 3 2 1 3 0 1 1 0 0
split_gain=208.855 24.7317 18.1595 11.6143 7.58437 6.7659 6.78409 4.16404 9.40534 3.78135 2.90151 2.70792 2.68417 2.51169 3.81106 3.60531 2.23966 2.30861 2.21924 7.86369 6.53402 3.06091 2.88526 4.11911 3.47302 2.80117 3.81446 2.06593 4.4259 1.96406 1.83486 2.5971 1.63942 2.99147 1.6251 1.52395 1.40176 1.20624 0.933787 0.899806 3.17336 0.543142 0.708635 0.921614 0.473279 2.07963 0.469839 0.451407 0.393731 0.648536 0.201546 0.184715 0.162353 0.12019 0.10749 0.10724 0.0994274 0.0780066 0.0772761 0.0749847 0.0889865 0.0743248 0.0620536 0.0580851 0.0553686 0.0492379 0.0435778 0.0413217 0.0405246 0.0391665 0.0384088 0.0336034 0.0319251 0.0297118 0.0284172 0.027856 0.027144 0.0240958 0.0228027 0.018452 0.0161328 0.0161298 0.0149144 0.0123194 0.0113935 0.00978029 0.0094988 0.00840383 0.00756013 0.0038897 0.00367798 0.00325567 0.00277156 0.00254715 0.00234513 0.00176546 0.0017606 0.00155915 0.0014477 0.001253 0.00113205 0.000832072 0.000750114 0.000709605 0.000574549 0.000110055 7.98815e-05 7.89187e-05 2.65927e-05 5.66344e-07 3.57422e-07 2.92129e-07
threshold=14.500000000000002 119.50000000000001 1.0000000180025095e-35 1.0000000180025095e-35 0 1 7.5000000000000009 314.50000000000006 318.50000000000006 2 5.5000000000000009 3 120.50000000000001 3.5000000000000004 1.5000000000000002 1.5000000000000002 4 13.500000000000002 27.500000000000004 21.500000000000004 37.500000000000007 38.500000000000007 23.500000000000004 2.5000000000000004 1.5000000000000002 64.500000000000014 81.500000000000014 7.5000000000000009 4.5000000000000009 48.500000000000007 6.5000000000000009 1.5000000000000002 122.50000000000001 124.50000000000001 5 45.500000000000007 6 57.500000000000007 25.500000000000004 150.50000000000003 152.50000000000003 469.50000000000006 1.0000000180025095e-35 490.00000000000006 2.5000000000000004 1.5000000000000002 600.50000000000011 93.500000000000014 1.5000000000000002 1.0000000180025095e-35 25.500000000000004 5.5000000000000009 7 22.500000000000004 4.5000000000000009 4.5000000000000009 7.5000000000000009 8 9 8.5000000000000018 4.5000000000000009 10 110.50000000000001 348.50000000000006 76.500000000000014 34.500000000000007 3.5000000000000004 8.5000000000000018 4.5000000000000009 34.500000000000007 11 66.500000000000014 2.5000000000000004 403.00000000000006 1.5000000000000002 12 433.00000000000006 13 12.500000000000002 36.500000000000007 17.500000000000004 4.5000000000000009 9.5000000000000018 9.5000000000000018 1.5000000000000002 2.5000000000000004 14 7.5000000000000009 5.5000000000000009 9.5000000000000018 2.5000000000000004 15 7.5000000000000009 1.5000000000000002 36.500000000000007 23.500000000000004 16 29.500000000000004 1.5000000000000002 1.5000000000000002 12.500000000000002 3.5000000000000004 1.5000000000000002 1.0000000180025095e-35 3.5000000000000004 17 1.5000000000000002 18 19 20 21 22
decision_type=2 2 2 2 9 1 2 2 2 9 2 9 2 2 2 2 1 2 2 2 2 2 2 2 2 2 2 2 2 2 2 2 2 2 1 2 1 2 2 2 2 2 2 2 2 2 2 2 2 2 2 2 1 2 2 2 2 1 1 2 2 9 2 2 2 2 2 2 2 2 1 2 2 2 2 1 2 1 2 2 2 2 2 2 2 2 1 2 2 2 2 1 2 2 2 2 1 2 2 2 2 2 2 2 2 1 2 9 1 1 9 9
left_child=2 9 3 107 5 6 10 12 -9 35 13 16 -3 15 -15 -4 17 27 19 30 58 -22 24 38 34 29 -27 28 -5 -23 31 36 -14 -34 -21 50 -11 48 -24 53 -41 52 46 -44 45 -18 -43 64 49 -7 80 55 61 -35 85 84 88 -45 65 60 -50 76 74 -54 70 67 69 -20 -51 -60 71 -37 -66 -65 -49 -33 -10 79 -29 97 103 83 91 -8 90 98 95 -57 -46 -58 99 92 -56 -89 -67 -82 -87 -52 105 -6 -84 -61 -86 -2 -98 -13 -85 108 -1 111 -111 -109
right_child=1 7 4 11 51 37 81 8 41 18 -12 54 32 14 -16 -17 44 -19 20 22 21 25 23 -25 -26 26 -28 78 -30 -31 -32 75 33 39 -36 47 -38 -39 -40 40 -42 42 43 57 56 -47 -48 62 59 68 77 -53 63 -55 82 87 89 -59 66 101 -62 -63 -64 73 72 94 -68 -69 -70 -71 -72 -73 -74 -75 -76 -77 -78 -79 -80 -81 86 -83 100 106 102 96 -88 93 -90 -91 -92 -93 -94 -95 -96 -97 104 -99 -100 -101 -102 -103 -104 -105 -106 -107 -108 109 -110 110 -112 -113
leaf_value=-0.024796960212513847 -0.015027364645697204 0.039853175182695523 -0.0076262447086256104 -0.010959369150892037 -0.024009122710574343 -0.0017848786139630934 -0.020776722133051678 0.070166645439200911 0.015409680003125576 -0.0025025986784565257 0.035946116764687563 -0.023757272368817351 -0.0025021568538241318 0.050076450287929411 0.0069206725081974192 0.021298534105487849 -0.023788517349665746 0.018374379685633293 -0.011354608933430075 0.013460473982134008 0.035136389765878573 0.0068207358149315264 0.0090827085833100982 -0.016113801077486774 0.053012304072867847 0.016534666622297609 0.0046337142670602538 -0.019190185107851115 0.013340279711570003 -0.0033050884453363879 0.020710438520394295 -0.018813085031547008 0.037446788495436457 0.008676439735908148 0.034211557744401544 -0.0017224967301773819 0.011283206550053906 0.012695698931040444 0.024032928465982657 0.039576940526920339 0.01358975034290905 0.031626409201965952 0.0083283570469079461 0.020003077619403793 -0.021210715672350527 0.0078284863932809538 0.021785006232876075 0.0076430199407130327 -0.022120790810956113 -0.022542484657704059 -0.0092541970638306062 -0.0097381667079876558 0.021520283874923326 0.014091488557745419 -0.020675079370026692 -0.019454106351979222 -0.017211361073983297 0.022658395191912289 -0.006863616526114791 -0.014274471347804442 -0.014414405308245729 0.01811671554766621 0.010539635853186744 0.017069396808091716 0.0034579772762083523 -0.0066382366029695359 -0.0098110958568131193 -0.0060992009352624308 -0.016034808491695626 -0.0022912286815287698 0.00077452263831777075 -0.0053361358623244997 -0.00061877967389045892 0.019424091443461428 0.0033642445368656372 -0.015018547350893261 0.012966708591350266 -0.0039714967764670336 -0.014713709421229999 -0.0055425443856212883 -0.012819309296339199 -0.015082642640809149 -0.01757618841567141 -0.017555501326772281 -0.021655636885524462 -0.020964907256830947 -0.0098000027572808079 -0.017792916246320376 -0.019467108100874386 -0.015815659213465606 -0.022195433808352396 -0.018576628312592283 -0.018974094553826922 -0.016172109195999127 -0.0080614151481698624 -0.011563157802084204 -0.022733264583151544 -0.0081034305682160697 -0.023179278715065775 -0.023216828107488985 -0.016426417237335782 -0.015235295576820303 -0.02064838023680533 -0.014062923596209399 -0.02195760823697724 -0.024089062130509851 -0.017842234290482119 -0.024827293738249046 -0.024770218226087944 -0.024817987719789738 -0.024829265964348573 -0.024819603807561152
leaf_weight=210.25482840836048 3.4133398979902294 9.763962119817732 25.818712130188942 58.508556187152863 13.332773491740232 11.863138020038607 4.9059089571237591 9.3817857503890973 44.528024733066559 46.140440210700035 14.447356283664702 3.3127892017364502 15.732758134603499 8.97602027654648 11.895175233483313 18.487107068300247 11.742628961801529 9.6867870986461622 32.881189852952957 23.66992175579071 9.3329696357250196 92.265651047229767 16.098810866475105 10.369662120938299 11.456706404685972 112.41432079672813 167.88278186321259 25.392108500003818 27.568151637911797 99.566973894834518 10.639350205659865 11.692823261022568 13.12947842478752 97.848089814186096 15.688419401645659 18.081668764352802 30.714161217212677 4.34995013475418 29.738330632448196 12.093195766210554 410.78765475749969 22.913522303104401 16.532770276069641 82.198612570762634 19.360855638980869 9.3360664844512939 25.763766467571259 7.0471932888031033 15.175796151161199 4.772941589355467 4.8127009719610232 3.6681631356477729 17.046254813671112 11.445862889289854 7.683839291334154 5.3152897357940665 7.2397781610488918 41.686133027076721 15.940234601497655 4.6992448121309263 4.9736372232437125 23.263504922389984 8.7654100954532606 28.63458788394928 8.6440171897411364 8.1527090668678266 8.0191842615604383 4.220359042286872 4.7961264252662659 6.632075458765029 8.8191385865211469 9.9863584041595441 10.804982393980024 25.174880862236023 8.6354447305202466 8.2485359013080597 15.269578874111174 7.2556414157152203 3.2037457823753348 8.6640881448984128 9.1738584935665077 3.812827616930007 5.6526810824871045 4.7040831148624402 4.3056406378746024 3.3281146138906479 4.6103540956974074 4.835076838731764 9.1573332846164686 16.078062474727631 4.9165417551994315 4.7033811360597602 3.4790626764297485 4.8609794527292252 4.4880761355161658 4.024092212319375 4.2519673705100995 7.5783234983682632 8.661787748336792 7.9751773327589026 3.4458939582109451 4.3290113508701324 3.238694429397583 4.3224659264087677 5.4443251490592957 10.178656727075575 5.0224057883024216 126.28306865692139 166.64668694138527 36.995811805129051 8.6714277267456037 13.688779324293135
leaf_count=1547 20 15 107 325 97 52 25 12 68 173 38 24 28 31 35 58 85 29 161 54 32 320 54 32 17 307 480 162 114 367 23 45 27 260 30 74 108 11 65 19 794 20 16 87 122 52 22 22 66 26 25 20 22 25 52 35 46 37 72 25 26 34 25 33 28 39 23 15 28 28 31 30 28 28 26 30 20 33 20 41 48 17 36 25 30 23 24 29 54 87 34 31 23 30 20 22 30 39 62 57 20 17 22 24 38 74 29 932 1229 273 64 101
internal_value=0 0.0107338 -0.017442 -0.0207728 -0.00415029 0.00147345 0.00934393 0.0165011 0.0207748 0.00488855 0.0156734 -0.0119759 0.0138626 0.0111797 0.0254806 0.00444295 -0.00914437 -0.005065 0.00623021 0.0105572 0.00457844 0.00678105 0.0201501 0.0123442 0.0287844 0.00622053 0.00940664 -0.007045 -0.00317682 0.00156512 0.00100125 -0.00116509 0.0134103 0.0138694 0.021732 -0.00284673 0.00300676 -0.0125705 0.0187821 0.0132877 0.0143329 0.0194239 0.0212189 0.0194168 -0.0161019 -0.00978488 0.0264176 0.00149657 -0.0147422 -0.00959645 -0.00936183 -0.0205588 0.0172186 0.00924353 -0.0212638 -0.0213725 -0.0186707 0.0208966 -0.00862244 -0.0185219 -0.0202186 0.0157188 0.00717022 0.0189768 -0.000965608 -0.00983858 -0.00664499 -0.0107568 -0.0192808 -0.00552018 -0.00210381 -0.0030082 0.00119312 0.018171 0.00528697 -0.0172435 0.0147859 -0.00645638 -0.0186887 -0.00731267 -0.012582 -0.0179792 -0.0187546 -0.0187339 -0.0229355 -0.0230445 -0.0117538 -0.0178563 -0.0206508 -0.016249 -0.0234281 -0.01968 -0.0201449 -0.0169803 -0.00714353 -0.0124363 -0.0219572 -0.00855039 -0.0236837 -0.0237126 -0.0171407 -0.0147352 -0.0212232 -0.0144885 -0.0222977 -0.0240076 -0.0177036 -0.0247983 -0.0247851 -0.024825 -0.0248201 -0.0248265
internal_weight=0 1834.09 1025.43 819.957 205.478 153.029 98.0696 923.194 352.393 910.893 79.6244 257.417 570.801 65.177 20.8712 44.3058 197.274 124.359 776.254 214.457 561.797 481.463 107.022 56.2068 50.815 472.13 280.297 114.673 86.0767 191.833 107.435 96.796 561.037 545.304 39.3583 134.639 76.8546 54.9598 45.8371 532.175 422.881 343.012 189.095 140.418 72.9147 21.0787 48.6773 80.7842 50.6099 21.4322 53.8549 52.4483 153.917 109.294 60.1425 48.7802 51.836 123.885 80.3338 29.1777 20.1494 83.0611 24.448 70.8557 56.3362 49.7423 30.5915 37.1015 9.56907 22.5723 36.8872 28.068 19.449 53.8095 15.6826 19.9414 59.7976 28.3108 28.5959 21.0551 25.5441 18.4452 24.9649 14.6324 33.7688 35.1776 17.8083 15.0113 28.5182 23.3178 26.2245 15.8663 11.1629 9.69606 12.6408 13.198 13.0244 12.391 22.1532 21.308 9.09858 9.02826 7.54434 7.73581 9.69629 13.4914 9.72649 562.541 376.902 185.639 45.6672 139.972
internal_count=11227 4602 6625 5655 970 616 365 1567 399 3035 269 1509 1168 231 66 165 1096 650 2495 631 1864 1506 252 151 101 1474 787 621 439 687 379 356 1153 1125 84 540 281 251 119 1098 813 387 182 140 446 137 42 264 240 106 276 354 205 285 413 334 309 124 358 134 92 122 73 83 191 235 123 176 54 100 135 104 56 61 48 75 88 138 182 105 138 96 162 79 240 251 94 94 176 133 188 106 75 59 59 70 91 64 160 154 56 42 52 44 68 98 54 4146 2776 1370 337 1033
cat_boundaries=0 1 2 3 4 5 6 7 8 9 10 11 12 13 14 15 16 17 18 19 20 21 22 23
cat_threshold=2 1 1 2 1 1 1 1 1 1 2 1 1 1 1 1 2 2 2 1 1 1 1
is_linear=0
shrinkage=0.05


Tree=26
num_leaves=116
num_cat=22
split_feature=2 2 3 2 0 1 2 2 2 0 3 2 2 2 3 0 2 2 2 2 2 2 3 2 2 2 2 3 1 2 2 2 1 2 2 2 2 2 3 3 2 2 2 2 2 2 2 2 1 2 3 2 2 3 2 3 1 1 3 2 3 2 2 2 2 3 1 0 2 2 2 2 2 3 2 1 2 3 3 3 2 2 1 2 2 2 2 2 2 2 1 2 2 2 2 3 1 3 2 1 2 2 2 2 3 3 2 2 1 0 1 2 1 0 0
split_gain=199.873 23.9873 19.7772 9.38667 7.79419 6.49646 5.27844 3.75687 7.97915 3.6921 2.58854 2.38234 2.28872 3.48053 3.33034 2.13861 1.86572 4.46411 8.34098 3.51591 8.31409 3.4779 5.25767 3.02967 3.6628 2.57639 3.9177 2.96877 1.92374 1.60959 1.52035 2.66198 1.35585 2.02286 4.21229 8.73438 3.97873 1.23137 1.35318 1.13931 0.82399 2.81528 0.750734 0.62038 0.486667 0.723294 0.475335 2.03017 0.43805 0.425903 0.377715 0.63623 0.233355 0.189384 0.163178 0.153429 0.262817 0.146404 0.132255 0.118019 0.110616 0.0966859 0.0953795 0.0950528 0.0948606 0.0896171 0.0753799 0.0672507 0.0576436 0.0571935 0.052782 0.0520157 0.0481587 0.0423747 0.0408572 0.0378851 0.0381835 0.0289317 0.0273653 0.0265785 0.026253 0.0246992 0.0233305 0.0228684 0.0179323 0.0179228 0.0115995 0.0112425 0.0111046 0.0099681 0.00934938 0.00809825 0.00764873 0.00653138 0.00640737 0.00375106 0.00328416 0.00282217 0.00279973 0.0017882 0.00174265 0.00165017 0.00152216 0.00147874 0.00127995 0.000760579 0.000619741 0.000584586 0.000112524 8.08983e-05 2.72621e-05 2.367e-06 5.80393e-07 3.66329e-07 2.99668e-07
threshold=13.500000000000002 119.50000000000001 1.0000000180025095e-35 1.0000000180025095e-35 0 1 7.5000000000000009 314.50000000000006 318.50000000000006 2 5.5000000000000009 120.50000000000001 3.5000000000000004 1.0000000180025095e-35 1.5000000000000002 3 64.500000000000014 27.500000000000004 21.500000000000004 81.500000000000014 78.500000000000014 65.500000000000014 1.0000000180025095e-35 37.500000000000007 38.500000000000007 23.500000000000004 24.500000000000004 1.5000000000000002 4 45.500000000000007 122.50000000000001 124.50000000000001 5 7.5000000000000009 4.5000000000000009 5.5000000000000009 1.5000000000000002 20.500000000000004 7.5000000000000009 57.500000000000007 150.50000000000003 152.50000000000003 92.500000000000014 80.500000000000014 469.50000000000006 482.00000000000006 2.5000000000000004 1.5000000000000002 6 93.500000000000014 1.5000000000000002 1.0000000180025095e-35 25.500000000000004 5.5000000000000009 883.50000000000011 1.0000000180025095e-35 7 8 1.5000000000000002 108.50000000000001 22.500000000000004 4.5000000000000009 4.5000000000000009 7.5000000000000009 8.5000000000000018 4.5000000000000009 9 10 110.50000000000001 96.500000000000014 75.500000000000014 348.50000000000006 34.500000000000007 3.5000000000000004 4.5000000000000009 11 66.500000000000014 2.5000000000000004 16.500000000000004 1.5000000000000002 17.500000000000004 433.00000000000006 12 12.500000000000002 36.500000000000007 11.500000000000002 1.5000000000000002 9.5000000000000018 84.500000000000014 2.5000000000000004 13 7.5000000000000009 5.5000000000000009 9.5000000000000018 9.5000000000000018 2.5000000000000004 14 1.5000000000000002 7.5000000000000009 15 23.500000000000004 10.500000000000002 29.500000000000004 1.5000000000000002 1.5000000000000002 1.5000000000000002 15.500000000000002 3.5000000000000004 16 17 18 11.500000000000002 19 20 21
decision_type=2 2 2 2 9 1 2 2 2 9 2 2 2 2 2 9 2 2 2 2 2 2 2 2 2 2 2 2 1 2 2 2 1 2 2 2 2 2 2 2 2 2 2 2 2 2 2 2 1 2 2 2 2 2 2 2 1 1 2 2 2 2 2 2 2 2 1 9 2 2 2 2 2 2 2 1 2 2 2 2 2 2 1 2 2 2 2 2 2 2 1 2 2 2 2 2 1 2 2 1 2 2 2 2 2 2 2 2 1 9 1 2 1 9 9
left_child=2 9 3 109 5 6 10 11 -9 29 12 -3 13 -4 -14 32 17 18 37 20 21 -18 -23 66 -25 27 -27 -20 -26 52 -13 -32 33 34 36 -36 -5 38 -11 50 60 -42 55 -22 57 -46 47 -34 59 70 51 -7 80 61 58 56 -21 67 -47 -44 -33 86 89 92 65 -52 72 81 79 -50 75 -59 -19 -68 -53 76 -31 -72 -73 -51 106 -10 84 94 102 97 95 96 -57 103 100 -63 -48 -65 -35 104 -64 -8 -98 -91 -82 -93 -54 108 -6 -88 -2 -101 -17 110 -1 -89 114 -114 -111
right_child=1 7 4 15 53 39 85 8 44 16 -12 30 14 -15 -16 62 19 23 25 42 43 22 -24 24 28 26 -28 -29 -30 49 31 40 46 83 35 -37 -38 -39 -40 -41 41 -43 48 -45 45 54 63 -49 69 68 64 74 82 -55 -56 88 -58 71 -60 -61 -62 91 87 93 -66 -67 73 -69 -70 -71 77 78 -74 -75 -76 -77 -78 -79 -80 -81 90 -83 -84 -85 -86 -87 105 111 -90 99 -92 101 -94 -95 -96 -97 98 -99 -100 107 -102 -103 -104 -105 -106 -107 -108 -109 -110 112 -112 -113 113 -115 -116
leaf_value=-0.024796150228344666 -0.015111668573179311 0.037326065921922912 0.011323420258573212 0.0031594590840453283 -0.023989194043355522 -0.0017437097856498188 -0.019413823368483903 0.063729576565666871 0.014794364119870555 0.0034469772576243098 0.033800275462817712 -0.0024462211719145331 0.046417808720052696 -0.023566047287335662 0.0067017007072048829 -0.023731501196583498 0.038252768412715389 -0.010604626094125255 0.020728647279192509 -0.0020601602069688168 0.039357747181738068 0.021593471941103941 -0.0035281538163118471 0.033066001786118425 -0.0025702509663020046 -0.015706554803058628 0.018121523968190136 0.048993218081879619 0.0076379402888309524 -0.0016826611315188819 0.035157874235502221 0.0083869870489856838 -0.023763463405822388 -0.019923467681147011 0.055332539887992888 -0.0055563742737316131 -0.023113537643920906 -0.014919107228785498 -0.018223781202050343 0.012222304682897589 0.037077721325949498 0.013071177178201243 0.0020416859112159938 0.058214492994713596 0.02918495763601018 0.015800284079889204 -0.021133144172508358 0.0075738221321276404 0.013892205317101523 0.0073957795461129482 -0.022060209294596927 -0.022490350466235678 -0.0091093933297962063 -0.0095904892975051687 0.021812933085503191 -0.0010374590049045127 0.00931121411582558 0.020533484635843535 0.019329840638456625 0.0064893071324488537 0.013546883486369968 -0.019348512828894899 -0.018459390302837348 -0.01707911053932017 -0.012822032148439702 -0.014263194091232329 -0.0054133398972245651 0.017345680919069011 0.010168818103942668 0.0094989009507590923 0.0031687560751643912 0.016494382110831082 -0.0070167454644777735 -0.0096630260086690255 -0.015892654524053293 0.00075469961548896725 -0.0056500856703105527 -0.00062496003044598507 0.018780353934570369 0.0032695539835916401 -0.012664358862143996 0.012479782790058706 -0.0038884954904155559 -0.014563771485587663 -0.00543535002846815 -0.014784492175555759 -0.02158616009792394 -0.01715131564490208 -0.0028348511758605329 -0.020883036527895318 -0.0096519917160329347 -0.017400191539545144 -0.019361699195876794 -0.015129954024792983 -0.018317681015100572 -0.022136322108610811 -0.020588297207937017 -0.017729500532263333 -0.018861935830102601 -0.022685070013357428 -0.011408869576224927 -0.015926534817663762 -0.0079673434214658761 -0.023140584746019648 -0.023178955058662756 -0.020561154226747362 -0.014340659300065168 -0.021893858235688884 -0.024071014433319465 -0.024827244770009332 -0.024768736134663339 -0.017209210782386207 -0.024817705899862905 -0.024829266420035839 -0.024819358980707723
leaf_weight=205.10524365305901 5.6885023564100283 10.160945117473601 35.561062633991241 27.108326196670532 13.016477152705198 11.841982781887056 4.4415233135223371 10.063718914985655 45.21950089931488 109.74063634872437 14.976129144430159 15.693441838026045 9.4369522333145159 8.946575775742529 11.97778335213661 3.2350137233734131 9.7524917721748334 36.704644739627838 40.225116014480591 10.82468318939209 11.258986473083498 35.248022526502609 50.908826768398285 9.6667251586914045 115.08400708436966 10.493824496865271 46.417466655373573 12.080439448356627 77.051554977893829 18.050549969077114 13.630456507205961 98.700756788253784 11.466585174202919 11.839688748121267 8.4384882152080554 19.499894231557846 30.762512415647507 11.800366997718809 7.7096192240715018 4.4055279195308676 12.581404507160185 416.40826338529587 34.039427906274796 7.1201783716678611 20.278881669044495 37.486844539642334 18.954522341489795 9.4094411134719849 8.9755263924598676 7.1012615263462093 14.843781560659414 4.6665511131286603 4.7683687061071414 3.6326152533292762 44.493824362754822 13.981916993856428 9.576570063829422 17.417070686817169 90.893298923969269 26.54840949177742 11.608293712139128 5.2128850668668729 4.6168146282434464 7.1162382066249874 5.7400946319103232 4.902459427714347 22.448099002242092 23.688803911209106 8.8582828640937787 42.419311225414276 9.2074137628078478 33.16678386926651 12.550809890031813 7.940891981124877 4.7198346704244614 8.8259719312190992 9.1330311298370344 11.065025538206099 21.629435062408447 8.6645454466342908 9.0570064485073072 15.468864560127257 7.2268828302621868 3.1569519639015189 8.6161998361349088 4.8975997120141974 4.2134016156196585 3.8509279042482367 22.296664327383041 3.2590672373771667 4.5653933435678509 4.7464364320039749 8.9807907342910749 10.851808071136473 13.069786280393599 4.8086189329624167 7.526606351137163 5.6514649987220764 3.4136731624603271 4.1563966870307905 3.9778289049863806 3.1672976911067963 7.5171611309051514 8.4633234143257141 7.7921516597270957 3.1725063472986221 4.8103140443563461 5.3260831832885742 9.9363922178745252 123.18640422821045 162.56952808797359 3.2599576711654663 36.088949114084244 8.4587736129760724 13.353211641311644
leaf_count=1547 32 15 123 116 97 52 28 12 68 390 38 28 31 42 35 24 17 176 84 36 33 94 145 32 456 36 115 17 231 74 27 260 85 77 33 81 209 44 14 11 19 794 108 18 16 36 122 52 23 22 66 26 25 20 35 42 26 22 95 80 25 35 31 46 34 26 100 34 25 111 30 38 59 23 28 31 27 29 23 26 48 20 33 20 41 31 30 25 54 23 24 31 54 68 85 34 52 26 23 30 22 20 39 62 57 22 28 38 74 932 1229 21 273 64 101
internal_value=0 0.0101689 -0.0176554 -0.0212024 -0.00347845 0.0023112 0.00998566 0.0158231 0.0198352 0.00452321 0.0150355 0.013329 0.0107725 0.00431021 0.0242036 -0.0129027 0.00581828 0.00404015 0.00907348 0.00908553 0.0158564 0.00995287 0.00674947 -0.000224543 0.00303446 0.0192462 0.011884 0.0272566 0.00152351 -0.00305894 0.0129002 0.0133357 -0.0102376 -0.00692054 -0.00310932 0.0128345 -0.0108065 0.000477554 0.00202447 -0.0120842 0.0127842 0.0137752 0.00449751 0.0466629 0.0185721 0.0202515 -0.0158941 -0.00963882 0.00687075 0.00145691 -0.0143765 -0.00945019 -0.00955681 -0.0205824 0.0192036 -0.000191329 0.00327769 0.0165007 0.0182992 0.00399055 0.00892999 -0.021448 -0.0213426 -0.0187389 -0.0184798 -0.0201244 -0.00848216 0.0150863 0.00694145 0.0102661 -0.000942638 0.0181533 -0.0096904 -0.00652382 -0.0191728 -0.00209151 -0.00301562 0.00109808 0.0173967 0.0051281 -0.0127796 0.0142044 -0.00633741 -0.0185728 -0.00718413 -0.0172664 -0.0228916 -0.0188249 -0.00214213 -0.0230029 -0.0115992 -0.0178183 -0.0205637 -0.0159019 -0.0190809 -0.0233949 -0.0195777 -0.0184707 -0.0200496 -0.0218934 -0.0122812 -0.0168104 -0.00841061 -0.0236563 -0.0236858 -0.0211459 -0.0147584 -0.0222407 -0.0239876 -0.0247975 -0.024784 -0.0171779 -0.0248249 -0.0248199 -0.0248265
internal_weight=0 1878.59 983.233 786.461 196.772 147.009 95.8891 938.591 359.807 939.999 80.8985 578.784 65.9224 44.5076 21.4147 237.699 802.865 519.914 238.467 282.951 114.289 95.9093 86.1568 281.447 201.802 109.217 56.9113 52.3056 192.136 137.134 568.623 552.929 180.655 113.876 85.8092 27.9384 57.8708 129.251 117.45 51.1202 539.299 428.99 168.663 18.3792 349.743 193.153 66.7794 20.876 111.983 80.9061 46.7147 21.2284 56.2277 49.7624 172.874 56.6798 20.4013 156.59 128.38 60.5878 110.309 46.1298 57.0443 45.9034 25.4863 19.7462 79.6444 84.3772 24.6241 51.3948 56.282 72.2133 49.2555 30.389 9.38639 36.0096 27.1836 20.2724 54.7962 15.7658 28.099 60.6884 28.1286 28.0664 20.9017 14.9906 33.0032 22.668 36.2786 34.3763 17.6002 13.1266 27.9353 17.968 24.9095 25.6172 15.5571 10.093 10.9403 12.7415 13.0348 7.91373 12.2855 21.6347 20.8086 7.38591 10.4988 9.48248 13.1714 548.762 367.675 7.11089 181.087 44.5477 136.54
internal_count=11227 4687 6540 5597 943 597 354 1567 399 3120 269 1168 231 165 66 1451 2564 1777 700 787 307 256 239 1077 719 252 151 101 687 556 1153 1125 1048 621 439 114 325 448 404 243 1098 813 480 51 387 182 427 137 322 264 232 106 292 346 166 158 62 205 131 188 285 326 403 290 126 92 358 122 73 134 191 83 235 123 54 132 101 59 61 48 154 88 138 182 105 85 240 152 96 251 94 86 176 114 162 188 106 54 75 91 70 51 64 160 154 52 60 68 98 4146 2776 46 1370 337 1033
cat_boundaries=0 1 2 3 4 5 6 7 8 9 10 11 12 13 14 15 16 17 18 19 20 21 22
cat_threshold=2 1 1 2 1 1 1 1 1 1 2 1 1 1 2 2 2 2 1 1 1 1
is_linear=0
shrinkage=0.05


Tree=27
num_leaves=116
num_cat=23
split_feature=2 2 3 2 0 1 2 0 2 2 3 3 0 2 2 2 2 2 2 2 2 3 2 2 2 3 3 2 2 2 2 1 2 2 2 2 2 3 3 2 2 2 2 2 2 2 2 1 2 3 2 2 3 2 1 3 1 1 2 3 3 2 2 2 2 3 1 0 2 2 2 2 2 3 2 1 2 1 2 2 3 3 2 1 2 2 2 2 3 2 1 2 2 2 2 3 1 3 1 2 2 2 2 2 3 2 3 2 2 1 0 1 1 0 0
split_gain=191.431 22.1183 19.6247 9.47202 7.57491 6.17406 4.97997 3.48363 3.39735 6.82779 2.46824 14.6754 2.12662 2.12229 2.08968 1.73965 4.18769 7.69952 3.24049 7.33947 3.1264 4.87503 2.89748 3.35139 2.30793 3.76188 2.55471 1.85479 1.54811 1.41135 2.37697 1.33244 1.97913 4.00665 7.79129 3.90372 1.18597 1.30388 1.09923 0.755634 2.50689 0.705868 0.508156 0.472582 1.98205 0.43728 0.641028 0.407695 0.401943 0.374871 0.623972 0.228456 0.189746 0.154004 0.191826 0.14574 0.247266 0.132317 0.110808 0.102267 0.102202 0.0979003 0.0966756 0.0955774 0.0950234 0.0902245 0.0735004 0.0609743 0.0535885 0.0525498 0.0503764 0.0470823 0.0467048 0.0411899 0.0411801 0.0350682 0.0310815 0.0300455 0.0259746 0.0258952 0.0248716 0.0239155 0.0229256 0.0225819 0.0179371 0.0174206 0.0118075 0.0113099 0.0110508 0.0101582 0.00919806 0.00813292 0.00773624 0.0065208 0.00645645 0.00382514 0.00362773 0.00283892 0.00181586 0.00171934 0.00165085 0.0015103 0.00150545 0.00148541 0.00130737 0.00114527 0.000771008 0.000616311 0.000594704 0.000115043 8.29239e-05 2.79434e-05 5.94891e-07 3.75457e-07 3.06964e-07
threshold=13.500000000000002 119.50000000000001 1.0000000180025095e-35 1.0000000180025095e-35 0 1 7.5000000000000009 2 314.50000000000006 318.50000000000006 29.500000000000004 5.5000000000000009 3 120.50000000000001 3.5000000000000004 64.500000000000014 27.500000000000004 21.500000000000004 81.500000000000014 78.500000000000014 65.500000000000014 1.0000000180025095e-35 37.500000000000007 38.500000000000007 23.500000000000004 2.5000000000000004 1.5000000000000002 48.500000000000007 45.500000000000007 122.50000000000001 124.50000000000001 4 7.5000000000000009 4.5000000000000009 5.5000000000000009 1.5000000000000002 20.500000000000004 7.5000000000000009 57.500000000000007 150.50000000000003 152.50000000000003 92.500000000000014 80.500000000000014 2.5000000000000004 1.5000000000000002 469.50000000000006 482.00000000000006 5 93.500000000000014 1.5000000000000002 1.0000000180025095e-35 25.500000000000004 5.5000000000000009 581.00000000000011 6 1.0000000180025095e-35 7 8 108.50000000000001 2.5000000000000004 25.500000000000004 4.5000000000000009 4.5000000000000009 7.5000000000000009 8.5000000000000018 4.5000000000000009 9 10 110.50000000000001 96.500000000000014 76.500000000000014 34.500000000000007 348.50000000000006 3.5000000000000004 4.5000000000000009 11 66.500000000000014 12 17.500000000000004 403.00000000000006 1.5000000000000002 23.500000000000004 12.500000000000002 13 11.500000000000002 36.500000000000007 1.5000000000000002 8.5000000000000018 2.5000000000000004 2.5000000000000004 14 7.5000000000000009 5.5000000000000009 9.5000000000000018 9.5000000000000018 2.5000000000000004 15 1.5000000000000002 16 23.500000000000004 10.500000000000002 1.5000000000000002 6.5000000000000009 29.500000000000004 1.5000000000000002 10.500000000000002 1.5000000000000002 15.500000000000002 3.5000000000000004 17 18 19 20 21 22
decision_type=2 2 2 2 9 1 2 9 2 2 2 2 9 2 2 2 2 2 2 2 2 2 2 2 2 2 2 2 2 2 2 1 2 2 2 2 2 2 2 2 2 2 2 2 2 2 2 1 2 2 2 2 2 2 1 2 1 1 2 2 2 2 2 2 2 2 1 9 2 2 2 2 2 2 2 1 2 1 2 2 2 2 2 1 2 2 2 2 2 2 1 2 2 2 2 2 1 2 1 2 2 2 2 2 2 2 2 2 2 1 9 1 1 9 9
left_child=2 7 3 110 5 6 10 28 13 -10 11 14 31 -3 -4 16 17 36 19 20 -17 -22 66 -24 26 -26 -19 -25 51 -15 -31 32 33 35 -35 -5 37 -9 49 60 -41 55 -21 44 -33 57 -47 58 70 50 -7 78 61 59 -55 56 -20 67 -43 -48 -32 86 89 92 65 -51 71 81 80 -49 75 -18 -59 -68 -52 76 -30 -72 107 -74 -50 -11 94 85 97 103 95 96 -57 101 -80 -63 -45 -65 -34 104 102 -8 -91 -92 -93 109 -64 -53 -6 -89 -88 -2 -100 -14 111 -1 114 -114 -112
right_child=1 8 4 12 52 38 84 15 9 45 -12 -13 62 29 -16 18 22 24 41 42 21 -23 23 27 25 -27 -28 -29 48 30 39 43 82 34 -36 -37 -38 -39 -40 40 -42 47 -44 63 -46 46 53 69 68 64 74 83 -54 54 -56 88 -58 72 -60 -61 -62 91 87 93 -66 -67 73 -69 -70 -71 77 -73 79 -75 -76 -77 -78 -79 90 -81 -82 -83 -84 -85 -86 -87 106 105 -90 98 99 100 -94 -95 -96 -97 -98 -99 108 -101 -102 -103 -104 -105 -106 -107 -108 -109 -110 -111 112 -113 113 -115 -116
leaf_value=-0.024795318283505369 -0.014963704299564159 0.035048817288897999 0.0041820700180104867 0.0030711696083794721 -0.023968796876466948 -0.0017034205782161024 -0.019307661976031076 0.0033496775825942165 0.058261840540646828 0.01298523194101734 -0.010503539050203955 0.088345544392234437 -0.023705137488398476 -0.0023914000773469601 0.023021778470633223 0.035885277169424579 -0.010452976557509382 0.019794013707024896 -0.0020132037958524298 0.03688056038023662 0.020601788818456982 -0.0034528674360411616 0.031182939166446568 0.0065565707378497989 0.017393334120513967 -0.016013543923733709 0.045463585174187242 -0.0032664784033561052 -0.0016436804511946489 0.033085497696213405 0.0081330068560899697 -0.023737833432739289 -0.019824747042056726 0.051017471611903731 -0.0054489878096379302 -0.02307341972100984 -0.014770148123634051 -0.018102300205218285 0.011772205214145702 0.034824382314873691 0.01257899735082477 0.0019868798335471488 0.053518163924076129 -0.021054201202927336 0.0073293328116117292 0.027631335970066163 0.013414513828689814 0.013357998077811016 0.0071583293476522869 -0.021998444818145026 -0.02243715101669639 -0.0089655407855222975 -0.0094436388840085008 0.017849859286950268 0.022085380997804115 -0.00063808690600873164 0.0089948001724870098 0.019611526872648249 0.0062867292548730892 0.017750745005926234 0.013250654549535508 -0.019241436741807089 -0.020806530119508313 -0.016945609429407114 -0.012667083894331455 -0.014111408226560969 -0.0053079496158514733 0.016620435699399444 0.0098147320432694363 0.0091743650698006673 0.0027456755744408728 -0.0068913203047773434 0.015656740052913592 -0.009515763780886366 -0.015749493673026308 0.00073539869079324504 -0.0051328332814523925 -0.0012570578016943982 -0.0095047916131832926 0.017816066519518746 0.0031778334184546838 0.015106522049129718 -0.01441317374145543 -0.0038069089235687505 -0.014634882027942608 -0.0053296504599814522 -0.021515392499684927 -0.017898745888900554 -0.0026178465524486359 -0.020799760025679351 -0.012509318298767978 -0.017269793208518021 -0.019254807337688456 -0.014982087527829048 -0.018197305021079548 -0.022076045432152289 -0.01840557321714242 -0.017602502665154264 -0.022635873849467011 -0.011254881278754148 -0.015783610342803324 -0.023101053981731803 -0.019519919441663217 -0.0078324618304289797 -0.023140255940604156 -0.01677268566312904 -0.020472488819053915 -0.014189162062865314 -0.021828881379404624 -0.024052540944067263 -0.024827192689311703 -0.024767217745145995 -0.024817415134254492 -0.024829265000113846 -0.024819111811475374
leaf_weight=200.08196133375168 5.6031858623027819 10.547380268573759 44.704229414463043 27.194109916687012 12.707938417792326 11.821352124214174 4.3561279177665693 110.11956198513508 10.725953161716459 42.154313206672668 8.8533441722393018 6.6376343667507163 3.1591458320617676 15.655099064111708 21.94364507496357 10.132778525352476 36.317462280392647 41.067630022764206 10.802405565977097 11.710950672626497 36.017426550388336 50.729529142379761 9.9917087852954847 93.042224451899529 47.344846859574318 10.251733168959616 12.687037408351896 99.388691559433937 18.020202547311786 14.118198215961455 100.49405866861343 11.197311356663704 11.606135338544851 8.9185703694820422 19.391846537590027 30.059635281562805 11.625622779130934 7.5703933238983145 4.4597040414810172 13.056650519371031 421.88693785667419 34.108997225761414 7.5469784438610068 18.558157533407215 9.4809769988059998 20.879440903663635 19.850574195384979 9.10108634829521 7.1539756357669857 14.519909933209425 4.5627702474594098 4.7251289188861865 3.5979432165622702 69.942527651786804 43.270127058029175 9.5882028043270093 9.6661561727523804 17.778400957584381 26.721250355243683 43.162992715835571 10.804600924253462 5.1129927486181241 4.806926906108858 6.9957306981086758 5.6669646650552741 4.8330310583114615 22.326908558607105 24.103286981582642 8.9488207995891553 42.824167400598526 11.645859479904175 12.463052079081534 29.633719444274902 7.8645286858081809 4.6454168707132339 8.8326352238655073 9.8832813203334791 7.8471818864345559 4.5215401947498322 26.124148547649384 8.6929210126399976 19.402276337146759 3.1113079190254203 7.1988356113433865 4.8257239013910285 8.5694947540760023 4.1234251111745825 4.6139698773622495 26.612761646509171 3.191713884472847 8.9430286288261431 4.6645618230104446 8.8085794150829297 10.688857138156889 12.832557410001753 4.703343302011489 4.0882160961627951 5.5521504133939743 4.0631698071956617 3.932704269886016 3.1172531098127365 8.269725114107132 4.3140714168548584 7.4575074464082718 7.6136148869991294 4.422086238861084 3.1079419553279877 4.7418232411146164 5.2107420861721039 9.7000689804553968 120.16567873954773 158.59234277904034 35.204326272010803 8.2513341903686506 13.025871887803076
leaf_count=1547 32 15 165 116 97 52 28 390 12 61 16 22 24 28 66 17 176 84 36 33 94 145 32 320 119 32 17 367 74 27 262 85 77 33 81 209 44 14 11 19 794 108 18 122 52 16 20 23 22 66 26 25 20 64 34 31 26 22 80 48 23 35 34 46 34 26 100 34 25 111 39 59 33 23 28 31 30 17 24 28 26 27 20 33 31 41 30 31 65 23 48 31 54 68 85 34 28 26 30 22 20 62 30 39 57 29 22 28 38 74 932 1229 273 64 101
internal_value=0 0.00981223 -0.0175284 -0.0211249 -0.0034087 0.00224257 0.00963211 0.00438821 0.0151837 0.0189565 0.0144335 0.0174461 -0.0127494 0.0128229 0.010385 0.00563769 0.00392141 0.00876365 0.00877535 0.0152086 0.00960447 0.00653465 -0.000219982 0.00294907 0.0184013 0.0114472 0.0258525 0.00148306 -0.00299276 0.0124159 0.0128296 -0.0100899 -0.00679998 -0.00304712 0.0123395 -0.0106554 0.000464842 0.00196978 -0.01193 0.0123061 0.0132468 0.00436552 0.0434007 -0.0157514 -0.00949357 0.0177732 0.0193474 0.00665348 0.00141837 -0.0142255 -0.00930478 -0.00941026 -0.0204941 0.018366 0.0194687 -0.000186847 0.00318526 0.0158242 0.0038757 0.0163847 0.00862982 -0.0213747 -0.0212674 -0.0186237 -0.0183614 -0.0200288 -0.00834296 0.0144886 0.00672154 0.00990764 -0.000920195 -0.009543 0.01738 -0.00640404 -0.0190633 -0.00201037 -0.00287952 0.00113432 -0.0126246 0.0166684 0.0049748 0.0136539 -0.0184556 -0.00621988 -0.0171347 -0.00705693 -0.0228467 -0.0187108 -0.00209349 -0.0229604 -0.0114449 -0.0176923 -0.020475 -0.0157588 -0.0189702 -0.023361 -0.0196432 -0.0183522 -0.0218284 -0.0121262 -0.0166745 -0.0236282 -0.020198 -0.00827194 -0.0236584 -0.0173477 -0.0210672 -0.0146087 -0.0221824 -0.0239672 -0.0247967 -0.0247829 -0.0248247 -0.0248197 -0.0248264
internal_weight=0 1897.93 966.136 770.005 196.131 147.382 96.8729 944.342 953.591 367.028 82.1389 73.2855 234.684 586.563 66.6479 807.624 522.061 240.667 285.563 116.138 96.8797 86.747 281.395 202.423 111.351 57.5966 53.7547 192.431 136.718 576.016 560.36 178.844 113.114 85.5642 28.3104 57.2537 129.316 117.69 50.5091 546.242 434.944 169.425 19.2579 65.7296 20.6783 356.302 197.106 112.756 81.0249 46.0494 21.0295 55.6932 48.749 176.226 113.213 56.6695 20.4686 159.196 60.8302 63.0136 111.299 45.1511 55.8398 45.0513 25.0199 19.3529 78.972 85.6599 24.7957 51.9253 56.2292 48.7805 73.5363 30.1914 9.20819 36.7361 27.9035 19.493 27.7423 55.7579 15.8469 61.5566 27.55 27.951 14.734 20.7521 32.2563 22.2453 36.201 33.5946 17.3973 12.8948 27.3667 17.6846 24.4387 25.0249 13.2092 9.90828 12.4656 12.8757 7.78181 21.1289 9.121 12.1826 20.3216 9.03606 7.23137 10.345 9.27391 12.8592 535.322 358.674 176.647 43.4557 133.192
internal_count=11227 4687 6540 5597 943 597 354 3120 1567 399 269 253 1451 1168 231 2564 1777 700 787 307 256 239 1077 719 252 151 101 687 556 1153 1125 1048 621 439 114 325 448 404 243 1098 813 480 51 427 137 387 182 322 264 232 106 292 346 166 98 158 62 205 188 68 285 326 403 290 126 92 358 122 73 134 191 235 83 123 54 135 104 56 154 61 48 88 182 138 85 105 240 152 96 251 94 86 176 114 162 188 92 54 91 70 51 160 64 64 154 60 52 60 68 98 4146 2776 1370 337 1033
cat_boundaries=0 1 2 3 4 5 6 7 8 9 10 11 12 13 14 15 16 17 18 19 20 21 22 23
cat_threshold=2 1 1 2 1 1 1 1 1 1 2 1 1 1 2 1 2 2 2 1 1 1 1
is_linear=0
shrinkage=0.05


Tree=28
num_leaves=115
num_cat=22
split_feature=2 2 3 2 0 1 2 0 2 2 3 3 0 2 2 2 2 2 2 2 2 3 2 2 2 2 3 1 2 2 2 1 2 2 2 2 3 3 3 1 2 2 2 2 2 2 2 3 3 2 2 2 1 3 2 2 2 3 3 2 3 1 2 2 2 2 2 3 1 2 3 1 2 2 3 1 3 2 2 2 2 2 1 2 2 2 2 2 1 2 2 2 2 3 2 1 2 3 3 1 2 2 2 3 3 2 2 1 0 1 2 1 0 0
split_gain=183.398 20.4184 19.4664 9.55601 7.36015 5.86755 4.70094 3.2879 3.07872 5.88642 2.29551 12.3782 2.11394 1.91228 1.89704 1.62321 3.93024 7.11615 2.99032 6.50789 2.81894 4.52547 2.77091 3.0728 2.07329 3.58264 2.21189 1.81396 1.49164 1.31141 2.12921 1.30894 1.93583 3.81255 6.98367 3.82973 1.18006 2.93307 1.06072 0.695586 0.981487 0.663917 0.469655 1.93522 0.443642 0.440711 0.420828 0.41077 0.46362 1.28886 2.55027 0.7394 0.37971 0.371893 0.611769 0.318921 0.5834 0.19005 0.182669 0.139892 0.138443 0.23272 0.104078 0.0991057 0.0979665 0.0960715 0.0951513 0.0908077 0.0716383 0.0673586 0.0518145 0.0500912 0.0460102 0.0414928 0.0400231 0.0352218 0.0271157 0.0256872 0.0236435 0.0229742 0.0202783 0.0179442 0.0149062 0.0120172 0.0113843 0.0106483 0.0105434 0.0103505 0.00904502 0.00816472 0.00782263 0.00650744 0.00650376 0.0039002 0.00357802 0.0033412 0.00285644 0.00285476 0.00248436 0.00184356 0.00169554 0.00165085 0.00154241 0.00133526 0.000781396 0.000612622 0.00060489 0.00011761 8.50029e-05 2.86423e-05 2.92792e-06 6.09938e-07 3.84817e-07 3.14775e-07
threshold=13.500000000000002 119.50000000000001 1.0000000180025095e-35 1.0000000180025095e-35 0 1 7.5000000000000009 2 314.50000000000006 318.50000000000006 29.500000000000004 5.5000000000000009 3 3.5000000000000004 120.50000000000001 64.500000000000014 27.500000000000004 21.500000000000004 81.500000000000014 78.500000000000014 65.500000000000014 1.0000000180025095e-35 37.500000000000007 38.500000000000007 23.500000000000004 24.500000000000004 1.5000000000000002 4 38.500000000000007 122.50000000000001 124.50000000000001 5 7.5000000000000009 4.5000000000000009 5.5000000000000009 1.5000000000000002 6.5000000000000009 1.5000000000000002 57.500000000000007 6 204.50000000000003 92.500000000000014 2.5000000000000004 1.5000000000000002 93.500000000000014 151.50000000000003 80.500000000000014 165.50000000000003 1.0000000180025095e-35 471.50000000000006 417.50000000000006 609.50000000000011 7 1.5000000000000002 1.0000000180025095e-35 490.00000000000006 456.50000000000006 5.5000000000000009 17.500000000000004 25.500000000000004 1.0000000180025095e-35 8 108.50000000000001 4.5000000000000009 4.5000000000000009 7.5000000000000009 8.5000000000000018 4.5000000000000009 9 75.500000000000014 1.5000000000000002 10 34.500000000000007 4.5000000000000009 3.5000000000000004 11 2.5000000000000004 17.500000000000004 66.500000000000014 12.500000000000002 109.50000000000001 11.500000000000002 12 1.5000000000000002 9.5000000000000018 84.500000000000014 55.500000000000007 2.5000000000000004 13 7.5000000000000009 5.5000000000000009 9.5000000000000018 9.5000000000000018 2.5000000000000004 29.500000000000004 14 7.5000000000000009 1.5000000000000002 1.5000000000000002 15 23.500000000000004 10.500000000000002 1.5000000000000002 1.5000000000000002 1.5000000000000002 15.500000000000002 3.5000000000000004 16 17 18 11.500000000000002 19 20 21
decision_type=2 2 2 2 9 1 2 9 2 2 2 2 9 2 2 2 2 2 2 2 2 2 2 2 2 2 2 1 2 2 2 1 2 2 2 2 2 2 2 1 2 2 2 2 2 2 2 2 2 2 2 2 1 2 2 2 2 2 2 2 2 1 2 2 2 2 2 2 1 2 2 1 2 2 2 1 2 2 2 2 2 2 1 2 2 2 2 2 1 2 2 2 2 2 2 1 2 2 2 1 2 2 2 2 2 2 2 1 9 1 2 1 9 9
left_child=2 7 3 108 5 6 10 28 14 -10 11 13 31 -4 -3 16 17 36 19 20 -17 -22 68 -24 26 -26 -19 -25 59 -16 -31 32 33 35 -35 -5 37 -9 53 40 -32 60 43 -33 69 -41 -21 48 49 50 -11 -51 62 54 -7 56 -50 63 -57 77 61 -20 -43 83 87 90 67 -55 72 75 -54 -46 -18 -56 -70 78 -71 105 -30 92 -73 97 94 93 95 -62 -77 102 100 -65 -44 -67 -34 103 -61 96 -66 -8 -96 -89 -79 -91 107 -6 -85 -2 -101 -14 109 -1 -86 113 -113 -110
right_child=1 8 4 12 57 38 81 15 9 47 -12 -13 64 -15 29 18 22 24 41 46 21 -23 23 27 25 -27 -28 -29 44 30 39 42 79 34 -36 -37 -38 -39 -40 45 -42 52 65 -45 71 -47 -48 -49 55 51 -52 -53 70 66 73 58 -58 -59 -60 82 85 -63 -64 89 84 91 -68 -69 74 76 -72 80 -74 -75 -76 86 -78 88 -80 -81 -82 -83 -84 104 110 -87 -88 99 -90 101 -92 -93 -94 -95 98 -97 -98 -99 -100 106 -102 -103 -104 -105 -106 -107 -108 -109 111 -111 -112 112 -114 -115
leaf_value=-0.024794466930428437 -0.014814969114350166 0.032986515275624441 0.0040609962971992651 0.0029856139847498978 -0.023947923572274609 -0.001663993871059925 -0.019200016965269528 0.0027824955332608715 0.053559124273658457 0.016065340022833136 -0.010352275082183594 0.078775992427627256 -0.024033631550901872 0.021932746228160799 -0.0023376780254039222 0.033745146816299185 -0.010301913976217172 0.01891942414569249 -0.0019672241691756501 0.034646124686404239 0.019675403145273079 -0.0033789299503847489 0.029463263953770885 -0.002545876747405508 -0.015603588161165383 0.016802856748375974 0.042339379046840105 0.0073418471516256637 -0.0024377040380911558 0.031200709395010802 0.0080520868821402896 -0.0237116147013938 -0.019724544398328714 0.047245010828570147 -0.0053430977380951074 -0.023032435504981616 0.015154328623130188 -0.01724254007862908 0.011343851240466642 0.018422733202170197 0.013482828284494109 0.0019336522064289374 -0.020973877814113348 0.0070944957561453227 0.010112813787673433 0.01289621179551975 0.049435380894726849 0.023380992063149194 0.015397101022972337 0.0079440587032112257 0.04109153269646687 0.020139422934529472 0.011339344707869306 -0.021935481527620079 -0.022382872154072309 0.019930371984821647 0.0069936785211660128 -0.0092976541487480146 0.015799609917029774 -0.0088226744297628217 -0.00096278802216606554 0.0086919240290909746 0.0060917251634185331 -0.019132878136556911 -0.020411038894916911 -0.016810876663986788 -0.012512044873488351 -0.013959092135780744 -0.0052040563627425256 0.0030447032119777996 0.0081729270909160177 0.0037956313589780212 -0.0067672774673956859 -0.0156053593584186 -0.0093693485436005721 -0.0015352561933387001 -0.00062362295090005856 -0.012354236237779538 -0.0054421589315938436 -0.014261958082392126 0.007247521198146839 -0.014484591644947987 -0.0043964309970815994 -0.02144332143261788 -0.01688031195160174 -0.0027262385165434254 0.0014930007470706928 -0.02071506995352038 -0.0093584412324985902 -0.017138108609057155 -0.019146432040711366 -0.014833445313469185 -0.018075516467125925 -0.022014588180479314 -0.0077827601258408756 -0.018220511546786482 -0.018633255711222447 -0.017474167695621469 -0.0061798010842177755 -0.022585658626094043 -0.011101240218882806 -0.015639704541165571 -0.02306066568416203 -0.023100713659839903 -0.020382375315797882 -0.014037111813786944 -0.021762665971076681 -0.023678170104415319 -0.024827142010899042 -0.024765662465403709 -0.016945816551627996 -0.024817118294772005 -0.024829264795964916 -0.024818856784408719
leaf_weight=195.18186941742897 5.51996558904648 10.923607885837553 44.891578286886215 27.277755439281464 12.406965702772149 11.801232099533083 4.2728280127048475 94.350617617368698 11.369430065155028 25.668883144855499 8.7608395814895612 7.2507228553295127 9.4695414602756518 22.454686254262924 15.617706090211867 10.502999126911162 35.939812690019608 41.888622045516968 10.78068020939827 12.150920361280443 36.767146617174149 50.5546695291996 10.308188468217848 114.95812398195267 10.376704424619673 47.887705475091934 13.277148067951201 77.760713815689087 23.789838254451752 14.593118935823439 189.50852736830711 10.93464158475399 11.378311991691595 9.3853795230388659 19.286467507481575 29.373997181653976 12.346447318792341 22.681739211082458 4.512514889240264 45.836875796318054 148.30434602499008 34.176834970712662 18.171514749526981 9.5507214069366455 6.958512544631958 169.36040335893631 7.9618824124336234 23.737325727939606 108.65419417619705 24.48272967338562 16.870016515254974 25.244241714477539 23.057837665081024 14.203982040286069 4.4615346193313581 43.849766433238983 25.500824153423309 3.5641254633665076 68.685390472412109 4.6829549819231042 13.938171267509459 9.7534932494163513 26.889768362045288 5.0155518501996976 7.2246401011943817 6.8781829774379757 5.5956334620714179 4.7653090804815283 22.208711639046673 9.2483912110328692 29.384496599435806 11.10912618041039 12.377460360527037 4.5728270262479782 7.790046513080596 5.8577070534229261 11.064414292573927 8.8318542838096601 9.0350795090198499 3.0667856335639945 6.8954041898250571 4.7556141912937155 4.5092975050210962 4.0356554836034766 3.7196384221315375 22.18709996342659 5.6436111032962799 3.1260125637054443 4.4787674993276623 4.5846975296735764 8.640594542026518 10.52990937232971 12.601151093840597 4.600650042295455 6.135488033294676 4.4499358981847772 3.2876816540956497 5.4552737921476364 3.988549530506134 3.9722295105457288 3.8886902928352347 3.0684378743171692 8.0808755159378052 7.4394574463367453 3.0449615567922592 4.6750157475471497 5.0982299447059631 3.0851386785507176 117.21903121471405 154.71269531548023 3.1510392874479294 34.341398164629936 8.048982620239256 12.706559896469114
leaf_count=1547 32 15 165 116 97 52 28 336 12 33 16 22 74 66 28 17 176 84 36 33 94 145 32 456 36 115 17 231 102 27 464 85 77 33 81 209 26 86 11 95 262 108 122 52 18 277 18 21 142 21 18 20 59 66 26 44 24 20 64 25 42 26 80 35 52 46 34 26 100 30 75 35 59 28 23 24 29 48 27 20 20 31 21 30 25 54 19 23 24 31 54 68 85 34 32 31 23 26 20 30 22 20 62 57 22 28 38 24 932 1229 21 273 64 101
internal_value=0 0.00947165 -0.0174002 -0.021046 -0.00334122 0.00217431 0.00929092 0.00425796 0.0145796 0.018133 0.0138594 0.0167028 -0.012596 0.0100198 0.0123424 0.00546387 0.00380674 0.00846728 0.0084787 0.0145975 0.00927181 0.00632818 -0.000215476 0.00286637 0.017609 0.0110314 0.0245561 0.00144375 -0.00292781 0.0119558 0.0123491 -0.00994266 -0.00668056 -0.0029857 0.011871 -0.0105048 0.000452481 -0.0010985 -0.011776 0.0118516 0.0104363 0.00423799 -0.0156077 -0.00934914 0.000848634 0.0140734 0.0405006 0.0170225 0.0165772 0.0196009 0.0259902 0.0141351 0.00644451 -0.0140739 -0.00916027 0.0154463 0.0137997 -0.0204044 0.0174092 -0.0101719 -0.000182462 0.00309575 0.0037646 -0.0213001 -0.0211909 -0.0185071 -0.0182416 -0.0199317 -0.00820488 -0.00133776 0.00956514 0.00651006 -0.00939644 -0.0189524 -0.0062857 -0.00243039 0.00104656 -0.0124696 -0.00326468 -0.0183368 0.00511764 -0.0170017 -0.00691336 -0.0228009 -0.0185952 -0.00204585 -4.93131e-05 -0.022917 -0.0112908 -0.0175649 -0.020385 -0.0156148 -0.018858 -0.0233263 -0.00767986 -0.0193689 -0.019855 -0.0182322 -0.00715125 -0.0217622 -0.0119712 -0.0165373 -0.0235995 -0.0236303 -0.0209871 -0.0144583 -0.0221231 -0.0239463 -0.0247959 -0.0247817 -0.0169104 -0.0248246 -0.0248194 -0.0248263
internal_weight=0 1916.78 949.466 753.951 195.515 147.755 97.8415 948.571 968.207 374.063 83.3578 74.597 231.74 67.3463 594.145 812.258 524.152 242.809 288.106 117.938 97.8248 87.3218 281.343 203.027 113.43 58.2644 55.1658 192.719 136.313 583.221 567.603 177.075 112.37 85.3236 28.6718 56.6518 129.379 117.032 49.913 553.01 337.813 170.168 64.7056 20.4854 89.6021 215.197 20.1128 362.693 338.956 92.2659 42.5389 49.727 113.509 45.4005 20.8356 246.69 134.155 47.7605 112.535 46.7106 56.6594 20.5342 61.0666 44.1964 54.665 44.2202 24.5649 18.9693 78.316 64.639 52.4423 24.963 48.3173 9.03436 29.9988 44.3262 20.3128 27.3943 32.8249 27.0462 18.0045 14.4837 19.3163 31.5277 21.8329 36.1253 11.5013 32.832 17.1993 12.6687 26.8121 17.4081 23.9795 24.4471 14.807 14.9623 10.5123 9.7281 10.124 12.1965 12.7205 7.65314 20.6356 19.8464 7.08062 10.195 9.07046 12.5547 522.211 349.895 6.87068 172.316 42.3904 129.926
internal_count=11227 4687 6540 5597 943 597 354 3120 1567 399 269 253 1451 231 1168 2564 1777 700 787 307 256 239 1077 719 252 151 101 687 556 1153 1125 1048 621 439 114 325 448 422 243 1098 726 480 427 137 304 372 51 387 366 92 51 41 322 232 106 274 166 346 108 252 158 62 188 326 403 290 126 92 358 231 134 73 235 54 123 172 59 154 129 182 55 85 98 240 152 96 43 251 94 86 176 114 162 188 77 106 75 54 52 91 70 51 160 154 52 60 68 98 4146 2776 46 1370 337 1033
cat_boundaries=0 1 2 3 4 5 6 7 8 9 10 11 12 13 14 15 16 17 18 19 20 21 22
cat_threshold=2 1 1 2 1 1 1 1 1 1 2 1 1 1 1 2 1 2 1 1 1 1
is_linear=0
shrinkage=0.05


Tree=29
num_leaves=121
num_cat=21
split_feature=2 3 2 2 0 1 2 0 2 3 3 0 2 3 3 3 2 2 2 2 2 2 2 2 2 3 1 2 2 2 2 2 3 3 2 2 2 2 3 2 2 2 2 3 2 2 2 2 2 3 2 3 1 2 3 2 2 2 1 3 2 2 2 2 2 3 2 2 3 2 1 2 3 2 2 2 2 1 1 3 3 1 2 2 3 2 2 2 2 1 2 2 2 2 1 2 2 2 2 3 1 3 3 3 1 2 2 2 2 3 2 3 2 2 1 0 1 1 0 0
split_gain=175.743 19.3048 18.8724 9.63855 7.15126 5.5783 4.44149 3.08513 2.87835 2.13765 10.5574 2.10057 1.75278 1.63857 3.3782 2.3616 3.74492 4.2187 4.82669 2.80447 3.07397 4.74141 1.48956 1.41087 1.31953 6.58272 1.28538 1.89298 3.62912 6.2864 3.75674 1.24956 1.17967 6.04255 14.8085 2.0538 1.56252 2.77556 1.02368 0.783481 0.755078 0.705315 0.478789 0.628438 0.611781 0.466557 1.88962 0.428654 0.419476 0.368785 0.599626 0.31273 0.211864 0.527804 0.190294 0.156466 0.217991 0.137076 0.113702 0.102671 0.100301 0.0992513 0.0965341 0.0960798 0.0952437 0.0913661 0.0794346 0.221697 0.0766236 0.0712645 0.0685331 0.0685185 0.128214 0.0642323 0.053514 0.0417948 0.0346194 0.0336901 0.0305966 0.0285836 0.0469234 0.0260313 0.02652 0.0253913 0.023185 0.0230141 0.0227401 0.017944 0.0147675 0.014451 0.0122288 0.0114493 0.010545 0.0100273 0.00889044 0.00819357 0.00790777 0.00654921 0.00649132 0.00397624 0.00368829 0.00349193 0.00454703 0.00286966 0.00187129 0.00167129 0.00165016 0.00157506 0.00154457 0.00136362 0.00115714 0.00079173 0.000615141 0.000608679 0.000120225 8.71276e-05 2.93563e-05 6.25028e-07 3.94602e-07 3.22669e-07
threshold=13.500000000000002 1.0000000180025095e-35 117.50000000000001 1.0000000180025095e-35 0 1 7.5000000000000009 2 295.50000000000006 29.500000000000004 5.5000000000000009 3 3.5000000000000004 22.500000000000004 27.500000000000004 3.5000000000000004 16.500000000000004 80.500000000000014 84.500000000000014 18.500000000000004 27.500000000000004 37.500000000000007 16.500000000000004 38.500000000000007 317.50000000000006 17.500000000000004 4 7.5000000000000009 4.5000000000000009 5.5000000000000009 1.5000000000000002 21.500000000000004 5.5000000000000009 3.5000000000000004 153.50000000000003 120.50000000000001 187.50000000000003 205.50000000000003 57.500000000000007 32.500000000000007 123.50000000000001 152.50000000000003 469.50000000000006 1.0000000180025095e-35 492.50000000000006 2.5000000000000004 1.5000000000000002 600.50000000000011 93.500000000000014 1.5000000000000002 1.0000000180025095e-35 1.0000000180025095e-35 5 218.50000000000003 5.5000000000000009 148.50000000000003 129.50000000000003 25.500000000000004 6 9.5000000000000018 4.5000000000000009 4.5000000000000009 7.5000000000000009 70.500000000000014 8.5000000000000018 4.5000000000000009 236.50000000000003 271.50000000000006 10.500000000000002 110.50000000000001 7 361.50000000000006 2.5000000000000004 75.500000000000014 197.50000000000003 4.5000000000000009 195.50000000000003 8 9 35.500000000000007 1.5000000000000002 10 83.500000000000014 17.500000000000004 1.5000000000000002 12.500000000000002 66.500000000000014 11.500000000000002 121.50000000000001 11 1.5000000000000002 8.5000000000000018 2.5000000000000004 55.500000000000007 12 7.5000000000000009 5.5000000000000009 9.5000000000000018 9.5000000000000018 2.5000000000000004 13 2.5000000000000004 1.0000000180025095e-35 1.5000000000000002 14 23.500000000000004 10.500000000000002 1.5000000000000002 6.5000000000000009 1.5000000000000002 10.500000000000002 1.5000000000000002 3.5000000000000004 15.500000000000002 15 16 17 18 19 20
decision_type=2 2 2 2 9 1 2 9 2 2 2 9 2 2 2 2 2 2 2 2 2 2 2 2 2 2 1 2 2 2 2 2 2 2 2 2 2 2 2 2 2 2 2 2 2 2 2 2 2 2 2 2 1 2 2 2 2 2 1 2 2 2 2 2 2 2 2 2 2 2 1 2 2 2 2 2 2 1 1 2 2 1 2 2 2 2 2 2 2 1 2 2 2 2 1 2 2 2 2 2 1 2 2 2 1 2 2 2 2 2 2 2 2 2 1 9 1 1 9 9
left_child=1 3 7 115 5 6 9 23 32 10 12 26 -3 15 -15 19 -17 39 -19 22 31 -22 51 57 25 -10 27 28 30 -30 -5 -21 33 35 -35 -4 40 -38 49 -18 -37 55 58 47 -45 46 -28 -44 73 50 -7 -9 66 74 60 56 88 83 71 -58 90 92 96 -16 65 -51 68 -68 -43 84 -46 -26 -73 77 -54 -52 -36 86 -24 80 -60 82 -75 113 -50 97 -25 103 -34 -59 99 100 107 -79 105 -62 -47 -29 -64 109 -63 102 -91 -8 112 -85 -97 114 -102 -6 -93 -92 -94 -2 -13 116 -1 119 -119 -117
right_child=2 4 8 11 54 38 87 13 24 -11 -12 61 -14 14 63 16 17 18 -20 20 21 -23 78 48 42 -27 45 85 29 -31 -32 -33 41 34 76 36 37 -39 -40 -41 -42 52 43 44 70 62 -48 -49 69 64 75 -53 53 -55 -56 -57 59 89 79 -61 95 91 98 -65 -66 -67 67 -69 -70 -71 -72 72 -74 81 -76 -77 -78 93 -80 -81 -82 -83 -84 94 -86 -87 -88 -89 -90 101 111 110 104 -95 -96 106 -98 -99 -100 -101 108 -103 -104 -105 -106 -107 -108 -109 -110 -111 -112 -113 -114 -115 -116 117 -118 118 -120 -121
leaf_value=-0.024793593042907933 -0.014665503184525461 0.0039439109163639683 0.029609859428938096 0.0029026939082136046 -0.023926563362181026 -0.0016254148217006957 -0.019090890759886472 -0.00098416569207677822 0.011211503416409488 -0.010201627270747374 0.070927574810970423 -0.023650590476859131 0.020918293104186733 0.038570249073774314 -0.00063665451485769462 0.034027767638463255 -0.015389653025441638 0.038943459081393614 0.002061384386556747 0.0058138076494163634 -0.0078596419577413226 0.0075959240650620612 -0.017166929409313792 -0.0023830534436872974 0.010770629456721102 0.052268916889652753 -0.023684795999906305 -0.019622856776713389 0.043919044279160852 -0.0052387018383411674 -0.022990569851129919 0.016713850115597517 0.00099073072647371386 0.0738812648517925 0.0087054997373281987 -0.0047335500569467247 0.02736770372430692 0.0099871871823726237 0.010935827566272538 -0.0054065978843423771 0.007784089029044307 0.0076270356378985889 0.027271356677165865 0.0080168695923938781 0.01656940979631906 -0.020892161105393416 0.0068688135918086703 0.018238580806755042 0.0067526135631864109 -0.02187130356679691 -0.02232749695293092 0.0076137334089322484 0.010639273390819536 0.0187168944774006 -0.0091525736238636871 -0.00099867057954898097 0.0040782125480582753 -0.004306401632459887 0.016698622937283206 0.01030952806603473 -0.019022840799966943 -0.018165936879628641 -0.016674941786619588 0.0068931262445550189 -0.012356962429641884 -0.013806290228105337 0.0050322130054224852 0.012845984173942178 0.011336550633144404 0.010630724766464119 0.018972537453429562 0.010946532993232581 0.015539376562119615 0.00016274237832745577 0.0066945415354528739 -0.015460287993321765 0.012242810073464875 -0.0014994665093798333 -0.012941421775811921 0.017250506035895421 0.01383699787248239 -0.00123869138746768 0.0047704934171692833 -0.012199160885948364 0.002930536949405765 -0.014110167631784265 -0.0053363638452472717 -0.014333663013077331 0.003415175925284706 -0.0070775958329793972 -0.021369930912145368 -0.017648175841334383 -0.022534407030641451 0.0014537309733528077 -0.0092129787967654333 -0.017005160552307174 -0.019036576635749286 -0.017952330262145728 -0.014684068134229955 -0.021951938535436956 -0.020637257195053001 -0.0063834909371293658 -0.009193017680825543 -0.017344513990556878 -0.020628955163436675 -0.01094799326607538 -0.015494852479693302 -0.023019407142224991 -0.019307602680693235 -0.023060320376215956 -0.016496547809935827 -0.02029080706281557 -0.021695196026048483 -0.013884552944474604 -0.024014278496097916 -0.02482708717608249 -0.02476406823770988 -0.024816812591338451 -0.02482926619078861 -0.02481859394880144
leaf_weight=190.40193655341864 5.4387902617454547 45.074253082275391 14.190980255603789 27.35931807756424 12.113373711705217 11.781611084938051 4.1915722489356977 42.492449015378952 28.257410824298859 8.6706123352050763 7.8450060486793509 3.0129461288452148 22.952619299292564 11.088858589529993 8.594082251191141 7.5890673398971549 25.957867220044136 10.843087702989576 48.766728788614273 35.220704331994057 58.304815649986267 333.22884948551655 10.522565364837646 23.731916517019272 25.225559234619141 14.915679097175596 10.678413733839989 11.156078726053243 9.839433968067171 19.183693170547485 28.705174177885056 103.72778560221195 12.282388389110567 13.755585819482802 14.311359077692034 13.201676964759825 30.478806406259537 93.240078210830688 4.5639955699443808 80.923613697290421 137.76544919610023 18.874520182609558 24.828846454620361 20.039240121841431 86.358612477779388 17.794357091188434 9.6187200546264648 27.885286331176758 7.2458789050579133 13.895803108811384 4.3627820909023267 14.080695569515226 30.948720753192902 24.727992117404938 3.5311409235000601 10.265816628932951 9.3909130394458789 4.4895161837339401 24.681094348430634 22.32636296749115 4.9205019623041135 3.9411896467208862 6.7635210156440762 8.3552966117858869 5.5260570347309104 4.6992518454790106 27.546921789646149 13.539541423320768 53.042584866285324 7.2630984783172599 45.193959951400757 24.123149216175079 41.058260023593903 6.3275230824947357 11.904571831226347 4.5020204484462738 13.387166172266005 5.8487208783626539 7.2259766608476648 19.409064173698425 34.141706168651581 7.8410724997520456 6.1655134260654449 8.7234147340059263 8.7703612446784955 3.0233576893806449 8.9860426783561689 4.6872274428606024 12.854262828826903 5.4810988157987612 3.9500389546155921 4.4529741704463941 3.8835199177265149 5.6520431637763977 4.4370487332344082 4.5067939907312393 8.4767320454120618 12.375424206256865 10.374867081642149 4.500475049018859 4.6128249764442462 4.4781941622495642 4.7344270497560501 5.3607754558324814 3.0619231611490241 3.845759689807891 3.020821824669838 7.8966572880744925 4.1481886804103851 7.2695697695016852 4.2755431532859802 2.9835262447595596 4.9884776771068573 4.6098504811525345 9.2446668595075625 114.34464928507805 150.92818662524223 33.499631881713867 7.8515925407409659 12.395079262554644
leaf_count=1547 32 165 27 116 97 52 28 140 40 16 22 24 66 26 20 19 81 29 124 131 286 1041 50 102 37 19 85 77 33 81 209 228 23 30 30 22 60 157 11 268 322 42 20 19 84 122 52 22 22 66 26 40 57 36 20 16 24 21 27 51 35 28 46 23 34 26 44 22 112 20 37 31 56 21 18 28 25 24 33 20 38 17 21 48 26 20 27 31 29 29 30 31 30 19 24 31 54 85 68 34 34 23 25 26 23 22 20 62 30 57 29 22 38 28 74 932 1229 273 64 101
internal_value=0 -0.0172707 0.00914607 -0.0209658 -0.0032745 0.00210885 0.00896605 0.00407078 0.01395 0.0133172 0.016005 -0.0124425 0.00967116 0.00523776 0.0171132 0.00481027 -0.000321522 -0.00188724 0.00877027 0.00628735 0.00756177 0.00529438 -0.00280897 -0.00295288 0.0171209 0.0253962 -0.0097961 -0.00656232 -0.00292512 0.0114268 -0.0103547 0.0139509 0.0116673 0.0136233 0.0314749 0.0110615 0.0101033 0.014269 -0.0116221 -0.00783114 0.00668945 0.00905883 0.0161629 0.0177905 0.0161553 -0.0154631 -0.00920558 0.0224931 0.000768642 -0.0139218 -0.0090167 0.0011558 0.0106854 0.0129 -0.0203132 0.0046825 0.00570832 -0.0100222 0.014191 0.00846455 -0.0212241 -0.021113 -0.018389 0.0030752 -0.0181204 -0.0198332 0.00936101 0.00760715 0.010363 0.00652263 0.017395 0.0129833 0.0138396 -0.00130639 0.00954343 -0.01884 0.0104151 -0.00237593 -0.0154466 0.0155867 0.0150377 0.00101945 0.00243674 -0.0123145 0.00465968 -0.0182167 -0.00319419 -0.0168675 0.00223053 -0.0067891 -0.0227542 -0.0184782 -0.0228726 -4.81195e-05 -0.0111371 -0.0174362 -0.0202934 -0.0187443 -0.0154697 -0.0232908 -0.0194362 -0.00754766 -0.008058 -0.0181108 -0.0216947 -0.0118163 -0.0163991 -0.0235701 -0.0200077 -0.0236017 -0.0170841 -0.0209056 -0.0220625 -0.0143072 -0.0239249 -0.024795 -0.0247805 -0.0248245 -0.0248192 -0.0248263
internal_weight=0 933.199 1935.15 738.289 194.91 148.114 98.7821 940.993 994.154 84.5425 75.8719 228.868 68.0269 806.922 28.0382 778.884 174.08 166.491 59.6098 604.804 530.482 391.534 74.3217 134.07 416.118 43.1731 175.349 111.642 85.0876 29.0231 56.0645 138.948 578.036 330.331 41.4541 288.877 274.686 123.719 49.3315 106.881 150.967 247.705 372.945 204.306 151.592 63.7066 20.2971 52.7141 87.8322 44.7675 20.6464 56.5731 180.585 67.5813 46.7962 67.1197 56.8539 46.2381 168.639 31.7173 43.2651 53.5189 43.4095 16.9494 24.1211 18.5951 113.004 41.0865 71.9171 23.2793 131.553 90.407 65.1814 64.5528 42.8533 8.8648 27.6985 44.2187 17.7485 78.2319 58.8228 20.3341 12.493 27.0549 16.0162 26.5549 32.718 14.2396 25.1367 19.1832 30.817 21.4307 32.0882 11.5008 17.0062 12.4481 26.2711 23.5315 17.1384 23.8834 12.7022 14.6937 10.2155 9.55235 11.9339 12.5692 7.52762 20.1543 8.76101 19.3829 8.72852 6.93357 8.872 10.0486 12.2576 509.421 341.33 168.091 41.3512 126.74
internal_count=11227 6540 4687 5597 943 597 354 3090 1597 269 253 1451 231 2539 69 2470 521 502 153 1949 1686 1327 263 551 450 59 1048 621 439 114 325 359 1147 673 85 588 561 217 243 349 344 474 391 182 140 427 137 42 299 232 106 180 331 111 346 143 127 252 209 75 326 403 290 43 126 92 220 66 154 68 121 124 87 231 75 54 55 172 83 85 65 59 42 154 48 182 129 85 52 98 240 152 251 43 94 86 176 162 114 188 92 77 54 54 91 70 51 160 64 154 60 52 68 60 98 4146 2776 1370 337 1033
cat_boundaries=0 1 2 3 4 5 6 7 8 9 10 11 12 13 14 15 16 17 18 19 20 21
cat_threshold=2 1 1 2 1 1 1 1 1 1 1 2 1 2 1 2 2 1 1 1 1
is_linear=0
shrinkage=0.05


Tree=30
num_leaves=95
num_cat=23
split_feature=2 2 3 2 3 3 2 3 2 3 3 3 3 3 2 0 2 2 1 0 2 2 2 1 1 3 2 2 2 3 2 2 1 2 2 2 2 2 0 2 2 2 2 2 3 2 2 2 2 2 2 1 2 2 2 2 0 2 2 2 2 3 1 2 2 1 1 2 2 3 1 2 2 2 2 1 2 1 3 2 3 1 1 2 2 0 1 2 2 1 2 0 1 1
split_gain=167.475 30.9727 9.97644 9.57991 9.30226 10.2724 6.39399 5.5162 7.46681 6.78495 5.25692 4.44099 2.81353 3.78878 5.44638 2.59562 2.57255 2.50529 2.18602 2.18448 1.782 1.5256 4.56374 4.43526 1.90911 1.65118 1.32738 1.80119 2.73975 2.17066 1.11668 1.67863 2.33426 1.65164 0.990416 1.38929 4.5969 1.86488 1.264 2.6216 5.70418 1.3369 0.939017 0.789262 0.767888 0.767651 0.602882 0.474149 2.85895 0.853861 0.298719 0.226958 0.127157 0.123931 0.11158 0.107973 0.101961 0.0971693 0.0724539 0.0680243 0.066095 0.0499202 0.0410687 0.03898 0.0321814 0.0290169 0.0245028 0.016319 0.0156476 0.0127791 0.0120266 0.0109798 0.00968231 0.00967388 0.00957689 0.00946228 0.00637892 0.00609071 0.0049838 0.00477351 0.00293527 0.00218434 0.00184261 0.00181311 0.000997684 0.0008616 0.0015443 0.000432216 0.000425162 0.00016924 7.02561e-05 3.95327e-07 4.6518e-07 9.12365e-08
threshold=13.500000000000002 72.500000000000014 1.0000000180025095e-35 1.0000000180025095e-35 17.500000000000004 26.500000000000004 198.50000000000003 1.0000000180025095e-35 16.500000000000004 1.5000000000000002 28.500000000000004 4.5000000000000009 4.5000000000000009 1.5000000000000002 55.500000000000007 0 73.500000000000014 205.50000000000003 1 2 212.50000000000003 78.500000000000014 81.500000000000014 3 4 4.5000000000000009 7.5000000000000009 4.5000000000000009 1.0000000180025095e-35 1.5000000000000002 7.5000000000000009 4.5000000000000009 5 2.5000000000000004 22.500000000000004 19.500000000000004 18.500000000000004 14.500000000000002 6 42.500000000000007 49.500000000000007 23.500000000000004 112.50000000000001 1279.5000000000002 1.5000000000000002 32.500000000000007 26.500000000000004 314.50000000000006 327.50000000000006 243.50000000000003 1.5000000000000002 7 74.500000000000014 27.500000000000004 207.50000000000003 4.5000000000000009 8 4.5000000000000009 8.5000000000000018 23.500000000000004 21.500000000000004 1.0000000180025095e-35 9 12.500000000000002 5.5000000000000009 10 11 9.5000000000000018 6.5000000000000009 3.5000000000000004 12 2.5000000000000004 10.500000000000002 7.5000000000000009 2.5000000000000004 13 11.500000000000002 14 1.5000000000000002 8.5000000000000018 1.5000000000000002 15 16 1.5000000000000002 5.5000000000000009 17 18 3.5000000000000004 11.500000000000002 19 11.500000000000002 20 21 22
decision_type=2 2 2 2 2 2 2 2 2 2 2 2 2 2 2 9 2 2 1 9 2 2 2 1 1 2 2 2 2 2 2 2 1 2 2 2 2 2 9 2 2 2 2 2 2 2 2 2 2 2 2 1 2 2 2 2 9 2 2 2 2 2 1 2 2 1 1 2 2 2 1 2 2 2 2 1 2 1 2 2 2 1 1 2 2 9 1 2 2 1 2 9 1 1
left_child=2 4 3 85 7 -6 16 34 9 -9 15 -11 13 18 -15 26 -3 -8 -10 30 54 51 23 61 42 -26 27 28 29 -4 31 33 64 50 35 36 37 -2 41 53 -41 -36 -24 47 -29 59 -43 49 -49 -22 -5 52 -18 -40 -19 74 -47 69 -28 -14 62 -23 -37 65 -33 79 76 -67 -34 71 -30 80 78 81 83 -35 -60 88 -59 -32 -17 84 87 89 -57 86 -1 -76 -75 -21 -68 93 -93 -87
right_child=1 6 10 19 5 -7 17 8 12 11 -12 -13 45 14 -16 57 21 20 -20 55 43 22 24 -25 25 -27 58 44 70 -31 63 32 68 75 38 60 -38 -39 39 40 -42 46 -44 -45 -46 56 -48 48 -50 -51 -52 -53 -54 -55 -56 73 -58 72 66 -61 -62 -63 -64 -65 -66 67 90 -69 -70 -71 -72 -73 -74 77 82 -77 -78 -79 -80 -81 -82 -83 -84 -85 -86 91 -88 -89 -90 -91 -92 92 -94 -95
leaf_value=-0.024588480742137153 0.0022674381187763591 0.033464167514047537 0.0072137674666471379 -0.0039545758786055712 0.065990349537037543 -0.0017334640491837063 0.033535488661130895 0.062393502678690149 -0.010854013507614483 -0.018090678106974057 0.020110113928370095 0.036558869836233875 -0.017153489276131237 0.0034852326066654084 0.028427816227851285 -0.023819359542827042 -0.01103215236870065 0.00018401820827784849 0.0060374618837880506 -0.023585694406808633 0.01856659623331133 0.046260422831230587 0.0016473368553769796 -0.00072631205740439928 0.014853116497892577 0.0056896034015530006 -0.021042605833286224 0.020901393766747295 -0.020918374624038755 -0.012066516555879904 -0.01959733703071706 0.0052561338917163532 -0.01993876999187795 -0.022388587014234254 0.0087438027290655806 -0.012452405443853627 0.026639028681644111 -0.017188197943952387 -0.014269926319699523 0.0534052449864027 -0.0022486458799221526 -0.016532910852161312 0.0074680610579755799 0.027068106799463899 0.0015266521136719799 0.0012118051280815541 -0.0062846662150923306 0.036318003638542755 0.015909657771658765 0.011765128830931969 -0.011154389675301557 0.0034374083256771409 -0.0026258075182567222 -0.0061829725138259073 0.0064667151355731842 -0.020684482603504615 -0.0049121802774602695 -0.019358759381365907 -0.018041595547287844 -0.011577091836341287 -0.019837873142620872 0.040969815070695748 -0.017297967026388684 -0.012712235328235519 0.0085384518010794899 -0.017433087037328474 -0.013075397564108844 -0.01404033152311893 -0.015856630496008481 -0.019617725762492207 -0.023404032645066197 -0.020585793071377159 -0.01505611153261178 -0.018353995015334783 -0.022434633814255135 -0.020511086358081913 -0.015481664127005388 -0.015449186304766977 -0.017099913725294066 -0.01793859151712103 -0.022661425988271859 -0.018451951283529791 -0.020593062329607878 -0.022932058307373111 -0.019495721357039808 -0.024827904421609183 -0.024804097370530204 -0.021737757871810551 -0.017609355686135995 -0.024002858806822045 -0.013380926224614781 -0.024813485862872964 -0.024829265070449028 -0.024824843071267158
leaf_weight=185.13891439139843 17.900968670845032 10.501221537590025 30.152657091617584 36.88581558316946 10.807102262973787 11.619302719831465 19.997687727212906 9.5817816555500048 49.770297080278397 7.6549923419952375 15.382435485720633 7.2271726429462433 13.672287717461588 87.446588963270187 29.19206291437149 13.33538083732129 6.9587566852569607 14.287232697010042 31.137068554759026 3.1877347379922867 68.164083540439606 8.5996437966823596 100.31184953451157 8.2955771088600176 143.57746893167496 74.755636811256409 7.8431842774152782 7.7043075859546688 7.0937433838844299 28.29954269528389 5.8248215466737774 11.527409225702284 8.250808119773863 15.491781830787659 14.251759290695189 6.5162322372198105 9.3782573938369733 39.484175994992256 7.3956896215677288 6.8623709827661541 13.990532845258711 15.662133440375326 224.03675776720047 16.086168885231018 15.211053833365439 7.890276774764061 171.38690586388111 18.092622935771942 333.10181295871735 142.84762924909592 23.639441102743149 10.744266718626024 12.723645091056822 13.180931553244589 13.984020739793776 2.7833888679742831 49.044206634163857 4.680487245321272 5.604781031608578 9.1147037446498853 18.890683233737946 9.2594216465949994 13.294017031788828 5.4173329174518576 21.203842610120773 6.2178700119256964 4.7914060056209609 8.2428508996963483 3.281081646680831 3.3232445269823065 15.497692927718164 4.2924639880657187 3.3218125700950614 5.1813307553529722 4.6829489022493345 11.839535415172577 4.3008491992950439 3.0081815272569647 5.1055671572685242 16.983711764216423 9.2825899198651296 3.717985600233078 2.6096383929252616 7.4680235981941214 4.8239404261112213 108.66846117377281 150.59094308316708 4.2391250878572464 3.0425515919923782 10.244943469762804 3.0982374995946884 11.971521377563477 7.659043788909913 31.361792281270027
leaf_count=1542 63 22 124 193 21 29 36 32 199 28 35 18 36 341 96 109 15 19 104 26 121 22 314 21 314 145 30 29 44 106 41 37 55 115 28 23 36 161 30 22 51 45 526 11 41 32 586 22 342 217 156 31 41 64 24 21 175 34 39 38 41 21 53 36 90 43 31 55 21 23 64 33 22 37 37 84 29 21 35 119 74 27 20 60 36 908 1257 33 21 84 20 100 64 262
internal_value=0 0.00787854 -0.0181539 -0.0208166 -0.000758419 0.0309021 0.0125756 -0.0018509 0.00309743 0.0295772 -0.00790032 0.00844859 0.000761063 0.0039607 0.00972781 -0.0103918 0.00893065 0.0161228 -0.00435336 -0.0123789 0.0155487 0.00850074 0.0090842 0.0294844 0.00810101 0.0117156 -0.00684936 -0.0043364 -0.00783603 -0.00212075 -0.00964463 -0.0073731 0.000567057 -0.0113734 -0.00613892 -0.0101845 -0.00581523 -0.0111191 -0.00438117 0.00357218 0.0160662 -0.00601804 0.00566788 0.016148 0.00804058 -0.00716748 -0.00714278 0.0158355 0.016961 0.0139622 -0.00676662 -0.00240734 -0.00559789 -0.0090896 0.00329168 -0.0210707 -0.00406349 -0.0209841 -0.0170389 -0.014923 -0.0177219 0.0435174 -0.0157041 -0.0166753 0.00738247 -0.0172513 -0.0152743 -0.0154992 -0.0187773 -0.0225429 -0.0226235 -0.0229042 -0.0173885 -0.018414 -0.0229184 -0.0215753 -0.0169301 -0.0173743 -0.0181803 -0.0183622 -0.0233441 -0.0194452 -0.0217617 -0.0235566 -0.0199307 -0.0247307 -0.0246852 -0.0221035 -0.0180785 -0.0239039 -0.0131954 -0.0248263 -0.0248196 -0.0248272
internal_weight=0 1908.68 913.508 725.187 672.353 22.4264 1236.33 649.926 301.731 24.4639 188.321 14.8822 277.267 197.546 116.639 172.939 609.764 626.561 80.9074 229.796 606.564 599.263 568.836 26.1546 542.682 218.333 129.597 103.959 81.0436 58.4522 174.806 132.12 44.2631 87.8566 348.195 105.464 66.7634 57.3851 242.73 41.4295 20.8529 201.301 324.349 578.292 22.9154 79.7215 187.049 562.206 351.194 211.012 60.5253 30.4267 19.6824 20.5766 28.2713 54.9898 56.9345 43.3415 25.6385 22.787 38.7009 17.8591 19.8102 42.6866 32.7313 37.2693 17.7953 14.4607 11.5319 30.2337 22.5914 26.9104 13.1079 22.5574 32.4324 27.3313 9.90563 11.2321 9.78605 22.8085 22.618 11.3253 11.5317 20.9007 7.60733 495.391 335.73 8.92207 8.22388 13.4327 7.88964 159.661 19.6306 140.03
internal_count=11139 4616 6523 5601 2352 50 2264 2302 1099 78 922 46 1021 740 437 887 1472 792 303 1468 756 1450 1363 64 1299 459 557 408 338 230 1045 751 203 548 1203 377 260 224 826 167 73 659 840 713 70 281 631 702 364 338 349 87 56 94 43 423 207 330 149 74 117 43 76 294 127 258 119 98 76 239 108 216 91 163 260 199 68 79 69 160 183 84 90 170 57 4133 2799 70 58 110 51 1334 164 1170
cat_boundaries=0 1 2 3 4 5 6 7 8 9 10 11 12 13 14 15 16 17 18 19 20 21 22 23
cat_threshold=2 1 2 1 1 1 2 1 1 2 1 1 2 1 1 1 1 2 1 2 1 1 1
is_linear=0
shrinkage=0.05


Tree=31
num_leaves=107
num_cat=25
split_feature=2 2 3 2 3 2 2 3 2 3 3 3 3 3 2 0 2 0 1 2 2 1 1 2 1 3 3 2 2 2 1 2 2 2 2 2 0 2 2 2 2 3 2 1 2 2 2 2 3 2 3 2 1 3 2 2 2 2 2 3 1 1 2 2 2 2 2 2 0 2 3 2 2 3 1 2 3 2 2 2 2 1 3 2 2 2 2 1 2 2 1 3 2 3 1 1 2 2 0 1 2 2 1 0 1 1
split_gain=161.027 28.8839 9.94607 9.65859 8.58235 9.55635 5.89475 5.26947 6.85076 5.82356 4.99013 4.11034 2.68155 3.56854 4.96316 2.56539 2.30579 2.16978 2.09829 1.45015 4.095 3.91859 1.89096 1.59068 1.31496 1.6486 4.00448 3.47631 1.09862 1.62574 2.24476 1.63514 0.961989 1.36665 4.32861 1.8209 1.20878 2.46425 5.06394 1.277 0.896676 0.848964 2.23154 5.37062 1.44348 1.51654 1.17265 1.46157 5.23296 0.749655 0.616916 0.591028 0.426536 0.395482 0.755434 0.313845 0.291732 0.290448 0.289705 0.227039 0.216838 0.189029 0.12331 0.121438 0.110646 0.16961 0.109356 0.0982672 0.0977256 0.0935694 0.112669 0.0676099 0.0663298 0.0414759 0.0408925 0.0389855 0.0324783 0.0307621 0.0299499 0.0158637 0.015724 0.0148364 0.0129774 0.01117 0.00975643 0.00972754 0.00969105 0.00960343 0.00874486 0.0079198 0.00609789 0.00500846 0.00492438 0.00299506 0.00220219 0.00187006 0.00185109 0.00100814 0.000883049 0.00158249 0.000439457 0.000427011 0.000172976 4.0541e-07 4.76889e-07 9.36408e-08
threshold=13.500000000000002 72.500000000000014 1.0000000180025095e-35 1.0000000180025095e-35 17.500000000000004 38.500000000000007 204.50000000000003 1.0000000180025095e-35 16.500000000000004 1.5000000000000002 28.500000000000004 4.5000000000000009 4.5000000000000009 1.5000000000000002 55.500000000000007 0 73.500000000000014 1 2 78.500000000000014 81.500000000000014 3 4 92.500000000000014 5 3.5000000000000004 2.5000000000000004 5.5000000000000009 7.5000000000000009 4.5000000000000009 6 2.5000000000000004 22.500000000000004 19.500000000000004 18.500000000000004 14.500000000000002 7 42.500000000000007 49.500000000000007 23.500000000000004 112.50000000000001 3.5000000000000004 243.50000000000003 8 468.50000000000006 536.50000000000011 275.50000000000006 316.50000000000006 34.500000000000007 32.500000000000007 165.50000000000003 26.500000000000004 9 1.5000000000000002 1.0000000180025095e-35 222.50000000000003 563.50000000000011 1.5000000000000002 258.50000000000006 21.500000000000004 10 11 74.500000000000014 27.500000000000004 215.50000000000003 237.50000000000003 4.5000000000000009 4.5000000000000009 12 8.5000000000000018 5.5000000000000009 23.500000000000004 21.500000000000004 1.0000000180025095e-35 13 11.500000000000002 10.500000000000002 4.5000000000000009 5.5000000000000009 4.5000000000000009 6.5000000000000009 14 3.5000000000000004 2.5000000000000004 2.5000000000000004 7.5000000000000009 10.500000000000002 15 12.500000000000002 9.5000000000000018 16 1.5000000000000002 10.500000000000002 1.5000000000000002 17 18 1.5000000000000002 5.5000000000000009 19 20 3.5000000000000004 11.500000000000002 21 22 23 24
decision_type=2 2 2 2 2 2 2 2 2 2 2 2 2 2 2 9 2 9 1 2 2 1 1 2 1 2 2 2 2 2 1 2 2 2 2 2 9 2 2 2 2 2 2 1 2 2 2 2 2 2 2 2 1 2 2 2 2 2 2 2 1 1 2 2 2 2 2 2 9 2 2 2 2 2 1 2 2 2 2 2 2 1 2 2 2 2 2 1 2 2 1 2 2 2 1 1 2 2 9 1 2 2 1 9 1 1
left_child=2 4 3 98 7 -6 16 32 9 -9 15 -11 13 18 -15 24 -3 28 -10 60 21 73 40 -24 25 26 27 -4 29 31 78 57 33 34 35 -2 39 63 -39 -34 -22 42 43 55 58 -46 52 48 76 71 56 -41 64 54 -26 -8 -49 -5 -44 -54 62 -60 -18 -38 -43 -66 84 82 -51 70 -55 -14 74 -21 -35 81 -48 -56 -31 -27 -32 92 83 93 96 94 91 -33 -77 -83 -87 -69 -30 -17 97 -86 102 -68 99 -1 -97 -92 -19 105 -105 -100
right_child=1 6 10 17 5 -7 41 8 12 11 -12 -13 49 14 -16 67 19 66 -20 20 22 -23 23 -25 53 79 -28 -29 75 30 80 87 36 72 -36 -37 37 38 -40 51 -42 46 44 -45 45 -47 47 50 -50 68 -52 -53 59 69 77 -57 -58 -59 61 -61 -62 -63 -64 -65 65 -67 85 86 -70 -71 -72 -73 -74 -75 -76 88 -78 -79 -80 -81 -82 89 -84 -85 95 90 -88 -89 -90 -91 101 -93 -94 -95 -96 100 -98 -99 103 -101 -102 -103 -104 104 -106 -107
leaf_value=-0.024582486733208255 0.0022060680997278018 0.031545706358291674 0.0038095468797512706 -0.0038718624176340569 0.063403498041601905 -0.00098385035599055505 0.037948509205072624 0.057117667362203001 -0.010701499883712372 -0.017967663268055156 0.019215404307011422 0.034355119093618568 -0.017020687339263325 0.0033867215131731677 0.026935149200372044 -0.023795015939426949 -0.010879097322681445 -0.023556015470316105 0.005851666843568709 0.043046687910846204 0.0016037569111511316 -0.00070879944597507672 0.0012470572142073877 0.013177244993422366 0.00058481914942459855 -0.022082884822351379 0.040171003280005807 -0.021087235298387214 -0.018760848726164913 0.0050984161401961227 -0.019840280642191351 -0.022333327634702776 0.0084515267194339629 -0.017166557789412767 0.025286063326779757 -0.017055727153573948 -0.014118164980564205 0.049336723300015796 -0.0021978129111958336 -0.016394607825927845 0.0072461507835783756 0.0028812439657749777 0.0069669584866862214 0.0082717454707700762 0.031899752378512183 0.01618953130242708 0.013443240489099992 0.011936769194704096 0.048689936002921652 0.0011802674990666784 0.021694424497906595 -0.0061677528105015342 0.017322848369936774 -0.021459078210125007 -0.02203079196801299 0.049066612002193297 0.015789259617346202 -0.011001000098869923 0.011613078802014056 0.0095661048483452922 0.0033404111064489479 0.015872953428402472 -0.002567428989000402 -0.0060673257710107346 0.011837301914047801 0.0057329665791000873 -0.020597857460374975 -0.019251825407172126 -0.0048141032660872453 -0.012011078804123075 -0.01151065174984134 -0.011422778870142486 -0.019737865465485609 0.03832851675633725 -0.012297319944368701 -0.015346782985453975 0.010045592269280168 -0.016305292158302134 0.0082547582051943034 -0.01841416609431959 -0.015713220762298679 -0.017303019106205998 -0.019514478722529496 -0.020497531912722477 -0.020504922822285498 -0.015303146960198036 -0.014907853124473484 -0.020421599625902644 -0.01255721766364834 -0.014697700397991615 -0.018234050906382027 -0.016966606333793495 -0.016846006128585968 -0.022611738150400164 -0.018333185426764553 -0.022380304642181159 -0.022888049409394658 -0.019390719632453368 -0.024827871631499809 -0.024803466377141113 -0.021669818762407173 -0.017481090556672862 -0.023982782679774217 -0.024813088813336132 -0.024829264889815256 -0.024824731469155936
leaf_weight=180.64214247465134 17.941604569554329 10.858582228422163 46.782086029648781 36.740236163139343 10.840445607900621 12.303056806325911 14.035680681467058 10.198667302727701 49.233010396361351 7.5177534371614438 15.694909483194349 7.4962790906429291 13.439760267734529 87.751892238855362 30.033838331699371 13.021493524312982 6.8824086785316494 3.1134295016527176 31.325626149773598 9.006812125444414 100.47723245620728 8.289554178714754 32.624818414449692 194.58049511909485 10.708439677953722 6.2835982590913755 5.6541084051132193 20.021196693181992 14.668222203850748 11.588157296180723 8.087926506996153 15.148796364665031 14.376920342445372 13.066034823656082 9.6314426958560926 38.81131200492382 7.2909031063318279 7.2388202697038677 13.95910859107971 15.405321583151816 235.31848639249802 13.450302958488463 20.578373551368713 19.732712268829346 22.896367371082306 46.67761617898941 13.767963826656343 134.35581880807877 14.488948702812193 7.8998440504074097 24.708844721317291 170.31317244470119 19.814720571041107 15.514412060379987 4.0580817908048612 11.587671458721159 77.47832179069519 23.377223178744316 60.428176045417786 18.006564259529114 10.781262814998628 45.76455169916153 12.690279036760328 13.099685713648794 18.122074961662292 30.583169102668762 2.7264072149992007 4.5907502174377424 48.803883388638496 5.1076494157314292 3.4853838235139838 9.0097902566194517 18.519625172019005 9.6466567218303663 6.4355926513671884 5.9175661951303464 14.37961161136627 5.5606579780578613 21.385665535926819 5.5483146011829376 3.2294650822877875 6.1104124039411563 3.258685201406478 4.2050036638975135 2.5564473271369934 2.9620646685361862 3.2721734941005698 11.599168181419373 5.3489022552967072 5.5814111530780792 5.0870998799800855 5.0190045833587646 4.3542729169130316 9.0745989829301816 3.6500105261802673 4.5790582448244077 7.298714965581893 4.7308050990104675 106.00366404652596 146.90161091834307 4.1479705721139908 2.9894433617591858 10.001963317394262 11.678121984004974 7.4712166786193857 30.592826247215271
leaf_count=1542 63 22 167 193 16 34 24 32 199 28 35 18 36 341 96 109 15 26 104 22 314 21 72 397 47 22 23 81 105 37 55 115 28 53 36 161 30 22 51 45 546 23 30 29 21 37 20 152 19 32 20 586 28 77 25 21 66 156 87 25 31 55 41 64 35 49 21 34 175 33 21 38 41 21 23 41 21 35 90 26 21 43 23 33 20 21 22 84 36 38 37 35 31 74 27 37 60 36 908 1257 33 21 84 100 64 262
internal_value=0 0.00761879 -0.0180321 -0.0207324 -0.000743764 0.0291753 0.0121069 -0.00181101 0.00300712 0.0279614 -0.00776796 0.00815631 0.000739838 0.00384481 0.00939127 -0.0102422 0.00870417 -0.0122244 -0.00426472 0.00830432 0.00885269 0.0278952 0.0079414 0.0114642 -0.00672735 -0.00305815 -0.000232439 -0.00365211 -0.00949827 -0.00724492 0.000550961 -0.0112199 -0.00602524 -0.010036 -0.00570667 -0.0109664 -0.00429263 0.0034636 0.0154006 -0.00590472 0.00555783 0.015566 0.0178818 0.0278777 0.0155727 0.0213597 0.0140898 0.0157538 0.024275 -0.00704069 0.0142179 -0.00701607 0.00944321 -0.0136875 -0.00855054 0.0429765 0.0133458 -0.00664409 0.0123967 0.0136299 -0.00235363 0.0134489 -0.00549009 -0.008946 0.00689564 0.00800425 -0.0209907 -0.0209025 -0.00397898 -0.018019 -0.0196341 -0.0147741 -0.0175948 0.0406067 -0.0155597 -0.0165382 0.0117075 -0.0187208 0.00714551 -0.0203625 -0.0186626 -0.017461 -0.0224908 -0.0228596 -0.0228741 -0.0182948 -0.017258 -0.0215043 -0.0140224 -0.0160593 -0.0172437 -0.0180583 -0.0183225 -0.0233091 -0.0193395 -0.0216942 -0.0235263 -0.0198321 -0.0247282 -0.0246816 -0.0220426 -0.0179554 -0.0238815 -0.0248262 -0.0248194 -0.0248272
internal_weight=0 1923.96 897.131 710.27 671.943 23.1435 1252.01 648.8 302.71 25.2127 186.861 15.014 277.498 198.344 117.786 171.166 631.157 226.981 80.5586 620.298 589.944 26.943 563.001 227.205 128.724 84.2893 72.4574 66.8033 173.137 131.157 44.2912 86.8654 346.09 104.406 66.3844 56.7529 241.684 41.5885 21.1979 200.095 335.796 620.857 241.701 45.3561 196.345 69.574 379.156 279.18 42.6365 79.1533 236.543 185.718 99.9768 44.4346 20.3272 25.6234 211.834 60.1175 126.771 37.8213 30.354 106.193 19.5727 20.3906 62.1555 48.7052 53.8434 42.4417 56.7037 24.1074 18.9998 22.4496 38.0213 18.6535 19.5016 41.9808 28.1476 9.61874 32.9738 11.8319 11.3174 30.7143 29.5598 26.3011 31.6976 22.1458 12.8819 26.748 11.2665 11.6918 11.0386 9.60975 19.0225 22.0961 11.1072 11.2835 20.4141 7.45721 483.29 327.544 8.72703 8.07654 13.1154 155.746 19.1493 136.596
internal_count=11139 4616 6523 5601 2352 50 2264 2302 1099 78 922 46 1021 740 437 887 1502 1468 303 1480 1393 64 1329 469 557 319 271 248 1045 751 203 548 1203 377 260 224 826 167 73 659 860 762 304 74 230 58 458 298 60 281 238 631 160 238 107 45 218 349 172 53 87 142 56 94 107 84 423 330 207 131 98 74 117 43 76 294 41 60 127 48 76 217 239 216 260 163 91 199 77 81 79 69 136 183 84 90 170 57 4133 2799 70 58 110 1334 164 1170
cat_boundaries=0 1 2 3 4 5 6 7 8 9 10 11 12 13 14 15 16 17 18 19 20 21 22 23 24 25
cat_threshold=2 2 1 1 1 1 1 2 1 1 1 1 1 1 1 1 2 1 2 2 1 2 1 1 1
is_linear=0
shrinkage=0.05


Tree=32
num_leaves=105
num_cat=23
split_feature=2 2 3 2 3 3 2 3 2 3 3 3 3 3 2 0 0 2 1 2 2 2 2 3 2 1 3 3 2 2 2 1 2 2 2 2 2 0 2 2 2 3 2 1 2 2 2 2 2 2 3 2 3 2 1 3 2 2 2 3 2 1 1 3 2 0 2 2 2 3 2 2 1 2 2 2 2 2 1 3 3 2 2 2 1 2 2 2 1 3 2 3 1 1 2 2 0 1 2 2 1 0 1 1
split_gain=154.847 26.9532 9.91206 9.73558 7.93246 8.61941 5.40035 5.03368 6.29786 5.03574 4.73997 3.8135 2.55584 3.36242 4.53179 2.53444 2.15435 2.08625 2.01397 1.35844 3.71672 1.76875 6.27716 1.58075 4.23825 1.28012 1.60559 3.66949 3.37727 1.08039 1.57411 2.159 1.61824 0.934063 1.34387 4.08051 1.77754 1.15597 2.31808 6.33002 1.21984 0.768521 1.99048 4.70974 1.30481 1.34298 1.09262 2.85714 0.732521 0.579184 0.513543 0.476525 0.391686 0.738132 0.31061 0.285941 0.282304 0.266431 0.260961 0.228827 0.217817 0.207156 0.172394 0.125478 0.118946 0.113653 0.11073 0.0993512 0.0935643 0.112996 0.0900116 0.0665407 0.0406993 0.0389185 0.0309897 0.0278925 0.016042 0.0157951 0.014868 0.0141274 0.0131761 0.0113615 0.00993793 0.009778 0.00974453 0.0096959 0.00867648 0.00790652 0.00610263 0.00503143 0.00494522 0.00305573 0.00221947 0.00189751 0.00188968 0.00101842 0.000905004 0.00162157 0.000446735 0.000428706 0.000176781 4.15317e-07 4.88893e-07 9.5914e-08
threshold=13.500000000000002 72.500000000000014 1.0000000180025095e-35 1.0000000180025095e-35 17.500000000000004 26.500000000000004 204.50000000000003 1.0000000180025095e-35 16.500000000000004 1.5000000000000002 28.500000000000004 4.5000000000000009 4.5000000000000009 1.5000000000000002 55.500000000000007 0 1 73.500000000000014 2 78.500000000000014 81.500000000000014 92.500000000000014 93.500000000000014 2.5000000000000004 80.500000000000014 3 3.5000000000000004 2.5000000000000004 5.5000000000000009 7.5000000000000009 4.5000000000000009 4 2.5000000000000004 22.500000000000004 19.500000000000004 18.500000000000004 14.500000000000002 5 42.500000000000007 48.500000000000007 23.500000000000004 3.5000000000000004 243.50000000000003 6 468.50000000000006 536.50000000000011 313.50000000000006 331.50000000000006 27.500000000000004 26.500000000000004 165.50000000000003 212.50000000000003 1.5000000000000002 1.0000000180025095e-35 7 60.500000000000007 1.5000000000000002 258.50000000000006 222.50000000000003 3.5000000000000004 687.00000000000011 8 9 23.500000000000004 27.500000000000004 10 4.5000000000000009 4.5000000000000009 8.5000000000000018 5.5000000000000009 75.500000000000014 21.500000000000004 11 11.500000000000002 4.5000000000000009 5.5000000000000009 4.5000000000000009 6.5000000000000009 12 6.5000000000000009 3.5000000000000004 2.5000000000000004 2.5000000000000004 7.5000000000000009 13 10.500000000000002 12.500000000000002 9.5000000000000018 14 1.5000000000000002 10.500000000000002 1.5000000000000002 15 16 1.5000000000000002 5.5000000000000009 17 18 3.5000000000000004 11.500000000000002 19 20 21 22
decision_type=2 2 2 2 2 2 2 2 2 2 2 2 2 2 2 9 9 2 1 2 2 2 2 2 2 1 2 2 2 2 2 1 2 2 2 2 2 9 2 2 2 2 2 1 2 2 2 2 2 2 2 2 2 2 1 2 2 2 2 2 2 1 1 2 2 9 2 2 2 2 2 2 1 2 2 2 2 2 1 2 2 2 2 2 1 2 2 2 1 2 2 2 1 1 2 2 9 1 2 2 1 9 1 1
left_child=2 4 3 96 7 -6 17 33 9 -9 15 -11 13 18 -15 25 29 -3 -10 61 23 59 -23 24 -21 26 27 28 -4 30 32 75 56 34 35 36 -2 40 64 -40 -35 42 43 58 57 -46 51 -48 79 -42 60 -43 53 -27 55 -53 -5 -44 -8 -22 -49 70 -59 -56 -39 -50 82 80 69 -54 -19 72 -36 78 -55 -32 -28 -33 90 -14 81 91 94 92 -34 89 -75 -80 99 -69 -31 -17 95 98 100 -68 97 -1 -84 -85 -18 103 -103 -98
right_child=1 6 10 16 5 -7 41 8 12 11 -12 -13 48 14 -16 67 66 19 -20 20 21 22 -24 -25 -26 52 76 -29 -30 73 31 77 84 37 71 -37 -38 38 39 -41 49 46 44 -45 45 -47 47 50 65 -51 -52 54 68 74 63 -57 -58 62 -60 -61 -62 -63 -64 -65 -66 -67 83 85 -70 -71 -72 -73 -74 86 -76 -77 -78 -79 87 -81 -82 -83 93 88 -86 -87 -88 -89 -90 -91 -92 -93 -94 -95 -96 -97 101 -99 -100 -101 -102 102 -104 -105
leaf_value=-0.024576345916838698 0.0021464922368208523 0.029795077726435734 0.0037006533583800482 -0.003790561236031444 0.057746358195244797 -0.0023818964929536741 0.035610824303590853 0.052568214900259425 -0.010549499684094708 -0.017843261781867764 0.018377148890921676 0.032356362099949763 -0.01419682382845742 0.0032913236522366255 0.025559478219972998 -0.023770110488094631 -0.02396223667110892 -0.0093435160856984376 0.0056726573782323042 0.04003355192766208 0.0024226080526915227 0.046683724673550434 0.0078844141246592146 0.043704098808242199 -0.0076841235766699142 0.00056996031844094093 -0.022021561801295855 0.037611625666834528 -0.021007488901383816 -0.018645925594371868 0.0049462205981392051 -0.019740309312973495 -0.022276955627019153 0.0081714376678198759 -0.012142259104931358 0.024034734768952161 -0.016922006146105211 -0.01396587175010415 0.057409743978661311 -0.0024629802427654662 -0.016255185201066332 0.001575885783742509 0.006746205435163498 0.0079990713731700105 0.030118670274571369 0.015530802814713555 0.034012382903954391 0.012139532535944806 0.0010757559023334715 -0.0060522974587402601 0.020695989621718921 0.0078217411757394075 -0.021385975217794451 -0.021968455878016518 0.01652989383960415 0.016090156421760201 -0.010848035877409935 0.011192318957387589 0.045528307316487181 -0.0035314934168431235 0.015876001052627643 0.0032464698236207516 0.01523198919173132 0.011235383537829057 -0.0059531450165152024 -0.0052059775947721591 -0.020509796420610394 -0.019143409581939858 -0.011856190323872612 -0.011356460119880597 -0.002464319035270245 -0.019636373314445125 -0.017033880136501832 -0.0152001342833169 -0.016165166812078545 0.0079827796579990309 -0.018294943274345023 -0.015568846506970033 -0.017171658748687504 -0.017135194945124263 -0.019409744005567012 -0.020407825811147841 -0.022324877550890493 -0.01811268999954678 -0.020330663471515381 -0.014758838013213919 -0.01240214322542134 -0.014547691377451606 -0.015156245656396228 -0.016832065199046321 -0.016710381123230755 -0.022561025099861045 -0.01821299295648085 -0.020415336574557359 -0.022843106354810822 -0.019284233408812298 -0.024827834746939899 -0.024802817913312975 -0.021600606400879775 -0.017351507216886199 -0.023525666804629364 -0.024812683339119259 -0.024829266289955493 -0.024824617005031351
leaf_weight=176.25564001500607 17.981227800250053 11.206583917140959 46.960643798112869 36.598258472979069 11.886036276817324 11.954946935176848 14.578549325466158 10.79814885556698 48.708952382206917 7.3838833272457105 15.999409258365629 7.7582893967628479 6.6447316557168987 88.04958713054657 30.853797435760498 12.715304322540769 9.7649418711662328 8.2610229253768939 31.509470909833908 10.159258723258976 41.661482661962509 10.651638835668562 488.84403449296951 8.9647574722766858 8.5862318277359009 10.714704349637033 6.1463592350482923 5.8858634382486335 19.60342463850975 14.395599007606508 11.647390276193617 7.9290411621332151 14.81422483921051 14.498941898345945 6.3569368869066238 9.8780892193317396 38.154970839619637 7.1886921077966717 6.1992743611335781 15.33410497009754 15.154816493391989 14.937560319900511 20.722243010997772 19.896613419055939 23.638530194759369 47.439454972743988 19.317014217376709 147.23741787672043 8.3330171406269073 169.26595629751682 25.250745177268982 66.452305674552917 15.185033991932874 3.9696565419435483 26.531441032886505 12.40862801671028 23.121460229158401 61.134023547172546 12.17041891813278 26.338208645582199 53.059821128845215 10.817336827516558 46.49676638841629 19.353916347026825 13.020446121692656 52.979189813137054 2.6708233952522296 4.50321516394615 5.0466679483652106 3.4454948008060446 11.204656630754469 18.15767166018486 12.843650087714197 5.8274440765380842 5.4707250893115997 21.562930047512054 5.4470818638801575 3.1791164875030518 6.0055934041738528 10.642137378454207 3.1957102417945853 4.1196887940168372 4.4777158945798856 4.9951821118593198 11.364696443080902 3.223754256963729 5.2821549475193024 5.4999767541885376 2.9170809090137482 4.9345674812793732 4.2815350890159598 8.871708929538725 3.5837038904428482 2.5045614242553702 7.1335588395595542 4.6399549841880798 103.40422481298447 143.30275768786669 4.0590517446398735 2.9376387745141983 3.0409465432167062 11.391916871070862 7.2879958152771005 29.842717036604881
leaf_count=1542 63 22 167 193 21 29 24 32 199 28 35 18 26 341 96 109 84 20 104 26 126 25 1118 19 19 47 22 23 81 105 37 55 115 28 23 36 161 30 17 56 45 23 30 29 21 37 23 159 34 586 20 110 77 25 37 19 156 87 21 60 41 31 55 26 64 195 21 34 33 21 36 41 53 41 35 90 26 21 43 26 23 33 37 37 84 22 36 38 21 35 31 74 27 20 60 36 908 1257 33 21 26 100 64 262
internal_value=0 0.00736942 -0.0179089 -0.0206467 -0.000729187 0.0275953 0.0116608 -0.00177178 0.00291996 0.0264807 -0.00763718 0.00787717 0.000719286 0.00373286 0.0090696 -0.0100936 -0.0120701 0.00841246 -0.0041775 0.00802936 0.00855495 0.00768187 0.0087118 0.0264354 0.0181768 -0.00660727 -0.00299444 -0.000229907 -0.00357601 -0.00935274 -0.00711805 0.000535347 -0.0110667 -0.00591293 -0.00988812 -0.00559947 -0.0108141 -0.00420545 0.00335922 0.0147739 -0.00579287 0.0149404 0.0171223 0.0264207 0.0149475 0.0203823 0.0135441 0.0155571 -0.00691526 -0.00689072 0.0139765 0.0100153 -0.0135344 -0.00841155 0.0110259 0.00912276 -0.00652298 0.0119379 0.0401231 0.000116416 0.0131293 -0.00230098 0.0129375 0.0142967 -0.00880339 -0.00435222 -0.0209092 -0.0208196 -0.0178953 -0.0195311 -0.00538378 -0.0174664 -0.0154144 -0.0163999 -0.0186054 0.00691781 -0.0202706 -0.0185465 -0.0173312 -0.0160057 -0.0224376 -0.022814 -0.0228289 -0.0181742 -0.021432 -0.0171263 -0.0138698 -0.0159173 -0.0171117 -0.0179349 -0.0182022 -0.0232732 -0.0192323 -0.0216255 -0.0234953 -0.019732 -0.0247257 -0.0246779 -0.0219805 -0.0178308 -0.0238586 -0.0248261 -0.0248192 -0.0248271
internal_weight=0 1938.86 881.159 695.72 671.537 23.841 1267.32 647.696 303.661 25.9403 185.439 15.1422 277.721 199.122 118.903 169.44 224.235 636.695 80.2184 625.489 595.206 567.495 499.496 27.7102 18.7455 127.876 84.0434 72.4499 66.5641 171.509 130.217 44.3185 85.8986 344.035 103.373 66.0143 56.1362 240.662 41.7425 21.5334 198.92 630.625 246.077 46.6456 199.431 71.078 384.549 244.865 78.5991 184.421 225.548 139.684 43.8323 20.1551 124.746 78.8609 59.7197 128.353 26.749 67.9997 200.297 30.283 107.631 45.8854 20.2091 61.3122 52.7252 41.5639 23.6772 18.6305 19.4657 37.3583 19.2006 41.2923 9.44038 33.2103 11.5934 11.1082 30.1827 17.2869 28.9024 25.7067 30.9808 21.7444 26.1789 12.6615 11.1096 11.5056 10.8499 9.43778 18.6771 21.587 10.8945 11.0413 19.9394 7.31078 471.485 319.558 8.53677 7.93282 12.8059 151.927 18.6799 133.247
internal_count=11139 4616 6523 5601 2352 50 2264 2302 1099 78 922 46 1021 740 437 887 1468 1502 303 1480 1393 1329 1143 64 45 557 319 271 248 1045 751 203 548 1203 377 260 224 826 167 73 659 762 304 74 230 58 458 243 281 631 220 215 238 107 192 129 349 172 45 186 200 87 142 63 94 229 423 330 131 98 56 117 76 294 60 127 48 76 217 52 239 216 260 163 199 91 77 81 79 69 136 183 84 90 170 57 4133 2799 70 58 110 1334 164 1170
cat_boundaries=0 1 2 3 4 5 6 7 8 9 10 11 12 13 14 15 16 17 18 19 20 21 22 23
cat_threshold=2 2 1 1 1 2 1 1 1 1 1 2 1 1 1 1 1 2 1 1 1 1 1
is_linear=0
shrinkage=0.05


Tree=33
num_leaves=100
num_cat=24
split_feature=2 2 3 2 3 2 2 3 2 3 3 3 0 3 3 2 0 1 2 2 2 2 2 2 3 1 2 2 2 2 1 2 2 2 2 2 0 2 2 2 0 2 2 2 2 3 2 2 2 2 1 3 2 2 2 2 2 0 2 1 2 2 2 3 3 1 2 2 1 2 2 1 1 3 2 2 1 2 2 2 2 2 1 3 2 3 1 2 1 2 0 1 2 2 1 2 0 1 1
split_gain=148.924 25.1687 9.87486 9.8108 7.34423 11.6881 4.95552 4.80847 5.79992 4.5049 4.38301 3.54584 2.503 2.43608 3.16937 4.14555 2.13822 1.93292 1.89221 1.2731 6.24064 1.25127 1.85779 2.69302 1.99945 1.24342 1.70705 1.35699 1.06204 1.52372 2.07678 1.60096 0.90658 1.32098 3.8505 1.73483 1.10514 2.18138 5.60494 1.16529 0.754997 1.71013 0.804846 1.86488 0.755576 0.730626 0.717375 0.56736 0.4007 0.274289 0.197891 0.165171 0.172707 0.116456 0.112093 0.10042 0.09786 0.0894746 0.087105 0.0778159 0.0724899 0.066727 0.0663712 0.0575031 0.177869 0.0404895 0.0388353 0.0259937 0.0251255 0.0223537 0.0158607 0.0148937 0.0137511 0.0133751 0.0115543 0.0101213 0.00988558 0.00982517 0.00969681 0.00860469 0.00788992 0.00665747 0.0061049 0.00505263 0.00496429 0.00311728 0.00223614 0.00192889 0.00192494 0.00102849 0.000927526 0.00166164 0.00045405 0.000430245 0.000180656 7.94668e-05 4.25778e-07 5.012e-07 9.83416e-08
threshold=13.500000000000002 72.500000000000014 1.0000000180025095e-35 1.0000000180025095e-35 17.500000000000004 36.500000000000007 204.50000000000003 1.0000000180025095e-35 16.500000000000004 28.500000000000004 1.5000000000000002 4.5000000000000009 0 4.5000000000000009 1.5000000000000002 55.500000000000007 1 2 73.500000000000014 78.500000000000014 79.500000000000014 7.5000000000000009 4.5000000000000009 1.0000000180025095e-35 1.5000000000000002 3 92.500000000000014 81.500000000000014 7.5000000000000009 4.5000000000000009 4 2.5000000000000004 22.500000000000004 19.500000000000004 18.500000000000004 14.500000000000002 5 42.500000000000007 48.500000000000007 23.500000000000004 6 207.50000000000003 240.50000000000003 245.50000000000003 303.50000000000006 1.5000000000000002 32.500000000000007 26.500000000000004 248.50000000000003 1.5000000000000002 7 4.5000000000000009 218.50000000000003 27.500000000000004 4.5000000000000009 4.5000000000000009 738.50000000000011 8 75.500000000000014 9 8.5000000000000018 21.500000000000004 23.500000000000004 6.5000000000000009 2.5000000000000004 10 11.500000000000002 5.5000000000000009 11 329.50000000000006 6.5000000000000009 12 13 3.5000000000000004 2.5000000000000004 2.5000000000000004 14 7.5000000000000009 10.500000000000002 12.500000000000002 9.5000000000000018 11.500000000000002 15 1.5000000000000002 10.500000000000002 1.5000000000000002 16 1.5000000000000002 17 5.5000000000000009 18 19 3.5000000000000004 11.500000000000002 20 11.500000000000002 21 22 23
decision_type=2 2 2 2 2 2 2 2 2 2 2 2 9 2 2 2 9 1 2 2 2 2 2 2 2 1 2 2 2 2 1 2 2 2 2 2 9 2 2 2 9 2 2 2 2 2 2 2 2 2 1 2 2 2 2 2 2 9 2 1 2 2 2 2 2 1 2 2 1 2 2 1 1 2 2 2 1 2 2 2 2 2 1 2 2 2 1 2 1 2 9 1 2 2 1 2 9 1 1
left_child=2 4 3 90 7 -6 18 32 10 12 -9 -12 21 14 17 -16 28 -10 -3 50 -21 22 23 24 -4 27 -27 -22 29 31 67 49 33 34 35 -2 39 53 -39 -34 41 -8 51 -44 -45 -24 62 -41 -42 -5 58 59 -53 -38 75 73 63 -48 -20 -43 -23 65 -15 64 -50 -35 71 -31 81 -65 -32 84 -25 74 85 87 -33 86 83 -68 -73 -62 93 -57 -30 -14 89 94 92 -56 91 -1 -77 -79 -18 -70 98 -98 -92
right_child=1 6 9 16 5 -7 40 8 13 -11 11 -13 55 46 15 -17 54 -19 19 20 25 60 45 72 -26 26 -28 -29 66 30 70 76 36 61 -36 -37 37 38 -40 47 48 42 43 44 -46 -47 57 -49 56 -51 -52 52 -54 -55 77 78 -58 -59 -60 -61 68 -63 -64 69 -66 -67 79 -69 95 -71 -72 80 -74 -75 -76 88 -78 82 -80 -81 -82 -83 -84 -85 -86 -87 -88 -89 -90 -91 96 -93 -94 -95 -96 -97 97 -99 -100
leaf_value=-0.024570052141831424 0.0020886502040761467 0.028191546851728047 0.0068161094752330455 -0.0037106608486338235 0.067553462671760447 -0.002634774004002036 0.032330049603366953 0.048604655811811809 -0.010398057941891942 0.017590389034027636 -0.0177174900000702 0.030535658111632776 -0.023744632255855463 -0.016757079832146037 0.0031989217905854504 0.024287889085901047 -0.023941209413292131 0.0055001190500998517 -0.0091981467389279942 0.052093041587195243 0.020642972306697833 -0.020799989824202808 0.021164784511928578 -0.020661806578695426 -0.011750634650973465 0.00081804097589309303 0.01233994327074686 0.0051594319290036812 -0.018529550024414591 0.0047993071153172029 -0.019638853924669044 -0.022219461853960815 0.0079028758943211659 -0.016899957443083573 0.022874299842007131 -0.016787061301008609 -0.013813090432691156 0.052821390981582762 -0.0024078246041056121 -0.016114673216597809 0.0053942382628803989 0.0045322067657309695 0.033139389759461041 0.010784689618477653 0.016052324562621945 0.002154495911837737 0.0011216555851260288 -0.005938309025115376 0.010760872335973629 -0.010695541694080293 0.0031554706107723082 0.0069678656534131944 0.014470136075189455 -0.0058404375409854097 -0.020420289978873515 -0.019033513916252319 0.015765630764382321 -0.0046125415289296158 -0.0024091368235355831 0.0095513035402358948 -0.01774178471674143 -0.0195333966619919 -0.01113836788573444 0.0091519732667435221 0.01721309038853296 -0.011987271347612939 -0.015052652605686601 0.007721892591276089 -0.012590167187934362 0.011352306005379204 -0.015423544583930691 -0.017039029905333718 -0.023384457132196546 -0.019303525100077018 -0.020316667353741411 -0.022268338804567769 -0.02023826802152965 -0.017989925740888299 -0.014609108010973438 -0.01224706081699805 -0.014397024674769988 -0.015069479611863352 -0.015008523021371732 -0.016696316740907848 -0.016573571094416102 -0.022509269932296905 -0.01809138664949627 -0.022797214039084412 -0.020324298613872582 -0.019176264244829204 -0.024827799148152096 -0.024802153770118421 -0.021530106388599816 -0.017220625618976172 -0.023494635881982077 -0.012921633635659091 -0.02481226660221364 -0.024829266676396664 -0.024824500243786327
leaf_weight=171.97671863436699 18.019865870475769 11.545509099960325 30.531555816531181 36.459792152047157 10.053886026144029 14.465235859155653 14.250362396240233 11.3809731900692 48.197798162698746 16.296151041984558 7.2532991617918006 8.0134249031543714 12.416624203324327 13.000867351889612 88.339864775538445 31.652569174766541 9.5337333083152807 31.688721269369125 8.1841954886913317 8.0151755809783918 14.764648050069807 7.3709207773208645 7.6601875275373486 6.6570195108652115 27.616036787629128 38.341774225234985 198.96376377344131 340.25670570135117 14.129666671156885 11.705143451690672 7.7740541100501996 14.487856477499008 14.617904782295225 12.626725435256958 10.118382692337034 37.514743775129318 7.0889935046434429 6.5655874013900783 15.296383932232855 14.910463392734526 25.201263189315796 16.047589778900146 14.564039349555967 86.518709242343903 319.33394545316696 14.857131019234656 7.917686402797699 168.24460279941559 31.088126361370087 22.871992334723473 10.852511912584307 11.489946871995924 23.081584572792053 12.943163946270941 2.616603299975397 4.417828291654585 17.791217446327209 48.317306399345398 11.177078574895857 14.885995447635652 5.3676902353763545 17.804598093032837 8.8226235359907133 18.272155523300171 16.271927237510681 6.2802158594131479 5.7395356893539411 21.73575147986412 4.6014461219310805 31.34237539768219 3.1300045698881149 5.9033476561307925 15.287716686725618 3.1342804431915274 4.036466881632804 4.3788589984178525 11.135977506637573 4.9055205434560758 3.1765247881412497 5.2170494198799133 5.4205440282821655 4.1192119568586349 2.8732021600008011 4.8522035926580429 4.2105835676193228 8.6737949922680837 3.5190247595310211 6.9724532961845389 2.453948348760604 4.5513341724872589 100.86852660775185 139.79216379672289 3.9723140224814415 2.8871057778596878 2.9702411144971856 2.9787345677614212 11.112730950117111 7.1092681884765634 29.111002013087273
leaf_count=1542 63 22 124 193 12 38 18 32 199 35 28 18 109 36 341 96 84 104 20 20 30 30 29 44 106 86 397 860 105 37 55 115 28 53 36 161 30 17 56 45 39 30 16 132 314 41 32 586 37 156 31 20 40 64 21 34 13 175 36 23 39 41 38 25 21 23 41 90 31 34 21 43 64 23 33 37 84 37 22 36 38 29 21 35 31 74 27 60 20 36 908 1257 33 21 26 20 100 64 262
internal_value=0 0.0071301 -0.0177843 -0.0205596 -0.000714784 0.0261454 0.0112362 -0.0017333 0.00283578 -0.00750757 0.0251186 0.00761034 -0.00994565 0.00069938 0.00362467 0.00876194 -0.0119158 -0.0040917 0.00813258 0.0077653 0.00826932 -0.00648851 -0.00406691 -0.0076342 -0.00200179 0.00767631 0.0104783 0.00580336 -0.0092081 -0.00699251 0.000520204 -0.010914 -0.00580214 -0.00974099 -0.00549364 -0.0106623 -0.00411982 0.00325721 0.0141786 -0.00568249 0.0143493 0.0152577 0.014757 0.0155602 0.0149294 0.00862162 -0.0067912 -0.00676676 0.0111033 -0.00640328 -0.00224936 0.00960178 0.0119767 -0.00866181 -0.0208264 -0.0207353 0.0123569 -0.00380519 -0.00527892 0.00694752 -0.0166562 -0.0173367 -0.0144856 0.0117315 0.0129777 -0.0152681 -0.0162606 0.00669892 -0.0148666 0.010542 -0.0184289 -0.0172002 -0.0225585 -0.0223833 -0.0227675 -0.0227827 -0.0213584 -0.0180521 -0.0169932 -0.0137168 -0.0157743 -0.0165815 -0.0169785 -0.0178102 -0.0180805 -0.0232366 -0.0191236 -0.0234636 -0.0215554 -0.0196304 -0.0247231 -0.0246741 -0.0219172 -0.0177049 -0.0238351 -0.0127204 -0.0248261 -0.0248189 -0.0248271
internal_weight=0 1953.38 865.578 681.526 671.136 24.5191 1282.24 646.617 304.585 184.052 26.6477 15.2667 167.755 277.937 199.879 119.992 221.556 79.8865 642.101 630.556 600.342 127.048 102.61 80.0923 58.1476 592.327 237.306 355.021 169.921 129.301 44.345 84.9556 342.032 102.365 65.653 55.5346 239.667 41.8941 21.862 197.773 640.139 500.172 485.922 420.417 405.853 22.5173 78.0585 183.155 139.967 59.3318 30.2138 65.5051 34.5715 20.0322 51.6343 40.7077 114.766 56.235 19.3613 30.9336 24.438 36.7115 21.8235 96.9746 47.3601 18.9069 40.6207 33.4409 17.0671 49.6145 10.9041 29.6641 21.9447 28.2612 25.1269 30.2815 25.6238 21.3528 12.4466 10.9566 11.3239 9.4869 10.6658 9.27003 18.3403 21.0904 10.687 19.4764 10.8051 7.16794 459.97 311.769 8.35117 7.79263 12.504 7.58018 148.202 18.222 129.98
internal_count=11139 4616 6523 5601 2352 50 2264 2302 1099 922 78 46 887 1021 740 437 1468 303 1502 1480 1393 557 408 338 230 1373 483 890 1045 751 203 548 1203 377 260 224 826 167 73 659 762 593 575 462 446 70 281 631 169 349 87 113 60 94 423 330 130 207 56 53 149 117 74 117 58 76 294 127 119 59 76 217 108 239 216 260 199 163 91 77 81 68 79 69 136 183 84 170 90 57 4133 2799 70 58 110 51 1334 164 1170
cat_boundaries=0 1 2 3 4 5 6 7 8 9 10 11 12 13 14 15 16 17 18 19 20 21 22 23 24
cat_threshold=2 2 1 1 1 2 2 1 1 1 1 1 1 2 1 1 1 1 2 1 1 1 1 1
is_linear=0
shrinkage=0.05


Tree=34
num_leaves=120
num_cat=27
split_feature=2 2 3 2 3 2 3 3 0 2 2 3 2 2 2 0 0 2 1 2 2 1 3 3 2 2 2 1 3 2 2 2 2 1 2 2 2 2 2 2 2 1 0 2 2 2 2 3 2 1 2 2 2 2 2 2 2 3 3 2 1 1 2 3 2 2 3 1 2 3 2 2 2 2 2 2 3 2 2 2 2 1 2 1 2 2 2 2 2 1 2 2 2 1 3 2 2 1 2 2 2 2 1 3 2 3 1 2 1 2 0 1 2 2 1 2 0 1 1
split_gain=143.246 23.5203 9.83477 9.88419 6.87645 5.84207 21.8568 5.18152 7.96513 10.3863 4.55371 4.28362 3.57272 2.65651 8.46677 2.47122 2.12139 1.71996 1.61666 3.66578 9.93725 1.25109 1.55958 3.44425 3.30174 1.19383 3.07221 1.61316 1.30804 3.61872 1.28503 1.04356 1.47456 1.99792 1.58332 0.997277 5.76484 0.879619 1.29799 3.6368 1.69275 1.42981 1.05656 2.05416 4.98919 1.11323 0.822253 0.692972 1.98669 4.66642 1.24894 1.09508 2.42089 0.885618 0.555565 1.04555 0.518032 0.410008 0.3792 0.702358 0.28015 0.270616 0.266407 0.253753 0.240951 0.237338 0.203842 0.189028 0.171617 0.142106 0.113972 0.113444 0.107835 0.101473 0.0991642 0.0948158 0.11429 0.0842663 0.0672857 0.0668884 0.0530277 0.0452045 0.0420089 0.040263 0.0387357 0.0302834 0.0266977 0.026666 0.0242396 0.0214661 0.0160894 0.0159208 0.0149516 0.0149135 0.0135743 0.0117484 0.0103066 0.0100264 0.00986896 0.00969375 0.00852959 0.00786999 0.00610468 0.00507203 0.00498156 0.00317972 0.0022522 0.00196871 0.00195232 0.00103835 0.000950574 0.00170266 0.000461393 0.000431626 0.000184603 1.11625e-05 4.36503e-07 5.13818e-07 1.0083e-07
threshold=13.500000000000002 72.500000000000014 1.0000000180025095e-35 1.0000000180025095e-35 1.0000000180025095e-35 25.500000000000004 17.500000000000004 2.5000000000000004 0 15.500000000000002 204.50000000000003 28.500000000000004 16.500000000000004 55.500000000000007 57.500000000000007 1 2 73.500000000000014 3 32.500000000000007 28.500000000000004 4 3.5000000000000004 2.5000000000000004 5.5000000000000009 78.500000000000014 81.500000000000014 5 2.5000000000000004 80.500000000000014 92.500000000000014 7.5000000000000009 4.5000000000000009 6 2.5000000000000004 65.500000000000014 64.500000000000014 22.500000000000004 19.500000000000004 18.500000000000004 14.500000000000002 7 8 42.500000000000007 48.500000000000007 23.500000000000004 112.50000000000001 2.5000000000000004 243.50000000000003 9 468.50000000000006 314.50000000000006 334.50000000000006 572.50000000000011 26.500000000000004 27.500000000000004 210.50000000000003 165.50000000000003 1.5000000000000002 1.0000000180025095e-35 10 11 1.5000000000000002 60.500000000000007 222.50000000000003 27.500000000000004 15.500000000000002 12 69.500000000000014 21.500000000000004 27.500000000000004 4.5000000000000009 48.500000000000007 4.5000000000000009 41.500000000000007 8.5000000000000018 5.5000000000000009 75.500000000000014 299.50000000000006 21.500000000000004 16.500000000000004 13 16.500000000000004 14 11.500000000000002 4.5000000000000009 21.500000000000004 269.50000000000006 5.5000000000000009 15 4.5000000000000009 6.5000000000000009 56.500000000000007 16 3.5000000000000004 2.5000000000000004 2.5000000000000004 17 7.5000000000000009 10.500000000000002 12.500000000000002 9.5000000000000018 18 1.5000000000000002 10.500000000000002 1.5000000000000002 19 1.5000000000000002 20 5.5000000000000009 21 22 3.5000000000000004 11.500000000000002 23 20.500000000000004 24 25 26
decision_type=2 2 2 2 2 2 2 2 9 2 2 2 2 2 2 9 9 2 1 2 2 1 2 2 2 2 2 1 2 2 2 2 2 1 2 2 2 2 2 2 2 1 9 2 2 2 2 2 2 1 2 2 2 2 2 2 2 2 2 2 1 1 2 2 2 2 2 1 2 2 2 2 2 2 2 2 2 2 2 2 2 1 2 1 2 2 2 2 2 1 2 2 2 1 2 2 2 1 2 2 2 2 1 2 2 2 1 2 1 2 9 1 2 2 1 2 9 1 1
left_child=2 4 3 110 37 6 7 8 9 -6 17 15 -9 18 -15 21 31 -3 65 20 -20 22 23 24 -4 67 28 46 29 -27 -29 32 34 88 62 36 -16 38 39 40 41 -2 45 70 -45 -39 -28 48 49 64 61 56 -53 -52 81 -56 -49 66 59 -23 63 87 -5 -58 -12 -7 -54 77 -37 -62 -44 96 -67 94 -21 76 -60 -19 -63 83 -42 -47 -10 -40 93 -61 -14 -50 -34 -72 -24 -35 -46 104 95 105 107 -36 106 103 -86 -95 113 -75 -33 -17 109 114 -98 -73 111 -1 -110 -100 -18 -85 118 -118 -112
right_child=1 10 11 16 5 13 -8 12 82 -11 47 -13 86 14 35 73 71 25 19 74 -22 58 90 -25 -26 26 27 30 -30 -31 -32 84 33 91 97 68 -38 42 79 -41 80 -43 43 44 92 54 -48 51 50 -51 53 52 57 -55 55 -57 60 -59 75 85 69 78 -64 -65 -66 72 -68 -69 -70 -71 89 98 -74 99 -76 -77 -78 -79 -80 -81 -82 -83 -84 115 100 -87 -88 -89 -90 -91 -92 -93 -94 101 -96 -97 108 -99 102 -101 -102 -103 -104 -105 -106 -107 -108 -109 112 -111 116 -113 -114 -115 -116 -117 117 -119 -120
leaf_value=-0.024563605754071832 -0.016361003645161826 0.026717682996651018 0.0037400129519443827 -0.0036321509858855427 0.080588850787509103 -0.015631184351395086 0.09918285724307456 0.017417755297929449 -0.018830923668090433 0.01674306432210175 0.034838525349903747 0.01685073452649663 -0.014851718394147426 0.05981619588358425 -0.0014500738493493411 -0.02371857033824051 -0.02346290776681581 -0.0090537059711339306 -0.011035188639059702 -0.0074436284904535154 0.078338498783286623 0.00038305111750421212 -0.021916061178453957 0.036058282534859459 -0.020911248190275795 0.035518278210712982 0.0012411086722622909 0.0011963700448603966 0.038889896464445108 -0.0077902513110277493 0.011884095375823286 -0.018411730650475352 0.0046574512471932051 -0.019535912405404584 -0.022160822834951396 -0.007137370624548338 0.045303103776114149 0.0076452163523017067 -0.011832404987677715 0.021795500134544413 -0.017992299307591882 0.012794549927002356 -0.013659867183895417 0.048826216939188698 -0.0041880388329140796 -0.012877765431935468 0.0066018987255422228 -9.0480211842072978e-05 0.0066388877440175745 0.0072472710570339431 0.026390291216991487 0.031283050443911074 0.014631855866605523 0.014597324018613753 0.0065882865453500208 -0.0070847432272889733 0.0072042093664584812 0.019074701545004971 -0.021267324655691922 -0.021843860937856716 0.014915543689674005 0.010809246612421886 -0.010543561854106816 0.014836823553214374 0.044473559011962358 -0.0080489814475604195 0.011377682318469445 0.003067304696032459 0.00037717067407897783 0.0096898366392792357 -0.0073380199053711855 -0.020329331168750041 -0.0035774589869217812 -0.018922144151079595 -0.0023676053244089425 -0.011533141541142761 -0.011058086454470109 -0.002355058544063194 0.014696918321526843 -0.019428933313981548 -0.013971882833417696 -0.018461509260610624 -0.01289199878653617 -0.016724616418428234 -0.014904375262055096 -0.016014457035322213 -0.018036026073697625 0.0090169546614415653 0.0074715037307528064 -0.0031369123424985624 -0.018125852807584185 -0.015277349623420814 -0.0010183362853264809 -0.016905154447179504 -0.019195822485971251 -0.020224048832948534 -0.020231800996160121 -0.020144407388680483 -0.017865773635882137 -0.014458704780729218 -0.012092018215655739 -0.014245744351411696 -0.014860016551788081 -0.016559386877506573 -0.016435603888050463 -0.022456455668478349 -0.017968379356902302 -0.022750356398706352 -0.022210671010654021 -0.019066815393997818 -0.024827762286230529 -0.02480147429824936 -0.021458306073062393 -0.017088465605468405 -0.023919691399764555 -0.01682073212775154 -0.024829266696136693 -0.024811838995329596 -0.024824380176662237
leaf_weight=167.80272442102432 6.6655024439096451 11.875626087188719 46.895945817232132 36.324753172695637 7.7761298865079871 9.1635789722204191 7.0724676251411429 11.0685938000679 4.1953420639038077 35.226467952132225 14.528812825679781 16.585342764854431 13.217965528368952 6.9851182848215094 35.473972618579865 12.125268585979947 2.9012698233127594 8.1092613637447375 7.4563320875167829 17.127980530261993 5.3359060734510422 10.794136464595796 5.923771917819975 6.0360218286514273 19.121895864605904 10.919386386871341 101.87490808963776 32.688357800245285 9.6420758068561536 8.6397115588188171 201.43417629599571 13.870261102914812 11.761454313993452 7.622870132327078 14.169495068490505 20.37028756737709 8.0985568165779096 14.733885526657103 6.2053824812173843 10.352500855922697 24.582075998187065 11.392040312290193 6.9917458593845394 6.9217136204242733 6.42906430363655 6.5386562943458557 240.14186483621597 13.591806709766386 15.191348075866697 20.36294424533844 25.637404143810272 19.941855013370514 71.843496263027191 42.000985741615295 15.399451732635496 151.8490227162838 72.931515365839005 26.18320620059967 14.679207369685178 3.803985580801962 33.973253667354584 17.000264704227448 22.628667995333672 12.800704598426817 11.72557497024536 67.827293857932091 145.75118488073349 10.886810988187792 12.117720946669577 21.082880795001984 7.9400829672813389 2.5637134462595004 16.828362569212914 4.334536597132681 21.954540058970451 4.924052119255065 3.3708429187536231 11.150183856487272 32.230012059211731 17.460188686847687 12.308163180947302 8.1334556043148023 10.258321598172186 7.2230050861835497 5.6537875831127149 5.3771899789571762 13.112021774053572 52.622729957103729 21.904241144657135 4.927707552909852 5.3096818178892136 3.0820992887020111 8.8305330574512464 5.8036123663187045 3.0743580162525168 3.9552867636084548 2.4045770466327667 10.912869930267334 4.8180595785379392 3.1304559111595145 5.1535457074642181 5.3430637121200562 2.8304016143083572 4.7718621343374252 4.1413744688034049 8.4807353764772397 3.4559331983327866 6.8152990937232962 4.2824269086122495 4.4648880064487457 98.395020216703415 136.36765647679567 3.8877035602927208 2.8378137052059174 9.3081949353218132 5.1921228766441345 6.9349236488342285 10.840391367673876 28.397232204675674
leaf_count=1542 27 22 167 193 21 32 6 30 17 106 23 35 50 26 128 109 26 20 26 57 23 47 22 23 81 26 314 72 19 19 397 105 37 55 115 54 12 28 23 36 96 36 30 17 24 20 546 20 24 29 21 23 73 31 24 562 118 20 77 25 46 23 156 19 19 295 139 31 39 28 41 21 72 34 69 33 21 36 34 41 65 25 53 31 41 35 33 72 90 23 26 21 32 43 23 33 20 84 37 22 36 38 21 35 31 74 27 60 37 36 908 1257 33 21 84 22 64 100 262
internal_value=0 0.00690059 -0.0176583 -0.020471 -0.000700669 0.00443346 0.0143894 0.00806714 0.0174953 0.0282883 0.0108323 -0.00737892 -0.00641758 -2.95938e-06 0.00713407 -0.00979815 -0.0117617 0.00786471 -0.00407107 0.00301208 0.0262444 -0.00637069 -0.00279624 -9.46887e-05 -0.00340016 0.00751239 0.00799602 0.00719409 0.0238179 0.0163879 0.0103919 -0.00906436 -0.00686831 0.000505514 -0.0107617 0.00229593 0.00723965 -0.00569274 -0.00959461 -0.00538921 -0.010511 0.00203249 -0.0040355 0.00315919 0.013617 -0.00557359 0.00500511 0.0137906 0.0159865 0.0252099 0.0136584 0.0125757 0.0145336 0.0190673 -0.00664419 -0.0058258 0.00923127 0.0131634 -0.0133023 -0.00826379 0.0101312 0.0105327 -0.00628503 0.00834384 0.0391417 -0.0079875 0.0124521 -0.00219878 -0.00433452 0.0129144 -0.00852128 -0.0207422 -0.00716011 -0.0206495 -0.00459218 -0.0176831 -0.0193608 -0.00517555 0.0133544 -0.0172057 -0.0166509 -0.0159731 -0.0146158 -0.0151211 -0.0161201 -0.0184297 -0.0164375 0.00848423 0.00648839 -0.00572921 -0.0201246 -0.0183098 -0.00235377 -0.0170678 -0.022328 -0.02272 -0.0227355 -0.0212835 -0.0179287 -0.0168589 -0.0135633 -0.0156304 -0.0168441 -0.017684 -0.0179574 -0.0231991 -0.0190135 -0.0234311 -0.0214841 -0.0195273 -0.0247204 -0.0246702 -0.0218527 -0.0175776 -0.0238111 -0.0167648 -0.024826 -0.0248186 -0.024827
internal_weight=0 1967.51 850.375 667.68 670.743 330.667 101.927 94.8548 57.4563 43.0026 1296.76 182.695 37.3986 228.74 83.0457 166.109 218.942 647.362 145.694 51.8748 12.7922 126.237 83.2873 72.0539 66.0178 635.487 605.34 576.139 29.2012 19.5591 234.123 168.372 128.406 44.3707 84.0358 76.0605 43.5725 340.076 101.381 65.3003 54.9478 18.0575 238.695 42.0408 22.1813 196.654 342.017 649.4 231.3 46.6173 184.683 418.1 263.72 67.6384 181.921 167.248 154.38 243.778 42.9494 19.9753 140.788 117.044 58.9534 85.7322 26.2544 93.8192 217.595 30.1463 32.488 55.0561 19.8595 50.5703 84.6557 39.8725 39.0825 22.9741 18.0501 19.2594 49.2303 36.0807 36.8902 14.6721 14.4537 18.6205 39.9656 9.18118 26.33 67.8141 33.6657 12.8678 11.2335 10.705 15.2596 29.1583 27.6356 24.5613 29.5995 25.0824 20.9708 12.2369 10.8073 11.1467 10.4863 9.1064 18.0116 20.606 10.4845 19.0248 10.5747 7.0286 448.738 304.17 8.17013 7.65587 12.2095 12.4151 144.568 17.7753 126.792
internal_count=11139 4616 6523 5601 2352 1149 316 310 197 127 2264 922 113 833 259 887 1468 1502 574 175 49 557 319 271 248 1480 1393 1329 64 45 469 1045 751 203 548 233 140 1203 377 260 224 63 826 167 73 659 860 762 276 71 205 486 255 52 631 586 231 232 238 107 211 153 349 137 42 399 212 87 93 74 94 423 367 330 126 131 98 56 57 117 161 45 70 76 294 60 83 96 127 64 48 76 56 217 239 216 260 199 163 91 77 81 79 69 136 183 84 170 90 57 4133 2799 70 58 110 53 1334 164 1170
cat_boundaries=0 1 2 3 4 5 6 7 8 9 10 11 12 13 14 15 16 17 18 19 20 21 22 23 24 25 26 27
cat_threshold=2 2 2 1 1 1 1 2 2 1 1 1 1 2 2 1 1 1 1 1 2 2 1 2 1 2 1
is_linear=0
shrinkage=0.05


Tree=35
num_leaves=118
num_cat=27
split_feature=2 2 3 2 3 2 3 3 0 2 2 3 2 2 2 0 0 2 1 2 2 1 3 3 2 2 2 3 2 2 2 1 2 2 2 2 2 2 2 1 0 2 2 2 0 3 2 1 2 2 2 2 2 2 3 1 3 2 2 2 1 2 3 1 2 2 2 2 2 2 2 3 2 2 2 2 2 3 3 1 2 1 2 2 2 2 1 2 2 2 1 2 3 2 2 1 2 2 2 2 1 3 2 3 1 2 1 2 0 1 2 2 1 2 0 1 1
split_gain=137.787 22.0029 9.79119 9.95568 6.54243 5.43756 18.3377 4.82784 7.33629 8.67372 4.18898 4.07523 3.41654 2.51674 7.49967 2.43885 2.1039 1.56662 1.54922 3.39059 8.59025 1.21674 1.51795 3.16819 3.20652 1.12002 5.08456 1.09575 2.52961 1.02499 1.42662 1.92226 1.56532 0.942596 5.20264 0.853244 1.27482 3.43796 1.65094 1.36206 1.01016 1.93557 4.46172 1.06354 0.680626 1.01217 2.43251 6.29863 1.41247 0.923863 2.5687 0.564523 0.543798 1.00063 0.443246 0.389952 0.375182 0.68601 0.369946 0.25866 0.240873 0.232858 0.190127 0.18055 0.165049 0.114783 0.111494 0.104519 0.102508 0.0956909 0.0947071 0.114516 0.0887833 0.0814951 0.0670244 0.0529683 0.0525132 0.0504433 0.161122 0.045095 0.0418665 0.0400202 0.0386198 0.0304839 0.0266869 0.0226178 0.0207518 0.0193673 0.016259 0.0159752 0.0149274 0.0143281 0.0137736 0.0119435 0.0104936 0.0101669 0.00990929 0.00968669 0.00845124 0.0078467 0.00610193 0.0050896 0.00499699 0.00324302 0.0022676 0.00200915 0.00197964 0.00104799 0.000974225 0.00174466 0.000468766 0.000432845 0.000188622 1.11689e-05 4.47462e-07 5.2655e-07 1.03381e-07
threshold=13.500000000000002 72.500000000000014 1.0000000180025095e-35 1.0000000180025095e-35 1.0000000180025095e-35 25.500000000000004 17.500000000000004 2.5000000000000004 0 15.500000000000002 204.50000000000003 28.500000000000004 16.500000000000004 55.500000000000007 57.500000000000007 1 2 73.500000000000014 3 32.500000000000007 28.500000000000004 4 3.5000000000000004 2.5000000000000004 5.5000000000000009 78.500000000000014 79.500000000000014 1.0000000180025095e-35 81.500000000000014 7.5000000000000009 4.5000000000000009 5 2.5000000000000004 65.500000000000014 64.500000000000014 22.500000000000004 19.500000000000004 18.500000000000004 14.500000000000002 6 7 42.500000000000007 48.500000000000007 23.500000000000004 8 2.5000000000000004 243.50000000000003 9 468.50000000000006 299.50000000000006 327.50000000000006 82.500000000000014 26.500000000000004 27.500000000000004 165.50000000000003 10 1.5000000000000002 1.0000000180025095e-35 248.50000000000003 1.5000000000000002 11 27.500000000000004 21.500000000000004 12 69.500000000000014 4.5000000000000009 27.500000000000004 48.500000000000007 4.5000000000000009 41.500000000000007 8.5000000000000018 5.5000000000000009 738.50000000000011 75.500000000000014 21.500000000000004 16.500000000000004 252.50000000000003 6.5000000000000009 2.5000000000000004 13 16.500000000000004 14 11.500000000000002 4.5000000000000009 21.500000000000004 5.5000000000000009 15 329.50000000000006 4.5000000000000009 6.5000000000000009 16 56.500000000000007 3.5000000000000004 2.5000000000000004 2.5000000000000004 17 7.5000000000000009 10.500000000000002 12.500000000000002 9.5000000000000018 18 1.5000000000000002 10.500000000000002 1.5000000000000002 19 1.5000000000000002 20 5.5000000000000009 21 22 3.5000000000000004 11.500000000000002 23 20.500000000000004 24 25 26
decision_type=2 2 2 2 2 2 2 2 9 2 2 2 2 2 2 9 9 2 1 2 2 1 2 2 2 2 2 2 2 2 2 1 2 2 2 2 2 2 2 1 9 2 2 2 9 2 2 1 2 2 2 2 2 2 2 1 2 2 2 2 1 2 2 1 2 2 2 2 2 2 2 2 2 2 2 2 2 2 2 1 2 1 2 2 2 2 1 2 2 2 1 2 2 2 2 1 2 2 2 2 1 2 2 2 1 2 1 2 9 1 2 2 1 2 9 1 1
left_child=2 4 3 108 35 6 7 8 9 -6 17 15 -9 18 -15 21 29 -3 61 20 -20 22 23 24 -4 63 -27 51 -29 30 32 85 59 34 -16 36 37 38 39 -2 43 66 -43 -37 45 46 47 -12 60 55 -51 -28 79 -54 -52 76 57 -23 -46 -5 -48 -7 -57 73 -35 94 -42 -63 92 -21 71 -58 77 -19 81 -40 -47 78 -60 -45 -10 113 90 -59 -14 -32 -68 -79 -24 -33 102 -44 93 103 105 -34 104 101 -84 -92 111 -70 -31 -17 107 112 110 -67 109 -1 -96 -98 -18 -38 116 -116 -110
right_child=1 10 11 16 5 13 -8 12 80 -11 44 -13 84 14 33 68 65 25 19 69 -22 56 88 -25 -26 26 27 28 -30 82 31 89 95 64 -36 40 74 -39 75 -41 41 42 91 52 58 49 48 -49 -50 50 54 -53 53 -55 -56 62 70 83 72 -61 -62 67 -64 -65 -66 96 86 -69 97 -71 -72 -73 -74 -75 -76 -77 -78 87 -80 -81 -82 -83 98 -85 -86 -87 -88 -89 -90 -91 99 -93 -94 -95 106 -97 100 -99 -100 -101 -102 -103 -104 -105 -106 -107 -108 -109 114 -111 -112 -113 -114 -115 115 -117 -118
leaf_value=-0.024556998819267754 -0.016221314462841488 0.025358700461361374 0.0036333624807923844 -0.0035550209219005822 0.072426636553604137 -0.015486277762744678 0.087473274972600032 0.016688277276319979 -0.01871689916483437 0.016052812423122644 0.046955731391202418 0.016154280400981772 -0.014702428701942653 0.054901479525631819 -0.0014161476821021722 -0.023691911351477662 -0.023430469286798105 -0.0089102302725649705 -0.010882125300885861 -0.0073137332797543328 0.070564953008457457 0.00037339460644628488 -0.021851510925717219 0.033901891403206166 -0.020828455239266869 0.045552213843022688 -0.0057754294289715739 0.032634225564665525 0.0080218884375608326 -0.018292478270977543 0.0045204381245220627 -0.01943148459514802 -0.022101028244175171 -0.0070106453262202585 0.042196781030112762 0.0073978886608345 -0.016587930022938097 0.020790284904658556 -0.017868173722717508 0.012316236430647623 -0.013506248067565636 0.045316287351814026 -0.0041014113283548122 -0.018342859557105479 0.0047829459709960373 0.0048528761656635722 0.008224070496823159 0.0075011189394021058 0.020693622054292801 0.030141620971028273 0.011560270959436833 0.0048523054290968513 0.0063819792904998094 -0.0069585814329155248 0.018809859954675726 0.015412528335787587 -0.021190760133821356 -0.021777930753844113 0.0098756594040491641 -0.010392143391770138 0.013266164042551971 -0.0079133723231232366 0.0085742264418315946 0.002981868482489573 0.00036766533292310194 -0.020236915125335278 -0.0072091967263704735 -0.003501295348992291 -0.018809304323326809 -0.0023143620379853414 -0.0113789080918399 -0.010904958202785656 0.01460071585556638 -0.0023020679754424864 -0.019322984809686625 -0.013819119835000331 0.0078576208958610599 0.0084299088985614508 0.015928143845634089 -0.012722860983063779 -0.01273710726660787 -0.011677707158359172 -0.014755342996713506 -0.01587215624810568 -0.017912391302585717 0.0072310672098158495 -0.0030687586653104161 0.010454760694532363 -0.018003239611898137 -0.015130303022470662 -0.016770057629964388 -0.00099407642024878064 -0.019086639683672673 -0.020129964334441211 -0.022151859577472358 -0.020049076734256953 -0.017740247223958592 -0.014307670106544351 -0.011937064252196148 -0.014093895946516661 -0.014710767070544998 -0.0164213024403899 -0.016296508953223036 -0.022402567768448442 -0.017843986542871226 -0.022702519164558708 -0.020137838749828118 -0.018955889582156587 -0.024827724898594965 -0.024800774732653665 -0.021385189594897897 -0.016955049602372908 -0.023897673458691801 -0.016684883494606787 -0.024811402750746961 -0.024829265375191482 -0.024824257506019201
leaf_weight=163.73109537363052 6.5573355257511139 12.197192043066023 47.071665748953819 36.193055205047131 8.4287426173686963 9.0214551687240583 7.8099010586738578 11.263072758913038 4.1170790791511527 35.821232303977013 20.925743043422699 16.867186307907104 13.023106575012209 7.4156907200813285 35.422569781541824 11.841058433055887 2.8339900523424149 8.0361737906932849 7.3745023906230909 17.000959694385529 5.7707220613956451 10.798272058367731 5.795358330011366 6.2576419860124579 18.726184964179993 8.7600572109222394 13.404846817255018 10.724427014589308 393.21107989549637 13.617222368717195 11.81636145710945 7.4753957986831647 13.858940973877907 20.22541481256485 8.4738840460777265 14.846961259841917 7.1032073497772217 10.580615907907484 24.143742546439171 11.538732826709749 6.8968887776136425 7.2680613994598415 6.4021954536437979 7.9846771955490095 25.721499443054199 38.36559471487999 53.425198316574097 19.58117288351059 51.971313536167145 22.774716973304749 177.02363896369934 184.11462849378586 15.501242637634276 150.7770132869482 23.934977173805237 22.212775230407715 14.370316363871103 3.7217928022146207 31.881086051464081 22.391334265470505 42.553507685661316 67.283543840050697 18.73991721868515 10.920255392789842 12.122292309999464 2.5121209770441073 7.8820317387580845 16.768267318606377 4.2532890364527685 21.902621880173683 4.8675884157419196 3.3337732404470435 18.316839098930359 11.123955458402632 17.124229893088341 12.137391090393065 23.41583925485611 18.668848276138306 16.784927129745483 6.4549931138753891 10.126920178532599 6.1323907077312478 5.5701463073492032 5.2917629927396774 12.877653017640112 22.068511694669724 4.9122738391160974 32.139654338359833 5.2143063396215439 3.0353706032037735 5.7063260227441805 8.8215450346469861 3.0159059390425673 3.8760983422398558 4.1883598044514638 10.695236027240753 4.7327456623315793 3.085519313812255 5.0916041135787964 5.267487108707428 2.7886528074741364 4.6934937983751297 4.073864832520484 8.292410656809805 3.394390195608139 6.6619987785816184 2.3564169406890869 4.3805632591247559 95.982163190841675 133.02713788300753 3.8051687255501747 2.7897319346666336 9.0881871879100853 5.1055179834365845 10.574730485677719 6.7648549079895028 27.700966447591782
leaf_count=1542 27 22 167 193 21 32 6 30 17 106 32 35 50 26 128 109 26 20 26 57 23 47 22 23 81 20 32 21 883 105 37 55 115 54 12 28 31 36 96 36 30 17 24 25 39 64 75 28 38 26 171 437 24 562 18 30 77 25 37 156 49 295 25 31 39 21 41 72 34 69 33 21 13 36 41 65 37 25 21 20 53 23 41 35 33 90 23 34 26 21 43 32 23 33 37 84 37 22 36 38 21 35 31 74 27 60 20 36 908 1257 33 21 84 22 100 64 262
internal_value=0 0.00667888 -0.0175311 -0.0203811 -0.000689059 0.00429407 0.0138055 0.00779101 0.0167445 0.0267909 0.0104469 -0.00725183 -0.00630128 -7.54689e-06 0.0068994 -0.0096517 -0.0116077 0.00760765 -0.00398926 0.00291898 0.0248729 -0.00625473 -0.00273731 -9.52486e-05 -0.00332851 0.00726951 0.0077338 0.00718298 0.00867534 -0.00892158 -0.00674547 0.000491262 -0.0106098 0.00223061 0.007003 -0.00558493 -0.00944931 -0.00528671 -0.0103607 0.0019753 -0.00395264 0.00306487 0.0130863 -0.0054663 0.0132605 0.0141092 0.0170269 0.0278832 0.0140545 0.0124249 0.0142273 0.00413104 -0.00652317 -0.00571491 0.0124237 0.00849972 -0.0131483 -0.0081271 0.0102155 -0.00616821 0.0104596 -0.00785251 0.0122833 -0.00214922 -0.00424563 -0.0206566 -0.00838186 -0.00703317 -0.0205623 -0.0044991 -0.0175556 -0.0192539 0.0114017 -0.00507367 -0.0170735 -0.0165136 0.00599171 0.0108127 0.0119632 -0.0158305 -0.0144655 -0.0149732 -0.0159786 -0.0183107 -0.0162984 0.00628581 -0.00561951 0.00971076 -0.0200289 -0.0181894 -0.0169342 -0.00230084 -0.0222715 -0.0226716 -0.0226874 -0.0212072 -0.0178039 -0.0167234 -0.0134095 -0.0154855 -0.0167085 -0.0175566 -0.0178329 -0.0231609 -0.0189018 -0.023398 -0.0214115 -0.0194228 -0.0247177 -0.0246663 -0.0217869 -0.0174491 -0.0237866 -0.0166285 -0.0248259 -0.0248184 -0.0248269
internal_weight=0 1981.35 835.548 654.174 670.421 332.25 103.468 95.6578 58.494 44.25 1310.93 181.374 37.1638 228.782 83.6599 164.506 216.393 652.493 145.122 52.0488 13.1452 125.449 83.0652 72.0555 65.7979 640.295 610.215 601.455 403.936 166.861 127.534 44.3956 83.1386 76.2442 43.8965 338.171 100.423 64.9578 54.3772 18.0961 237.748 42.183 22.4918 195.565 658.437 514.924 188.457 40.5069 147.95 326.467 223.733 197.519 180.718 166.278 200.959 102.734 42.3835 19.8118 143.513 58.5844 95.9787 93.0733 40.9527 30.0804 32.3477 49.5323 19.6912 84.0518 39.0578 38.9036 22.5717 17.7041 117.791 19.1601 35.4653 36.2811 61.7814 99.4745 48.666 14.4397 14.244 18.3411 39.3267 9.01356 25.9008 33.8849 12.7943 50.8085 11.0097 10.5108 28.6649 15.2237 27.0255 24.0096 28.9341 24.5542 20.5982 12.0323 10.6618 10.9738 10.3111 8.94678 17.6911 20.1335 10.2871 18.5842 10.3499 6.89268 437.781 296.758 7.99353 7.52248 11.9222 12.2087 141.023 17.3396 123.683
internal_count=11139 4616 6523 5601 2352 1149 316 310 197 127 2264 922 113 833 259 887 1468 1502 574 175 49 557 319 271 248 1480 1393 1373 904 1045 751 203 548 233 140 1203 377 260 224 63 826 167 73 659 762 593 222 60 162 371 215 469 631 586 189 156 238 107 169 349 124 399 55 87 93 423 94 367 330 126 131 98 130 56 117 161 101 117 58 45 70 76 294 60 83 127 64 59 48 76 217 56 239 216 260 199 163 91 77 81 79 69 136 183 84 170 90 57 4133 2799 70 58 110 53 1334 164 1170
cat_boundaries=0 1 2 3 4 5 6 7 8 9 10 11 12 13 14 15 16 17 18 19 20 21 22 23 24 25 26 27
cat_threshold=2 2 2 1 1 1 2 2 2 1 1 1 1 1 1 1 1 1 1 1 1 2 1 2 1 1 1
is_linear=0
shrinkage=0.05


Tree=36
num_leaves=110
num_cat=24
split_feature=2 2 3 2 3 2 3 3 0 2 3 2 2 0 2 2 2 0 2 1 2 2 2 1 3 3 2 2 2 2 3 2 2 2 2 1 2 3 3 2 2 2 2 1 0 2 2 2 2 2 2 3 2 2 2 1 2 2 3 1 2 2 2 2 2 2 3 2 2 2 2 2 1 2 1 2 2 2 2 1 2 2 1 3 2 2 2 1 2 2 2 2 1 3 2 3 1 2 1 2 0 1 2 2 1 2 0 1 1
split_gain=132.551 20.5943 9.74449 10.0252 6.22587 5.06638 15.5876 4.50318 6.77229 7.3225 3.87865 3.86567 3.26874 2.40607 2.38485 6.67884 2.37746 2.08575 1.53865 1.48465 3.14155 9.04142 1.44268 1.18297 1.47722 2.92049 3.1139 1.03389 2.58859 2.27519 3.01394 1.44493 5.48718 1.00634 1.37988 1.84964 1.547 0.900106 6.95848 0.827391 1.2516 3.25248 1.6098 1.29803 0.965784 1.82488 4.00641 1.01608 0.597341 0.532079 0.957615 0.37105 0.669877 0.336824 1.45745 0.330203 0.251051 0.22837 0.219742 0.172441 0.133464 0.116107 0.109026 0.103525 0.10127 0.0945616 0.114703 0.0923134 0.0787912 0.0723811 0.0671346 0.052887 0.0449669 0.041707 0.0397613 0.0384876 0.0306756 0.0266651 0.0211171 0.0200551 0.0164257 0.0160239 0.0149352 0.0139728 0.0137283 0.0121398 0.0106824 0.010307 0.00994606 0.0096756 0.00836976 0.00782008 0.00609665 0.00510529 0.00501053 0.00330719 0.00228232 0.0020502 0.00200688 0.00105739 0.000998455 0.00178771 0.000476164 0.000433899 0.000192712 1.11707e-05 4.5878e-07 5.39809e-07 1.05889e-07
threshold=13.500000000000002 72.500000000000014 1.0000000180025095e-35 1.0000000180025095e-35 1.0000000180025095e-35 25.500000000000004 17.500000000000004 2.5000000000000004 0 15.500000000000002 28.500000000000004 198.50000000000003 16.500000000000004 1 55.500000000000007 57.500000000000007 205.50000000000003 2 212.50000000000003 3 32.500000000000007 29.500000000000004 73.500000000000014 4 3.5000000000000004 2.5000000000000004 5.5000000000000009 78.500000000000014 81.500000000000014 79.500000000000014 1.0000000180025095e-35 92.500000000000014 93.500000000000014 7.5000000000000009 4.5000000000000009 5 2.5000000000000004 2.5000000000000004 3.5000000000000004 22.500000000000004 19.500000000000004 18.500000000000004 14.500000000000002 6 7 42.500000000000007 48.500000000000007 23.500000000000004 1279.5000000000002 26.500000000000004 27.500000000000004 1.5000000000000002 1.0000000180025095e-35 242.50000000000003 245.50000000000003 8 1.5000000000000002 27.500000000000004 3.5000000000000004 9 207.50000000000003 4.5000000000000009 27.500000000000004 4.5000000000000009 48.500000000000007 8.5000000000000018 5.5000000000000009 41.500000000000007 75.500000000000014 64.500000000000014 21.500000000000004 16.500000000000004 10 16.500000000000004 11 11.500000000000002 4.5000000000000009 21.500000000000004 5.5000000000000009 12 4.5000000000000009 6.5000000000000009 13 3.5000000000000004 56.500000000000007 2.5000000000000004 2.5000000000000004 14 7.5000000000000009 10.500000000000002 12.500000000000002 9.5000000000000018 15 1.5000000000000002 10.500000000000002 1.5000000000000002 16 1.5000000000000002 17 5.5000000000000009 18 19 3.5000000000000004 11.500000000000002 20 20.500000000000004 21 22 23
decision_type=2 2 2 2 2 2 2 2 9 2 2 2 2 9 2 2 2 9 2 1 2 2 2 1 2 2 2 2 2 2 2 2 2 2 2 1 2 2 2 2 2 2 2 1 9 2 2 2 2 2 2 2 2 2 2 1 2 2 2 1 2 2 2 2 2 2 2 2 2 2 2 2 1 2 1 2 2 2 2 1 2 2 1 2 2 2 2 1 2 2 2 2 1 2 2 2 1 2 1 2 9 1 2 2 1 2 9 1 1
left_child=2 4 3 100 39 6 7 8 9 -6 13 22 -9 23 19 -16 -13 33 60 57 21 -21 -3 24 25 26 -4 59 29 -29 -31 58 -33 34 36 78 56 69 -39 40 41 42 43 -2 47 62 -47 -41 53 72 -51 52 -25 55 -55 -20 -5 -7 -30 68 -18 86 -46 83 -59 66 -53 -22 -24 -17 74 -44 -49 -10 105 82 -54 -14 -36 -64 -26 -37 94 85 -48 95 97 -38 96 93 -77 -84 103 -65 -35 -15 99 104 102 -63 101 -1 -88 -90 -19 -42 108 -108 -102
right_child=1 11 10 17 5 14 -8 12 73 -11 -12 16 77 63 15 37 18 61 48 20 67 -23 27 51 80 -27 -28 28 31 30 -32 32 -34 75 35 81 87 38 -40 44 70 -43 71 -45 45 46 84 49 -50 50 -52 65 76 54 -56 -57 -58 64 -60 -61 -62 88 79 89 -66 -67 -68 -69 -70 -71 -72 -73 -74 -75 -76 90 -78 -79 -80 -81 -82 -83 91 -85 -86 -87 98 -89 92 -91 -92 -93 -94 -95 -96 -97 -98 -99 -100 -101 106 -103 -104 -105 -106 -107 107 -109 -110
leaf_value=-0.024550228269994843 0.011861549125328628 0.024102001674291648 0.0035301347519923103 -0.0034792554363240109 0.065631753899964521 -0.015340463856096345 0.078067193640428287 0.01600117045224983 -0.018601417201566283 0.015401777880843948 0.015497539594701418 0.02898343622246365 -0.014552439841780599 -0.023664644086335868 0.050642136014074218 -0.001669260634526884 -0.0020204435695091883 -0.023875141614822945 0.0067034877049624011 -0.0088337896984318123 -0.0071851598718970181 0.07526446358375273 -0.0087677544031382875 0.0003639864959338985 -0.021785726786675366 0.031944169338910783 -0.020744250793304317 0.042418109280541703 0.0020925378992787103 -0.0067188535271148868 0.030789215207726223 0.041829980205681842 0.0067786838917753382 -0.018171804229840306 0.0043880639737742108 -0.019325573294523116 -0.02204006029840605 0.048048139423785205 -0.0027021070126304341 0.0071603553960725283 -0.016450083785700668 0.019851633415149519 -0.017742673462765639 -0.016080544787622452 -0.0133522792694907 0.042208500644999848 -0.0040162231527551134 -0.018222782163654635 0.021681265176934174 0.0061834239329982832 -0.0068337930721156792 -0.021112834911404699 -0.021710751190423316 0.028052528695623771 0.012408293506548025 0.013911309223092236 -0.01024132890545372 -0.007778979444054185 -0.0037131703002453299 0.0028990628719740672 0.0045921631008824437 -0.020143032479160061 -0.0070817113315629864 -0.018695001727390217 -0.0034264890427830592 -0.01122498364391538 -0.010752283557911954 -0.0022621939993509687 -0.0022501490545109317 -0.006447688872533601 -0.019215552599679667 -0.013665913604726862 -0.01256784938468547 -0.012582103238583334 -0.011523226920558946 -0.014605597080368815 -0.015728853323083897 -0.01778737731688081 0.0070000735483035318 -0.0030018782909566073 -0.01787923642060682 -0.014982437926897739 -0.016633763215119123 -0.018975979393051696 -0.00097037063618971248 -0.020034408856432519 -0.022091889030313006 -0.019952270630511242 -0.017613364333259909 -0.014156048431659705 -0.011782247105912915 -0.013941521459171402 -0.014560815369714257 -0.0162820928152283 -0.016156315877263686 -0.022347590566374184 -0.017718222401509536 -0.022653684749458346 -0.020042405385848339 -0.018843492498437184 -0.024827686113920729 -0.024800058906405145 -0.021310744191537209 -0.016820403050820512 -0.023397308373080503 -0.016547855429146007 -0.024829265305370357 -0.024810953306757845 -0.024824133085961417
leaf_weight=159.75932693481445 11.681725770235062 12.51045188307762 47.243006765842438 36.064617097377777 9.0618587434291822 8.8828223496675474 8.5238282680511457 11.452611103653906 4.0407368540763846 36.400904178619385 17.141876399517059 21.689306020736694 12.833035811781885 11.563818007707603 7.8342066705226889 14.705577015876772 15.668086946010591 8.8735755085945165 46.317578852176666 8.2837696522474271 16.877072781324387 5.2035617828369132 7.9648875296115902 10.802304700016977 5.6700945049524289 6.4734249562025061 18.340181112289429 9.1683252751827258 42.172265768051147 10.366773635149004 11.080183625221251 11.427230179309843 487.61877450346947 13.370393738150598 11.869896858930586 7.3315394669771177 13.556003980338573 8.3021050691604596 36.227537527680397 14.957204580307005 6.986351490020752 10.802892267704008 23.716169700026512 6.4518245011568078 6.8043638616800335 7.6049997806549099 6.3759911954402915 7.8395506143569929 17.949266314506531 15.600487947463987 149.73146238923073 14.069002129137521 3.6416158825159055 15.319741904735563 527.80859380960464 24.187186598777771 22.159845128655434 66.753205642104149 26.564815521240234 10.952866643667223 14.87499615550041 2.4617944434285182 7.8254128843545887 4.1740352436900121 16.709659218788147 4.8125144690275183 3.297616019845008 21.851989939808846 11.098376870155333 17.187196046113968 16.796514838933945 11.970816165208815 6.3733871132135391 9.9987504035234434 6.0611949115991601 5.4885602444410306 5.2084344178438187 12.649037033319471 22.228669077157974 4.897222414612771 5.1212718486785889 2.9897903501987457 5.6114290356636065 2.9588883444666854 8.8127801120281202 3.7988527268171302 4.0965997949242574 10.482941865921021 4.6495258063077909 3.0416870564222327 5.0311865508556366 5.1937683522701263 2.7479299157857895 4.617049902677536 4.0080130845308295 8.10870461165905 3.3343579471111298 6.5124584734439841 2.3094384670257568 4.2983078956604004 93.62848749756813 129.76853826642036 3.724658377468586 2.7428306937217712 2.7683601528406152 5.0210397243499756 6.5989565849304199 10.315585136413576 27.021775290369987
leaf_count=1542 36 22 167 193 21 32 6 30 17 106 35 36 50 109 26 54 19 84 82 30 57 19 20 47 22 23 81 20 126 23 21 25 1088 105 37 55 115 23 109 28 31 36 96 27 30 17 24 25 11 24 562 77 25 15 569 36 156 295 60 31 24 21 41 34 72 33 21 69 36 47 41 65 20 53 23 41 35 33 90 23 26 21 43 23 32 33 37 84 37 22 36 38 21 35 31 74 27 60 20 36 908 1257 33 21 26 22 64 100 262
internal_value=0 0.00646596 -0.0174025 -0.0202896 -0.000677177 0.00416058 0.013256 0.00752746 0.01604 0.0254139 -0.00712599 0.0100792 -0.00618633 -0.00950603 -1.15364e-05 0.00667468 0.012694 -0.011454 0.0121604 -0.00390853 0.00282992 0.0236122 0.0072893 -0.00614014 -0.0026794 -9.56325e-05 -0.00325814 0.00695459 0.00740881 0.0215709 0.012659 0.00664518 0.00758129 -0.00877979 -0.006624 0.000477435 -0.0104586 0.00216749 0.00675977 -0.00547852 -0.00930482 -0.00518559 -0.0102111 0.00191989 -0.0038711 0.00297406 0.012584 -0.0053605 0.0126905 -0.00640357 -0.00560551 -0.0129942 -0.00799156 0.0124275 0.0128496 0.00917618 -0.00605286 -0.00771876 -0.000151194 -0.00210067 0.00120001 -0.0205695 -0.00824356 -0.0204737 -0.00690759 -0.0174269 -0.0191455 -0.00440749 -0.00497329 -0.00424438 -0.0169399 -0.0163752 -0.015687 -0.0143145 -0.0148245 -0.0158361 -0.0181903 -0.0161582 0.00609082 -0.00551129 -0.0199318 -0.0180675 -0.0167994 -0.0222139 -0.00224897 -0.0226221 -0.0226382 -0.0211296 -0.0176777 -0.0165867 -0.0132553 -0.0153397 -0.0165717 -0.0174277 -0.017707 -0.0231218 -0.0187887 -0.0233641 -0.0213375 -0.0193167 -0.0247149 -0.0246622 -0.0217199 -0.0173191 -0.0237615 -0.016491 -0.0248258 -0.0248181 -0.0248269
internal_weight=0 1994.83 821.084 640.999 670.091 333.779 104.961 96.4369 59.5023 45.4628 180.084 1324.74 36.9347 162.943 228.819 84.2566 683.815 213.906 662.125 144.562 52.2164 13.4873 640.925 124.679 82.848 72.0566 65.5832 628.414 598.398 30.6153 21.447 567.783 499.046 165.387 126.683 44.4199 82.2634 76.4224 44.5296 336.311 99.4885 64.6234 53.8205 18.1336 236.823 42.3208 22.7938 194.502 631.582 179.545 165.332 41.8315 19.6524 613.633 543.128 70.5048 58.2245 92.3457 68.7371 30.0161 30.5431 48.5198 19.527 38.263 83.4629 22.1791 17.3666 38.7291 19.0633 31.8928 34.8651 35.687 14.2129 14.0395 18.0686 38.7034 8.85005 25.4821 34.0986 12.7226 10.7914 10.3213 28.1836 26.4303 15.1888 23.4714 28.2851 24.0389 20.2347 11.8328 10.5197 10.8052 10.1403 8.79109 17.3784 19.6725 10.0945 18.1544 10.1307 6.7601 427.093 289.528 7.82126 7.39236 11.6419 12.0074 137.565 16.9145 120.65
internal_count=11139 4616 6523 5601 2352 1149 316 310 197 127 922 2264 113 887 833 259 792 1468 756 574 175 49 1472 557 319 271 248 1450 1363 64 44 1299 1113 1045 751 203 548 233 132 1203 377 260 224 63 826 167 73 659 713 631 586 238 107 702 584 118 349 399 186 87 43 423 94 330 367 131 98 126 56 101 117 161 45 70 76 294 60 83 127 64 48 76 217 239 56 216 260 199 163 91 77 81 79 69 136 183 84 170 90 57 4133 2799 70 58 110 53 1334 164 1170
cat_boundaries=0 1 2 3 4 5 6 7 8 9 10 11 12 13 14 15 16 17 18 19 20 21 22 23 24
cat_threshold=2 2 2 1 1 1 1 2 1 1 1 1 1 1 1 1 1 1 2 1 1 1 2 1
is_linear=0
shrinkage=0.05


Tree=37
num_leaves=114
num_cat=27
split_feature=2 2 3 2 3 2 3 3 0 2 3 2 2 0 2 2 0 1 2 2 2 2 2 2 3 2 2 1 2 2 2 1 2 2 2 2 2 2 2 2 1 0 2 2 2 3 0 2 2 2 2 2 2 2 2 3 2 1 2 2 1 2 2 2 2 2 2 2 2 2 2 3 3 1 2 1 2 2 1 2 2 1 2 1 2 1 3 2 2 1 2 2 2 2 2 1 3 2 3 1 2 1 2 0 1 2 2 1 2 2 0 1 1
split_gain=127.526 19.287 9.69469 10.0927 5.92512 4.72542 13.3913 4.20455 6.26446 6.23911 3.693 3.6036 3.12871 2.37293 2.26008 5.97606 2.06696 1.42252 2.91417 7.84288 1.30962 1.1531 1.98024 2.64512 1.80777 0.987621 1.33434 1.77992 1.52836 0.983646 4.0799 1.06479 1.39483 1.02033 0.893177 4.7177 0.802061 1.22834 3.07916 1.56933 1.23747 0.923342 1.72145 4.84411 0.970762 0.704892 0.609745 1.46095 0.694932 1.90311 0.568555 0.520418 0.916414 0.327188 0.243581 0.224166 0.223876 0.164685 0.153649 0.150506 0.129959 0.117415 0.106569 0.104523 0.0980891 0.0890305 0.0788453 0.0761543 0.0720259 0.0672187 0.0527836 0.0458269 0.145601 0.0448202 0.0415305 0.0394865 0.0383393 0.0266322 0.0260694 0.0241345 0.0197271 0.0193758 0.0176674 0.0164754 0.0160665 0.0149369 0.0141718 0.0123369 0.0108729 0.0104466 0.00997918 0.00966047 0.00828523 0.00779017 0.0070797 0.00608882 0.00511905 0.00502216 0.00337222 0.00229635 0.00209187 0.002034 0.00106654 0.00102324 0.00183178 0.00048358 0.000434782 0.000196876 9.55829e-05 1.11682e-05 4.70299e-07 5.53403e-07 1.08677e-07
threshold=13.500000000000002 72.500000000000014 1.0000000180025095e-35 1.0000000180025095e-35 1.0000000180025095e-35 25.500000000000004 17.500000000000004 2.5000000000000004 0 15.500000000000002 28.500000000000004 204.50000000000003 16.500000000000004 1 55.500000000000007 57.500000000000007 2 3 32.500000000000007 29.500000000000004 73.500000000000014 7.5000000000000009 4.5000000000000009 1.0000000180025095e-35 1.5000000000000002 7.5000000000000009 4.5000000000000009 4 2.5000000000000004 78.500000000000014 79.500000000000014 5 92.500000000000014 81.500000000000014 65.500000000000014 64.500000000000014 22.500000000000004 19.500000000000004 18.500000000000004 14.500000000000002 6 7 42.500000000000007 47.500000000000007 23.500000000000004 1.5000000000000002 8 207.50000000000003 242.50000000000003 245.50000000000003 303.50000000000006 26.500000000000004 27.500000000000004 248.50000000000003 1.5000000000000002 4.5000000000000009 27.500000000000004 9 69.500000000000014 218.50000000000003 10 4.5000000000000009 27.500000000000004 4.5000000000000009 48.500000000000007 41.500000000000007 738.50000000000011 75.500000000000014 8.5000000000000018 21.500000000000004 16.500000000000004 6.5000000000000009 2.5000000000000004 11 16.500000000000004 12 11.500000000000002 21.500000000000004 13 56.500000000000007 5.5000000000000009 14 329.50000000000006 15 6.5000000000000009 16 3.5000000000000004 2.5000000000000004 2.5000000000000004 17 7.5000000000000009 10.500000000000002 12.500000000000002 9.5000000000000018 11.500000000000002 18 1.5000000000000002 10.500000000000002 1.5000000000000002 19 1.5000000000000002 20 5.5000000000000009 21 22 3.5000000000000004 11.500000000000002 23 11.500000000000002 20.500000000000004 24 25 26
decision_type=2 2 2 2 2 2 2 2 9 2 2 2 2 9 2 2 9 1 2 2 2 2 2 2 2 2 2 1 2 2 2 1 2 2 2 2 2 2 2 2 1 9 2 2 2 2 9 2 2 2 2 2 2 2 2 2 2 1 2 2 1 2 2 2 2 2 2 2 2 2 2 2 2 1 2 1 2 2 1 2 2 1 2 1 2 1 2 2 2 1 2 2 2 2 2 1 2 2 2 1 2 1 2 9 1 2 2 1 2 2 9 1 1
left_child=2 4 3 103 36 6 7 8 9 -6 13 20 -9 21 17 -16 25 56 19 -19 -3 22 23 24 -4 26 28 80 54 57 -31 33 -33 -32 35 -17 37 38 39 40 -2 44 62 -44 -38 -24 47 -13 55 -50 -51 73 -53 -48 -5 60 -7 67 -36 -57 -49 88 -43 86 -58 -20 71 -22 -23 75 -41 72 -55 -46 -10 109 85 -14 94 -45 -28 -64 -73 -25 -29 97 87 98 100 -30 99 96 -78 -87 -70 106 -65 -27 -15 102 107 105 -63 104 -1 -90 -92 -18 -80 -39 112 -112 -105
right_child=1 11 10 16 5 14 -8 12 74 -11 -12 46 77 63 15 34 61 18 65 -21 29 68 45 83 -26 76 27 84 89 30 31 32 -34 -35 58 -37 41 69 -40 70 -42 42 43 79 51 -47 53 48 49 50 -52 52 -54 66 -56 59 64 -59 -60 -61 -62 90 81 91 -66 -67 -68 -69 78 -71 -72 82 -74 -75 -76 -77 92 -79 108 -81 -82 -83 -84 -85 -86 93 -88 -89 101 -91 95 -93 -94 -95 -96 -97 -98 -99 -100 -101 -102 -103 -104 110 -106 -107 -108 -109 -110 -111 111 -113 -114
leaf_value=-0.02454329474782032 -0.015938722562770617 0.022936756258150129 0.0063669478255043675 -0.0034048431184575661 0.059885278794469046 -0.015193778726933069 0.070339900059331564 0.015353034108607189 -0.018484486077303627 0.014786895851697575 0.014877391948930705 0.028298493478238169 -0.014401793484629747 -0.02363675459840521 0.046915266418102584 -0.0014345184937893233 -0.023852088072248173 -0.0086918630312238093 -0.0070579276397203412 0.068007481827145486 -0.0086263117976239437 -0.020457304505061696 0.021977016249872462 -0.023371034399452966 -0.011364562154748611 -0.018049720471512581 0.0042601378629928731 -0.019218175772729971 -0.021977903464402409 0.039625254466107547 0.017386808688836203 0.00055227728355989442 0.010888946205012032 0.0044364953576397801 -0.0069031413785581204 0.039383558010825673 0.0069321151420344189 -0.016311104367784088 0.018973390238245926 -0.017615816769249205 0.011428910306441673 -0.013198007787978114 0.047481869693078438 -0.0048120333804152135 -0.018101289971591768 0.0030872162288510686 0.0043688192663425369 0.0021048892221913712 0.032110194798450016 0.0092764463560829329 0.013741016696809409 0.0059922508591824727 -0.0067103945980214316 0.0091108495507341274 -0.010091160611465184 0.0060261280876378037 -0.0076458284417815874 0.0028187931850975965 0.00020990829431826488 0.012825937484763131 0.0083280485856011607 -0.020047679867045226 -0.0069555821442831541 -0.018579243043632673 -0.0033530267556324761 -0.0022110850397350345 0.013516049753135346 -0.0021992855575664457 -0.01734822083419614 -0.019106639029713591 -0.013512308587772233 0.0077440187004573918 0.014789433620390742 -0.012412776981436209 -0.012427034898754741 -0.011369011317779764 -0.01445517805739646 -0.017660999862704859 -0.011934430009060372 -0.00094720743429807942 0.0067780430768548706 -0.0029362567150189884 0.0096572119207752206 -0.020297340262387199 -0.014833796998658978 -0.016496301429872004 -0.018863847307124912 -0.019937377724188236 -0.022030741560392815 -0.019853986569413794 -0.017485142486899474 -0.014003883538502227 -0.01162761455102548 -0.01378866552829631 -0.014516110030691122 -0.014410205118678097 -0.016141787870903684 -0.016015055070136494 -0.022291506372865661 -0.017591104414311051 -0.022603836213631618 -0.019945497408228676 -0.018729629440277149 -0.024827646838951847 -0.024799327459162523 -0.021234956388949171 -0.016684553049384598 -0.023363409426491209 -0.012307354464469893 -0.016409675335409529 -0.024829265728927592 -0.024810493038899439 -0.024824002382526855
leaf_weight=155.88494901359081 6.3489056676626205 12.815642446279524 30.97114785015583 35.939356543123722 9.6765554845333082 8.7475958019494993 9.2159233689308149 11.637340217828749 3.9662681967020026 36.965882331132889 17.409602493047714 15.331739068031309 12.64763616025448 11.29337716847659 8.2411651313304883 35.450386270880699 8.6642265915870702 8.2109148055315 16.756242737174034 5.6103202104568473 7.8953587561845806 6.7931693792343166 7.527260065078738 15.146995291113853 26.824205040931702 13.129623681306841 11.922096908092497 7.1912139654159528 13.26049730181694 9.5655944347381574 15.903459042310713 38.743241250514984 207.04635733366013 348.66188633441925 20.104121923446655 8.8451330065727216 15.064688205718992 6.8723659962415695 11.019490003585814 23.299091801047325 11.821113467216493 6.7141140401363399 6.8194142282009151 7.4638868570327785 7.6979857981204969 14.360737726092337 26.086316347122192 17.493805378675461 13.151269793510435 90.344791650772095 338.46989566087723 15.697250604629515 148.71171659231186 32.599497556686401 21.934057705104351 11.840631604194639 66.235948324203491 10.984665781259539 12.198667570948599 26.021266102790833 16.119428515434265 2.4127025529742259 7.7701913416385624 4.0967265591025335 16.652501791715622 21.802612140774727 18.834963798522949 11.073431998491285 5.0853061825036967 16.476841703057289 11.808337032794951 19.061954975128174 17.26735532283783 6.2937887012958527 9.8737331926822645 5.9917513281106958 5.4089792519807798 12.426033094525335 4.3674501031637236 8.804232642054556 22.384817898273468 4.8825436085462579 32.882929563522339 6.121648997068406 2.9453300535678864 5.5188618153333682 2.9032698571681967 3.7235023304820052 4.0070906430482847 10.275856018066406 4.5683489888906461 2.9989320784807196 4.9722557365894318 5.1218621432781219 3.8981884866952896 2.7082076072692871 4.5424833446741104 3.9437785744667044 7.9295045435428611 3.2757994011044502 6.3665860891342154 2.2636125087738037 4.2180712670087814 91.332525104284286 126.58984407037497 3.6461230963468552 2.6970807909965515 2.7043398320674905 2.8326086848974228 4.9386360794305801 6.437126636505127 10.062794387340547 26.359240993857384
leaf_count=1542 27 22 124 193 21 32 6 30 17 106 35 18 50 109 26 128 84 30 57 19 20 30 29 64 106 105 37 55 115 20 30 86 397 860 54 12 28 31 36 96 36 30 14 27 25 41 39 30 12 132 314 24 562 37 156 20 295 31 39 43 24 21 41 34 72 69 13 36 39 41 65 25 21 20 53 23 41 33 31 32 90 23 34 44 21 43 23 33 37 84 37 22 36 38 29 21 35 31 74 27 60 20 36 908 1257 33 21 26 20 22 64 100 262
internal_value=0 0.00626138 -0.0172727 -0.0201968 -0.000665294 0.00403213 0.0127375 0.00727561 0.0153777 0.0241431 -0.00700142 0.00972815 -0.00607274 -0.00936116 -1.55389e-05 0.00645824 -0.0113006 -0.00382923 0.00274348 0.022442 0.00710853 -0.00602692 -0.00372599 -0.00741055 -0.00186267 -0.00863901 -0.00650393 0.000464019 -0.0103079 0.0067964 0.00722399 0.00671619 0.0092596 0.00500143 0.0021055 0.00671622 -0.00537351 -0.0091612 -0.00508585 -0.0100621 0.00186621 -0.00379087 0.00288656 0.0121079 -0.00525618 0.0095834 0.0122981 0.0130894 0.0126352 0.013375 0.0128004 -0.0062854 -0.00549759 0.00944639 -0.00593896 0.00806107 -0.00758625 -0.00205312 -0.004217 0.0106994 0.00508924 -0.020481 -0.00810641 -0.0203836 -0.00678339 -0.00431734 0.0105443 -0.0048744 -0.0161364 -0.0168052 -0.0162356 0.0099945 0.0110772 -0.0155425 -0.014163 -0.0146751 -0.0156926 -0.016017 -0.0143227 -0.00272041 0.00590304 -0.00540457 0.00895514 -0.0224863 -0.0179442 -0.0166634 -0.0221552 -0.0225716 -0.0225881 -0.0210506 -0.0175501 -0.0164489 -0.0131009 -0.015193 -0.0161193 -0.0164337 -0.0172976 -0.0175797 -0.0230818 -0.0186742 -0.0233295 -0.0212622 -0.0192092 -0.024712 -0.024658 -0.0216516 -0.0171879 -0.0237358 -0.0120811 -0.0163523 -0.0248257 -0.0248178 -0.0248268
internal_weight=0 2007.96 806.973 628.147 669.761 335.265 106.409 97.1934 60.4824 46.6424 178.826 1338.2 36.711 161.417 228.856 84.8395 211.481 144.016 52.3801 13.8212 662.69 123.929 100.952 79.064 57.7954 163.949 125.853 44.4435 81.4098 649.874 619.921 610.355 245.79 364.565 76.5983 44.2955 334.496 98.5765 64.2969 53.2774 18.17 235.92 42.4544 23.0875 193.465 21.888 675.506 528.773 513.441 441.966 428.815 178.401 164.409 146.733 57.8734 71.4751 91.636 29.9535 32.3028 37.8619 33.6132 47.5322 19.3668 37.4878 82.8885 38.5589 120.647 18.9688 22.9767 34.2796 35.1074 101.812 49.8669 13.9918 13.84 17.8028 38.0954 25.0737 16.1836 16.2681 34.3069 12.6527 51.9449 21.2686 10.1365 27.7141 25.8497 22.9464 27.652 23.5364 19.8802 11.6381 10.3812 10.6407 8.98349 9.97364 8.63921 17.0734 19.2229 9.90657 17.7352 9.91683 6.63077 416.666 282.475 7.65321 7.26543 11.3686 7.20006 11.811 134.192 16.4999 117.692
internal_count=11139 4616 6523 5601 2352 1149 316 310 197 127 922 2264 113 887 833 259 1468 574 175 49 1502 557 408 338 230 1045 751 203 548 1480 1393 1373 483 890 233 140 1203 377 260 224 63 826 167 73 659 70 762 593 575 458 446 631 586 169 349 117 399 87 93 63 54 423 94 330 367 126 130 56 149 117 161 117 58 45 70 76 294 83 119 59 127 64 59 108 76 217 239 216 260 199 163 91 77 81 68 79 69 136 183 84 170 90 57 4133 2799 70 58 110 51 53 1334 164 1170
cat_boundaries=0 1 2 3 4 5 6 7 8 9 10 11 12 13 14 15 16 17 18 19 20 21 22 23 24 25 26 27
cat_threshold=2 2 2 1 1 1 2 2 2 1 1 1 1 1 1 1 1 1 1 1 1 2 1 1 1 2 1
is_linear=0
shrinkage=0.05


Tree=38
num_leaves=115
num_cat=24
split_feature=2 2 3 2 3 2 3 3 0 2 3 2 2 0 2 2 0 1 2 2 2 1 3 3 2 2 2 1 2 2 2 3 2 2 2 2 2 2 2 1 0 2 2 2 3 2 3 2 2 3 3 3 2 2 2 2 2 3 2 2 2 1 2 2 2 2 2 2 2 2 2 3 2 2 2 1 2 1 2 1 2 2 2 2 1 2 2 2 1 3 2 2 1 2 2 2 2 1 3 2 3 1 2 1 2 0 1 2 2 1 2 0 1 1
split_gain=122.703 18.0723 9.642 10.1582 5.64001 4.41101 11.6064 3.92933 5.80559 5.35855 3.51745 3.32679 2.99586 2.3395 2.14253 5.36915 2.04756 1.36302 2.70729 6.86148 1.19932 1.15493 1.43354 2.75804 3.04513 0.96886 1.28996 1.71296 1.50942 0.924126 3.67206 0.992998 1.98667 0.844831 4.28584 0.777216 1.20507 2.91694 1.52953 1.18016 0.882538 1.62432 4.34629 0.927468 0.565447 1.91367 0.917145 2.74687 1.22659 0.758171 4.28654 0.79609 0.629563 0.508822 0.876951 0.503231 0.481777 0.358141 0.637533 0.34707 0.236253 0.220026 0.219382 0.169838 0.232168 0.159467 0.147741 0.118707 0.1055 0.104126 0.0956111 0.115809 0.0954897 0.085841 0.0672763 0.0593868 0.0526582 0.0446551 0.0413371 0.0391962 0.0381748 0.0298436 0.0265882 0.0231496 0.0187139 0.0184388 0.0164211 0.0161032 0.0149324 0.0143704 0.0125349 0.011065 0.0105855 0.0100086 0.00964128 0.00819776 0.00775695 0.00607843 0.00513086 0.00503183 0.0034381 0.00230965 0.00213414 0.002061 0.00107543 0.00104865 0.00187691 0.00049101 0.000435496 0.000201111 1.1161e-05 4.82045e-07 5.67342e-07 1.112e-07
threshold=13.500000000000002 72.500000000000014 1.0000000180025095e-35 1.0000000180025095e-35 1.0000000180025095e-35 25.500000000000004 17.500000000000004 2.5000000000000004 0 15.500000000000002 28.500000000000004 204.50000000000003 16.500000000000004 1 55.500000000000007 57.500000000000007 2 3 32.500000000000007 29.500000000000004 73.500000000000014 4 3.5000000000000004 2.5000000000000004 5.5000000000000009 7.5000000000000009 4.5000000000000009 5 2.5000000000000004 78.500000000000014 79.500000000000014 1.0000000180025095e-35 81.500000000000014 65.500000000000014 64.500000000000014 22.500000000000004 19.500000000000004 18.500000000000004 14.500000000000002 6 7 42.500000000000007 47.500000000000007 23.500000000000004 3.5000000000000004 207.50000000000003 1.5000000000000002 267.50000000000006 468.50000000000006 34.500000000000007 38.500000000000007 151.50000000000003 588.00000000000011 26.500000000000004 27.500000000000004 82.500000000000014 248.50000000000003 1.5000000000000002 1.0000000180025095e-35 549.50000000000011 1.5000000000000002 8 27.500000000000004 216.50000000000003 234.50000000000003 74.500000000000014 69.500000000000014 4.5000000000000009 4.5000000000000009 27.500000000000004 8.5000000000000018 5.5000000000000009 40.500000000000007 41.500000000000007 21.500000000000004 9 16.500000000000004 10 16.500000000000004 11 11.500000000000002 4.5000000000000009 21.500000000000004 56.500000000000007 12 5.5000000000000009 4.5000000000000009 6.5000000000000009 13 3.5000000000000004 2.5000000000000004 2.5000000000000004 14 7.5000000000000009 10.500000000000002 12.500000000000002 9.5000000000000018 15 1.5000000000000002 10.500000000000002 1.5000000000000002 16 1.5000000000000002 17 5.5000000000000009 18 19 3.5000000000000004 11.500000000000002 20 20.500000000000004 21 22 23
decision_type=2 2 2 2 2 2 2 2 9 2 2 2 2 9 2 2 9 1 2 2 2 1 2 2 2 2 2 1 2 2 2 2 2 2 2 2 2 2 2 1 9 2 2 2 2 2 2 2 2 2 2 2 2 2 2 2 2 2 2 2 2 1 2 2 2 2 2 2 2 2 2 2 2 2 2 1 2 1 2 1 2 2 2 2 1 2 2 2 1 2 2 2 1 2 2 2 2 1 2 2 2 1 2 1 2 9 1 2 2 1 2 9 1 1
left_child=2 4 3 105 35 6 7 8 9 -6 13 20 -9 21 17 -16 25 62 19 -19 -3 22 23 24 -4 26 28 85 60 65 -31 55 -33 34 -17 36 37 38 39 -2 43 69 -43 -37 45 -13 48 -48 56 59 -51 61 -50 77 -55 -32 -47 58 -23 63 -5 -52 -7 -46 -65 -22 -35 91 89 -42 71 -59 -64 -20 79 -67 -40 -45 -10 110 88 -60 -14 -44 -71 -28 -24 -29 99 90 100 102 -30 101 98 -82 -90 108 -70 -27 -15 104 109 107 -69 106 -1 -93 -95 -18 -38 113 -113 -107
right_child=1 11 10 16 5 14 -8 12 78 -11 -12 44 82 68 15 33 67 18 73 -21 29 57 86 -25 -26 80 27 87 92 30 31 32 -34 66 -36 40 74 -39 76 -41 41 42 83 53 49 46 47 -49 52 50 51 -53 -54 54 -56 -57 -58 70 81 -61 -62 -63 72 64 -66 75 -68 93 94 84 -72 -73 -74 -75 -76 -77 -78 -79 -80 -81 95 -83 -84 -85 -86 -87 -88 -89 96 -91 -92 103 -94 97 -96 -97 -98 -99 -100 -101 -102 -103 -104 -105 -106 111 -108 -109 -110 -111 -112 112 -114 -115
leaf_value=-0.024536189984598753 0.011016878846163149 0.021853628532247628 0.0035697401051321062 -0.0033317716658790748 0.054961040692868918 -0.015046261559266512 0.06387572188135747 0.014740826038953606 -0.018366115324109207 0.01420540668636772 0.014291032158332276 0.031859476718355983 -0.014250532529932853 -0.02360823165809443 0.0436270886030624 -0.0014009341736079446 -0.023328759208535447 -0.0085509877483302115 -0.0069320551681954059 0.061903794862401433 -0.0080922733515725702 0.00019498292566420659 -0.021673100608928474 0.030816604767009981 -0.020646251207181821 -0.017926239767250714 0.0041364756252997023 -0.019109298622989518 -0.021914543246192644 0.037121167977796028 -0.0057447616135096139 0.028308515944794228 0.0073176468848090183 -0.0067789666853057765 0.036903780422160713 0.0067127053880545288 -0.01617102419204669 0.018150140808249678 -0.017487620285311947 -0.015795883161925022 -0.013043480555805245 0.044128640227167705 -0.0047154776040949373 -0.017978396334109342 0.0032789072832344699 0.0037357223228888835 0.036819952361968132 0.011055475744180107 0.022513449555067844 0.034010287423082979 0.0068483849828650236 0.017248721918183562 0.012643938888255747 0.0058081134613955695 -0.0065884009434738272 0.0042905401956482361 0.010327881143659255 -0.020987901758274311 -0.021576956957630872 0.012534511251409988 -0.0099416834122757133 0.011097349556065709 -0.0085093226388975474 0.013680079770438469 0.0076597169162833899 0.0031493420862353603 0.00020465294616022752 -0.019950854298749546 -0.018462036493080324 -0.0068308268905535032 -0.010903888703042194 -0.010456367050642776 -0.0050921290181467653 -0.0021610190610991432 -0.018996247255274525 -0.0020938504062300947 -0.013358352663368734 -0.012257693752964295 -0.012271950176659783 -0.011215108588335064 -0.01430413009284837 -0.015583619766535856 -0.017533276406564643 -0.00092457536735693108 -0.0028718786854769942 0.006564531473959842 -0.017708033218436735 -0.014684422133341646 -0.016357699386915055 -0.018750248503814824 -0.019838868041906609 -0.021968404609679883 -0.019754220383120035 -0.017355599509910915 -0.013851219769805549 -0.01147321492864185 -0.013635376174529224 -0.014258977375346921 -0.016000418337006227 -0.015872759391104104 -0.022234300615623488 -0.017462650713062414 -0.022552960959848489 -0.019847110931534861 -0.018614309600623477 -0.024827604402398801 -0.024798575533464279 -0.021157815990740299 -0.016547521140080939 -0.023828499248577422 -0.016270372967274908 -0.02482926587191597 -0.02481002086514052 -0.024823871845614714
leaf_weight=152.10558342933655 11.956991761922836 13.112988471984862 47.177120387554169 35.817197002470493 10.273741632699965 8.6156913638114911 9.8875132799148542 11.817387312650679 3.8936271965503684 37.51655413210392 17.670547872781754 13.667379677295683 12.466792970895769 11.02956848591567 8.6370147466659528 35.399568393826485 2.6418895721435547 8.1398558467626554 16.638394713401794 6.0051371455192557 7.9143058657646206 10.875259935855867 5.467760816216467 6.604597181081771 17.910508520901203 12.894764125347139 11.972995787858961 7.0543313026428205 12.972238436341286 9.9522434771060926 13.383305788040159 11.597454309463499 401.82514372467995 19.965818405151367 9.2004363536834699 15.16948080062866 6.7611794173717499 11.230563074350355 22.892252907156944 6.2485143840312967 6.6260833144187954 7.1510231792926815 7.4280567467212704 7.5598959028720838 18.639147788286209 38.21868759393692 14.775413572788237 34.501809895038605 27.800904750823975 21.611743688583374 77.855352401733398 32.741867661476135 38.58214795589447 15.791594624519346 147.71714186668396 187.66647893190384 100.85737037658691 13.611434094607835 3.4918073266744596 49.110768914222717 21.713829860091209 50.058147788047791 37.78795400261879 17.964443802833557 147.48743623495102 9.5520752668380737 12.201228618621824 2.3648149520158785 4.0213152915239316 7.7163326591253254 4.7015462815761557 3.229723021388053 44.540255397558212 21.754458114504814 16.165013402700424 12.425940722227097 11.64985243976116 6.2161480933427811 9.7517912834882718 5.9240166544914254 5.3313537985086423 5.1266182661056519 12.208503499627112 8.7958970069885236 4.8682282269001016 22.537057399749756 4.9981497079133987 2.9019618630409241 5.4285673350095767 2.849016308784484 3.650000534951686 3.9197766631841642 10.073851436376572 4.4891651868820173 2.9572280645370475 4.9147751927375793 5.0517231822013855 2.6694616228342056 4.4697480946779251 3.8811215758323661 7.7546995356678954 3.21867835521698 6.2242908775806418 2.2189108431339264 4.139803484082222 89.092875629663467 123.48910729587078 3.5695139542222023 2.6524546891450882 8.4600121378898674 4.858255922794342 6.2792654037475586 9.8162032663822192 25.712953627109528
leaf_count=1542 36 22 167 193 21 32 6 30 17 106 35 15 50 109 26 128 26 30 57 19 19 47 22 23 81 105 37 55 115 20 32 21 883 54 12 28 31 36 96 27 30 14 27 25 30 57 20 39 21 21 88 25 26 24 562 437 126 77 25 38 156 46 179 30 180 27 39 21 34 41 33 21 188 69 41 41 65 20 53 23 41 35 33 32 23 90 26 21 43 23 33 37 84 37 22 36 38 21 35 31 74 27 60 20 36 908 1257 33 21 84 22 64 100 262
internal_value=0 0.00606484 -0.0171415 -0.0201024 -0.000653271 0.00390898 0.0122474 0.00703467 0.0147538 0.0229669 -0.006878 0.00939296 -0.00596052 -0.00921701 -1.8813e-05 0.00625141 -0.0111475 -0.00375101 0.00266069 0.02136 0.0068817 -0.00591487 -0.00249341 3.00794e-05 -0.0030939 -0.00849928 -0.00638525 0.000450999 -0.0101578 0.00658165 0.00699278 0.00650481 0.00790649 0.00204629 0.00650086 -0.00527003 -0.00901847 -0.00498748 -0.00991374 0.00181417 -0.00371211 0.00280115 0.0116537 -0.00515334 0.0118438 0.0136326 0.0126547 0.0187808 0.0111854 0.0106883 0.0131042 0.0102919 0.0167772 -0.00616867 -0.00539115 0.00362252 0.00851633 -0.0127649 -0.00785451 0.00879994 -0.00582654 0.00851119 -0.00745502 0.00780366 0.0083134 -0.00200654 -0.00413002 -0.020391 -0.0202921 -0.00797043 -0.0172082 -0.0189682 -0.00666059 -0.00422865 -0.0166692 0.000184944 -0.016095 -0.0153971 -0.0140109 -0.014525 -0.0155481 -0.0180119 -0.0158747 -0.00266022 -0.00529934 0.00572214 -0.0197795 -0.0178196 -0.0165262 -0.0220953 -0.02252 -0.0225369 -0.0209702 -0.0174213 -0.0163099 -0.0129462 -0.0150455 -0.0162946 -0.0171662 -0.0174512 -0.023041 -0.0185581 -0.0232941 -0.0211855 -0.0191002 -0.0247091 -0.0246538 -0.0215821 -0.0170555 -0.0237096 -0.0162126 -0.0248256 -0.0248175 -0.0248268
internal_weight=0 2020.73 793.207 615.611 669.428 336.702 107.816 97.9284 61.4357 47.7903 177.597 1351.3 36.4927 159.926 228.886 85.4041 209.115 143.482 52.5378 14.145 667.43 123.195 82.1581 71.6922 65.0876 162.546 125.043 44.4663 80.5771 654.317 624.425 614.472 413.423 76.7671 44.6 332.727 97.6866 63.9782 52.7476 18.2055 235.04 42.5856 23.375 192.454 683.873 268.404 254.736 49.2772 205.459 415.469 182.267 160.655 66.3831 177.285 163.509 201.05 139.076 41.0364 19.4937 233.202 57.531 127.914 90.9439 184.091 165.452 29.8923 32.167 46.5688 36.7316 19.2106 21.5427 16.8412 82.3282 38.3929 33.7085 21.978 34.5421 13.776 13.6454 17.5435 37.5023 8.61843 24.6753 16.224 12.5846 34.5101 10.4659 9.95629 27.2562 25.2833 22.4343 27.0344 23.0461 19.5344 11.4483 10.2461 10.4803 9.81108 8.49106 16.7759 18.7843 9.7233 17.3262 9.7082 6.50462 406.496 275.595 7.48929 7.14162 11.1019 11.6194 130.901 16.0955 114.806
internal_count=11139 4616 6523 5601 2352 1149 316 310 197 127 922 2264 113 887 833 259 1468 574 175 49 1502 557 319 271 248 1045 751 203 548 1480 1393 1373 904 233 140 1203 377 260 224 63 826 167 73 659 762 304 289 59 230 458 180 159 47 631 586 469 183 238 107 278 349 134 399 240 210 87 93 423 330 94 131 98 367 126 117 68 161 45 70 76 294 60 83 59 64 127 48 76 217 239 216 260 199 163 91 77 81 79 69 136 183 84 170 90 57 4133 2799 70 58 110 53 1334 164 1170
cat_boundaries=0 1 2 3 4 5 6 7 8 9 10 11 12 13 14 15 16 17 18 19 20 21 22 23 24
cat_threshold=2 2 2 1 1 1 1 2 1 2 1 1 1 1 1 1 1 1 2 1 2 1 2 1
is_linear=0
shrinkage=0.05


Tree=39
num_leaves=116
num_cat=26
split_feature=2 2 3 2 3 2 3 3 0 2 3 2 2 0 2 2 0 1 2 2 1 3 3 2 2 2 2 1 2 2 2 1 2 2 3 3 2 2 2 2 1 0 2 2 2 0 2 2 2 3 2 2 2 3 2 2 2 2 2 2 2 2 2 3 2 2 2 2 2 1 2 2 2 1 2 2 3 1 2 2 2 2 1 2 2 2 2 3 1 2 1 2 1 2 3 1 2 2 3 1 2 1 3 2 2 0 1 2 2 2 1 2 0 1 1
split_gain=118.069 16.9413 9.58607 10.2215 5.36924 4.12076 10.1347 3.67527 5.38962 4.63445 3.35139 3.07366 2.8697 2.30566 2.03144 4.84156 2.02756 1.30599 2.5185 6.04651 1.1218 1.39423 2.54952 2.95612 1.10003 0.950072 1.24675 1.64864 1.49021 0.868557 3.31508 0.993116 1.28487 0.891185 0.825155 6.28771 0.752905 1.1818 2.76489 1.49039 1.12585 0.843529 1.53343 3.91468 0.886105 0.548311 1.21619 0.607082 1.27661 2.72425 1.02459 0.4973 0.839149 0.35384 0.622293 0.309078 0.229067 0.21489 0.153184 0.11998 0.106503 0.101698 0.0953579 0.115888 0.0938953 0.0827435 0.0742779 0.0673578 0.067307 0.056403 0.0525108 0.0476916 0.0596573 0.0444717 0.0411271 0.0410379 0.0693477 0.0388906 0.0379943 0.0300075 0.026533 0.0222008 0.0180691 0.0172437 0.0165775 0.0161337 0.0151582 0.015015 0.0149218 0.0112587 0.0107236 0.0100342 0.00812514 0.00772044 0.00747444 0.00606549 0.00503954 0.00494156 0.00315987 0.00232221 0.00217703 0.00208784 0.00114041 0.00109471 0.00108404 0.00107471 0.00192313 0.000498451 0.000436035 0.000385028 0.000205424 1.11488e-05 4.9411e-07 5.81405e-07 1.14127e-07
threshold=13.500000000000002 72.500000000000014 1.0000000180025095e-35 1.0000000180025095e-35 1.0000000180025095e-35 25.500000000000004 17.500000000000004 2.5000000000000004 0 15.500000000000002 28.500000000000004 204.50000000000003 16.500000000000004 1 55.500000000000007 57.500000000000007 2 3 32.500000000000007 29.500000000000004 4 3.5000000000000004 2.5000000000000004 5.5000000000000009 73.500000000000014 7.5000000000000009 4.5000000000000009 5 2.5000000000000004 78.500000000000014 79.500000000000014 6 92.500000000000014 81.500000000000014 2.5000000000000004 3.5000000000000004 22.500000000000004 19.500000000000004 18.500000000000004 14.500000000000002 7 8 42.500000000000007 47.500000000000007 23.500000000000004 9 207.50000000000003 227.50000000000003 243.50000000000003 10.500000000000002 248.50000000000003 26.500000000000004 27.500000000000004 1.5000000000000002 1.0000000180025095e-35 248.50000000000003 1.5000000000000002 27.500000000000004 74.500000000000014 4.5000000000000009 3.5000000000000004 27.500000000000004 8.5000000000000018 5.5000000000000009 48.500000000000007 41.500000000000007 64.500000000000014 738.50000000000011 21.500000000000004 10 16.500000000000004 466.50000000000006 365.50000000000006 11 16.500000000000004 212.50000000000003 8.5000000000000018 12 11.500000000000002 4.5000000000000009 21.500000000000004 56.500000000000007 13 5.5000000000000009 4.5000000000000009 6.5000000000000009 8.5000000000000018 3.5000000000000004 14 2.5000000000000004 15 7.5000000000000009 16 9.5000000000000018 2.5000000000000004 17 10.500000000000002 1.0000000180025095e-35 1.5000000000000002 18 1.5000000000000002 19 1.5000000000000002 5.5000000000000009 5.5000000000000009 20 21 3.5000000000000004 11.500000000000002 1.5000000000000002 22 20.500000000000004 23 24 25
decision_type=2 2 2 2 2 2 2 2 9 2 2 2 2 9 2 2 9 1 2 2 1 2 2 2 2 2 2 1 2 2 2 1 2 2 2 2 2 2 2 2 1 9 2 2 2 9 2 2 2 2 2 2 2 2 2 2 2 2 2 2 2 2 2 2 2 2 2 2 2 1 2 2 2 1 2 2 2 1 2 2 2 2 1 2 2 2 2 2 1 2 1 2 1 2 2 1 2 2 2 1 2 1 2 2 2 9 1 2 2 2 1 2 9 1 1
left_child=2 4 3 105 36 6 7 8 9 -6 13 24 -9 20 17 -16 25 57 19 -19 21 22 23 -4 -3 26 28 83 56 58 -31 33 -33 -32 66 -36 37 38 39 40 -2 44 61 -44 -38 46 -13 75 49 -49 -50 73 -53 54 -22 -47 -5 -7 -26 89 87 -43 63 -55 -59 -20 -17 71 77 -60 -41 72 -57 -46 -10 -48 -77 111 88 -56 -14 -45 -63 -28 -23 -29 94 97 96 100 -30 99 -80 -90 103 108 -27 98 -15 104 110 107 -88 -62 -61 106 -1 -91 -93 -99 -18 -39 114 -114 -107
right_child=1 11 10 16 5 14 -8 12 74 -11 -12 45 80 60 15 34 59 18 65 -21 53 84 -24 -25 29 78 27 85 90 30 31 32 -34 -35 35 -37 41 68 -40 70 -42 42 43 81 51 55 47 48 50 -51 -52 52 -54 62 79 67 -58 64 69 91 86 82 -64 -65 -66 -67 -68 -69 -70 -71 -72 -73 -74 -75 -76 76 -78 -79 92 -81 -82 -83 -84 -85 -86 -87 102 -89 93 101 -92 95 -94 -95 -96 -97 -98 109 -100 -101 -102 -103 -104 -105 -106 112 -108 -109 -110 -111 -112 -113 113 -115 -116
leaf_value=-0.024528909120529185 0.010624133208020803 0.020844506208650245 0.0034685447864090131 -0.0032600287422573275 0.05069401592353931 -0.014897950766258883 0.058386796223871232 0.014161808849753861 -0.018246315544297575 0.013654823538208806 0.013735938565647296 0.025675463520979255 -0.014098700680212656 -0.023855861324340144 0.040704749263754392 -0.001564696107299238 -0.023293341707675962 -0.0084111955306557448 -0.0068075598145451366 0.056697497769511135 0.00019010395016193677 -0.021603950135983246 0.029127942237076938 -0.020558990247717755 -0.0079562837264275984 -0.017801379106567896 0.004016906887715074 -0.018998943072258648 -0.02184996346787671 0.034863653331292849 0.016036174169688413 0.00039813406385767974 0.01028020873497347 0.0041226380351830879 0.044428511379396941 -0.0028071805427705787 0.0065016798788102865 -0.016029874657168302 0.017377093998981331 -0.017358103211212287 -0.015652060241476039 -0.012888745934937726 0.041151786093895783 -0.0046204075739421533 -0.01785411500874506 0.0038420921275122786 0.0040366646142048716 0.037237276884345777 -0.00079635628182361329 0.0076861173544231602 0.012046105939505291 0.0056306828639617725 -0.0064678261192362687 -0.02090642764523418 -0.021506018934001572 0.0090344120325558559 -0.0097929382727711071 -0.0073913483951086939 0.0030613664732497261 -0.019852547238255563 -0.019604118690438047 -0.0067074617711576192 -0.010751216994379758 -0.010305290406180509 -0.0031708885705415517 -0.0021119796174727599 -0.0064133032039485399 0.012496695910579106 -0.018884382783842843 -0.002046195981421914 -0.013204092135292346 0.0077027075066115119 0.012156752811868498 -0.012102646782705428 -0.01211689793983974 0.0054280920121068813 0.010178156699374337 -0.011061565049131281 -0.014115465835404434 -0.015438410743319664 -0.01740422561987583 -0.00090246352048086852 -0.0028087290459054299 0.0063591215322000797 -0.017580806695517349 -0.014534350666164854 -0.015421808373902 -0.018841632460599615 -0.016217983467582721 -0.021904860863325149 -0.019652970056146798 -0.017224757782703271 -0.011274617132280514 -0.013481698244817042 -0.015824297869813177 -0.014107176337217598 -0.015729460036019619 -0.021857662389249376 -0.022379128641957995 -0.017332880308753077 -0.022501039141354224 -0.019747241159922647 -0.013944380768916454 -0.018241741349115766 -0.018497539351430954 -0.024827563654943142 -0.024797803687407353 -0.021079308279076111 -0.016409338870649139 -0.020912947438405733 -0.023804367423423584 -0.016129978118531143 -0.024809539580362385 -0.024829264947140797 -0.024823735065874885
leaf_weight=148.41890944540501 12.089448183774948 13.402709126472471 47.345830321311951 35.698060773313046 10.854202300310133 8.4870278984308225 10.539692819118498 11.99287563562393 3.8227691054344168 38.053295373916626 17.924891591072083 16.128013610839844 12.290394484996797 9.0604689344763809 9.0221630036830884 14.639481544494631 2.5809710174798965 8.0705487579107267 16.523455172777176 6.3886249959468833 10.877380609512331 5.3505323082208616 6.8112970143556586 17.544514708220959 7.8505195379257229 12.665668725967409 12.022624373435972 6.9208078086376172 12.6910500228405 10.328624755144117 16.429080724716187 38.979968130588531 210.63618376851082 352.44160658121109 8.7359989583492261 36.40038900077343 15.271651983261107 6.6527230143547076 11.436260730028151 22.495401903986931 6.150589033961297 6.5402174144983318 7.4736545085907009 7.3931123614311245 7.4251955449581128 26.565553247928619 14.140515327453612 15.166456520557405 16.109719097614288 16.054749846458435 432.19423180818558 15.883581161499022 146.74712145328522 13.328735642135149 3.417271822690962 48.99564927816391 21.499027267098427 65.269334733486176 9.5822054445743561 2.3181025385856646 3.4542948678135854 7.6638034582138035 4.6505597084760657 3.1961277872323981 16.512461200356483 21.707497090101242 17.155104696750641 19.349337697029114 15.86083699762821 12.399950042366982 11.495264306664465 32.693790316581726 22.243577480316162 6.1404174864292145 9.6328491419553739 19.869580805301666 12.528715848922728 5.8579493016004553 5.4002124667167646 5.0473462343215942 11.996314153075216 8.7877682745456678 4.8542674481868753 22.685490846633911 4.9104214161634445 2.859659805893898 2.4840462356805793 2.673626944422721 5.3404911309480685 3.8346043750643712 9.8768029510974884 4.4119252115488035 4.7141330391168594 4.9833084344863892 2.6213023439049721 2.6316678822040558 3.8200039789080611 2.0095288082957259 6.035548008978366 3.1629596203565598 6.0854861140251151 2.1753060817718506 2.7544655501842499 2.572682186961174 4.0634566396474838 86.90814545750618 120.4644174054265 3.4947842359542847 2.6089242249727249 2.3279473558068275 8.2608051002025658 4.7798497229814529 9.5756590366363508 6.1252756118774405 25.082516923546791
leaf_count=1542 36 22 167 193 21 32 6 30 17 106 35 18 50 92 26 54 26 30 57 19 47 22 23 81 19 105 37 55 115 20 30 86 397 860 23 109 28 31 36 96 27 30 14 27 25 39 22 22 18 22 437 24 562 77 25 64 156 295 27 21 31 41 33 21 72 69 47 13 41 41 65 28 25 20 53 33 21 23 42 35 33 32 23 90 26 21 20 22 43 37 84 37 35 38 21 21 31 20 59 27 60 20 21 22 36 908 1257 33 21 22 84 22 100 64 262
internal_value=0 0.00587561 -0.0170091 -0.0200066 -0.000641179 0.00379059 0.0117834 0.00680393 0.0141651 0.0218751 -0.00675611 0.00907213 -0.00584969 -0.00907395 -2.16606e-05 0.00605286 -0.0109948 -0.00367393 0.00258124 0.0203564 -0.00580453 -0.00244013 2.68152e-05 -0.00302782 0.00666366 -0.00836064 -0.006268 0.000438365 -0.0100084 0.0063751 0.00677058 0.00630143 0.00873703 0.00465325 0.00198903 0.00633513 -0.00516795 -0.00887667 -0.00489049 -0.00976612 0.00176373 -0.00363464 0.00271886 0.0112226 -0.00505199 0.011411 0.0121509 0.0117363 0.0122654 0.0220413 0.0115846 -0.00605339 -0.00528621 -0.0126104 -0.00772139 0.0087339 -0.00571559 -0.00732509 -0.00196091 -0.0202996 -0.0201991 -0.00783566 -0.017076 -0.018856 -0.0065392 -0.00414141 -0.00418081 0.00978802 -0.0165321 0.000180233 -0.0159533 0.00928374 0.0100093 -0.0152507 -0.0138583 0.00628408 0.00726499 -0.0143743 -0.0154027 -0.017888 -0.0157315 -0.00260121 -0.00519561 0.0055478 -0.0196787 -0.0176936 -0.0167675 -0.0223547 -0.0163878 -0.0224846 -0.0208885 -0.0172911 -0.0127914 -0.0148972 -0.0180532 -0.0161544 -0.0173213 -0.0228381 -0.0232654 -0.0184407 -0.0232579 -0.0211075 -0.014645 -0.0190226 -0.0189897 -0.0247061 -0.0246494 -0.0215112 -0.0169218 -0.0213506 -0.0236827 -0.0160717 -0.0248255 -0.0248172 -0.0248267
internal_weight=0 2033.18 779.78 603.381 669.094 338.094 109.182 98.6427 62.3631 48.9075 176.399 1364.09 36.2796 158.474 228.912 85.9531 206.806 142.959 52.6901 14.4592 122.48 81.9626 71.7016 64.8903 672.051 161.177 124.254 44.4886 79.7649 658.648 628.815 618.487 249.616 368.871 76.931 45.1364 330.999 96.8183 63.667 52.2307 18.24 234.181 42.7128 23.6545 191.468 692.04 542.192 526.064 479.525 31.2212 448.304 176.196 162.631 40.5174 19.342 149.848 57.1971 90.2688 29.8327 45.629 35.9939 19.0583 21.1754 16.5249 81.7818 38.231 31.7946 123.282 33.1514 21.9822 33.9907 103.933 71.2392 13.5656 13.4556 46.5388 32.3983 17.2905 36.9238 8.46462 24.2867 16.1809 12.5181 34.7081 10.261 9.78047 13.8868 22.1071 26.8095 26.432 22.5679 19.197 10.1143 10.3238 8.64828 9.65252 16.4857 19.4335 15.096 9.54452 16.9273 9.50469 5.23851 6.02698 6.38156 396.575 268.883 7.32939 7.02085 4.33748 10.8418 11.4326 127.692 15.7009 111.991
internal_count=11139 4616 6523 5601 2352 1149 316 310 197 127 922 2264 113 887 833 259 1468 574 175 49 557 319 271 248 1502 1045 751 203 548 1480 1393 1373 483 890 233 132 1203 377 260 224 63 826 167 73 659 762 593 575 499 44 455 631 586 238 107 169 349 399 87 423 330 94 131 98 367 126 101 130 117 68 161 117 89 45 70 76 54 76 294 60 83 59 64 127 48 76 115 215 217 260 199 163 77 81 74 79 136 193 151 84 170 90 41 53 57 4133 2799 70 58 42 110 53 1334 164 1170
cat_boundaries=0 1 2 3 4 5 6 7 8 9 10 11 12 13 14 15 16 17 18 19 20 21 22 23 24 25 26
cat_threshold=2 2 2 1 1 1 1 1 2 2 2 1 1 1 1 1 1 1 1 1 2 1 2 1 1 1
is_linear=0
shrinkage=0.05


Tree=40
num_leaves=101
num_cat=27
split_feature=2 3 2 2 2 3 2 1 3 2 2 2 3 2 2 3 2 0 2 3 2 3 3 2 3 2 2 0 2 1 0 3 2 2 2 2 2 1 2 0 2 3 1 2 3 2 3 0 2 3 2 1 2 1 2 1 2 2 1 2 0 2 2 1 2 3 2 2 1 3 1 3 2 2 2 0 1 3 2 2 0 2 1 2 3 3 3 2 2 1 2 3 0 1 3 2 3 1 0 0
split_gain=136.433 12.2099 9.10985 7.47153 8.33904 5.77013 12.9263 4.10324 2.79771 8.35127 2.30587 5.94463 2.30968 1.92325 3.6164 1.6317 1.5996 1.42828 2.00549 17.8708 2.10346 1.31555 2.94265 4.41496 9.74401 2.80774 1.11626 1.10793 1.12532 2.46939 1.37389 1.21354 0.997025 2.48189 4.44957 0.940324 0.855243 0.681119 0.851309 1.05641 0.666822 0.587401 0.737312 0.564821 0.541124 0.459769 0.343694 0.303916 0.294758 0.288442 0.281046 0.422094 0.273766 0.236924 0.175957 0.120571 0.130145 0.112561 0.0961451 0.144498 0.0824055 0.0665102 0.296493 0.066451 0.0617568 0.0639096 0.0568866 0.0566041 0.0541647 0.0404973 0.0386791 0.0371813 0.0358815 0.0331637 0.0323761 0.0306141 0.0272098 0.0260842 0.0202909 0.0149647 0.0115329 0.0108683 0.00801148 0.0075016 0.00599369 0.00592548 0.00358079 0.0030974 0.00286058 0.00223917 0.00184995 0.00139945 0.00122712 0.00168066 0.000915003 0.000740619 0.000685692 3.75534e-07 5.93423e-07 2.4457e-07
threshold=13.500000000000002 5.5000000000000009 78.500000000000014 4.5000000000000009 5.5000000000000009 33.500000000000007 1.0000000180025095e-35 0 17.500000000000004 26.500000000000004 31.500000000000004 32.500000000000007 3.5000000000000004 67.500000000000014 64.500000000000014 1.0000000180025095e-35 1.0000000180025095e-35 1 85.500000000000014 8.5000000000000018 80.500000000000014 1.0000000180025095e-35 5.5000000000000009 152.50000000000003 2.5000000000000004 252.50000000000003 316.50000000000006 2 14.500000000000002 3 4 6.5000000000000009 168.50000000000003 205.50000000000003 194.50000000000003 6.5000000000000009 248.50000000000003 5 1.0000000180025095e-35 6 609.50000000000011 1.0000000180025095e-35 7 242.50000000000003 1.0000000180025095e-35 129.50000000000003 31.500000000000004 8 96.500000000000014 1.5000000000000002 2.5000000000000004 9 8.5000000000000018 10 81.500000000000014 11 39.500000000000007 19.500000000000004 12 127.50000000000001 13 126.50000000000001 119.50000000000001 14 232.50000000000003 12.500000000000002 500.00000000000006 289.50000000000006 15 3.5000000000000004 16 17.500000000000004 12.500000000000002 83.500000000000014 145.50000000000003 17 18 1.5000000000000002 1.5000000000000002 2.5000000000000004 19 23.500000000000004 20 16.500000000000004 1.0000000180025095e-35 1.5000000000000002 1.5000000000000002 3.5000000000000004 29.500000000000004 21 1.5000000000000002 1.5000000000000002 22 23 2.5000000000000004 1.5000000000000002 1.0000000180025095e-35 24 25 26
decision_type=2 2 2 2 2 2 2 1 2 2 2 2 2 2 2 2 2 9 2 2 2 2 2 2 2 2 2 9 2 1 9 2 2 2 2 2 2 1 2 9 2 2 1 2 2 2 2 9 2 2 2 1 2 1 2 1 2 2 1 2 9 2 2 1 2 2 2 2 1 2 1 2 2 2 2 9 1 2 2 2 9 2 1 2 2 2 2 2 2 1 2 2 9 1 2 2 2 1 9 9
left_child=1 3 8 15 7 6 -3 44 10 -10 27 -12 13 14 -13 16 92 18 19 20 -4 32 23 24 -23 45 -27 57 29 -29 31 -30 58 34 -34 41 48 38 39 49 -35 42 -6 -25 -5 -24 -11 50 73 -17 51 -18 63 -15 -22 60 -57 83 59 -20 -14 62 76 75 65 -63 67 -38 72 -69 -56 -71 -54 -19 -60 -37 -50 -65 85 90 95 91 -52 96 -70 -39 -41 -82 -83 -81 -49 -59 93 -1 -87 -40 -2 98 -94 -99
right_child=2 5 17 4 35 -7 -8 -9 9 46 11 12 55 53 -16 37 47 36 21 -21 54 22 25 43 -26 26 -28 28 30 -31 -32 -33 33 40 -36 52 66 78 80 86 -42 -43 -44 -45 -46 -47 -48 79 61 -51 82 -53 68 -55 70 56 -58 81 74 -61 -62 64 -64 77 -66 -67 -68 69 84 71 -72 -73 -74 -75 -76 -77 -78 -79 -80 89 87 88 -84 -85 -86 94 -88 -89 -90 -91 -92 -93 97 -95 -96 -97 -98 99 -100 -101
leaf_value=-0.024521043197778526 -0.014254558923178921 0.08378232717862405 0.018996579843336012 0.022548785230084085 -0.018455848183881563 -0.006573476574575245 -0.015309198301801153 -0.018609734882168428 0.050114091116105569 -0.0070343772936758368 0.048018804382732039 0.0049871494530290151 -0.0015857888146922879 -0.0059754200424159245 0.02499442650746982 -0.0015731805045744705 -0.017403509699722559 -0.0045618103283332108 -0.0001893344034531513 0.07677459122893189 -0.010150278920510125 0.011162296344635149 0.00089510227204657564 0.006199019546850041 0.046289961389219009 0.018466615567269595 0.010279359600911475 0.032403009043326485 -0.0036590175178619136 -0.0010228767814938625 0.014393683049758063 0.011323323744894061 0.0078703215326101691 0.0050144850729243358 0.045677872823867177 -0.021797294481270782 0.01089927309553592 -0.023988406390436878 -0.023876047165964004 -0.023916232395498328 0.01462663174736762 -0.02009012451601579 0.0059991652882444681 0.012659194602875831 0.041363713639039151 0.0058151267697579452 0.0062247834039912348 -0.023646502332506251 0.0040877333200860684 -0.010242479855836099 -0.021884532812189699 -0.0083415779070621903 -0.016563999249116831 0.00076777233539228784 -0.0034233854903639549 -0.0084513682168244099 -0.00028929815837951275 -0.0099667880213337601 0.0052731132695539923 0.0045608420937955545 -0.0068447034629108344 0.0046453332145829336 -0.0046082624465113081 -0.015436513044218256 0.0014836842646720647 0.0078737179406320971 0.010920392092012805 0.0059502770870855613 -0.013195575078749992 0.009835858516541238 0.0010626749337479561 0.0070075135800703589 -0.012407529015073322 -0.0005255297807113744 0.0023217854698075377 -0.017715776123553972 0.0074230134535352588 -0.019990948029133149 -0.019767804761562941 -0.021218796172743887 -0.021618079173561636 -0.0075809875249356123 -0.019997887510990714 -0.012339711702065012 -0.011441453321574264 -0.022769810298495147 -0.02215052743993921 -0.019209371488921777 -0.0059580500403740742 -0.019350302000529174 -0.02254263046918591 -0.0086618364681063688 -0.024827552269125863 -0.024779339010174543 -0.021733662023415382 -0.02308387121690433 -0.015170542211684099 -0.024817663261157235 -0.024813705747448886 -0.02482926613406701
leaf_weight=144.82264079153538 3.6472424119710904 7.0992267429828662 16.427716284990311 14.56157833337784 4.1999412626028061 16.336282223463058 6.1353668868541718 6.3902462348341968 11.745497822761534 13.849859043955805 7.5110714584588996 206.68551523983479 9.1007560938596725 32.59244866669178 25.356980860233307 18.844548434019089 39.154013097286224 8.0478728413581866 36.918755561113358 10.810883104801176 7.6186935603618648 52.480139762163162 68.511975437402725 60.129005819559097 31.645556539297104 53.205267548561096 191.39837855100632 7.9077803492546082 216.01763461530209 18.340310335159305 12.353852629661558 14.417658269405363 22.099798619747162 135.29963660240173 12.012086808681486 25.888203375041485 17.892049431800842 13.830295912921434 4.5353752970695504 6.6304061338305456 20.819405436515808 5.0576718226075164 11.58091512322426 77.372211992740631 5.1812173128128043 154.70637103915215 7.5526449829339972 11.552138105034834 17.016285300254822 19.547057196497917 11.984871715307236 19.127767905592918 27.517082341015339 21.698401600122452 9.5702919065952265 6.0946861356496838 24.583781659603119 4.8115131258964556 45.867755025625229 28.268002778291702 41.045278117060661 62.65186882019043 10.589541018009184 9.4625789597630483 11.225546240806578 20.295768916606903 30.040328323841095 21.613842964172363 12.990235023200514 25.872418403625488 9.6497196853160894 21.093241512775421 6.3999600186943999 13.842303305864332 11.65328675508499 5.5855340212583569 9.5453109443187731 4.7078322470188132 4.8091922402381888 7.6895755752921087 3.2609973624348649 9.2682304531335813 10.60693097114563 5.1614353358745566 7.7903074473142615 4.928351476788519 5.0645618438720703 2.2593618407845497 3.8400850296020499 2.0258278176188469 5.6525808200240126 3.5855082720518112 86.270855963230133 111.4372079372406 3.7533917725086212 8.4431180357933027 4.6453783959150314 24.000600762665272 8.5003229007124883 5.6016205251216915
leaf_count=1542 25 31 33 58 34 31 32 52 6 30 33 795 37 99 50 71 216 20 101 18 16 128 154 109 69 71 166 27 707 48 41 36 41 153 20 107 26 82 20 69 13 28 53 84 22 275 22 120 49 50 111 137 227 61 31 21 74 31 102 69 155 127 18 73 14 39 25 24 101 30 24 23 50 37 18 49 22 16 38 75 32 56 92 33 58 39 50 21 20 19 57 22 924 1192 30 37 25 257 91 60
internal_value=0 -0.0181924 0.00661566 -0.0194654 -0.00940229 0.0133062 0.0378449 0.0162147 0.00205274 0.0162364 0.00135997 0.00398522 0.00308441 0.00519136 0.00717349 -0.0220024 -0.0231732 0.00906474 0.00989385 0.019273 0.0049052 0.00938786 0.0106082 0.0153541 0.0243763 0.00835988 0.0120602 -0.00187558 -0.000787486 0.00904736 -0.00185074 -0.00272162 0.00669924 0.00896592 0.0211838 -0.0149267 0.00581731 -0.0160398 -0.0133804 -0.00999496 0.00629632 -0.00526174 -0.000509329 0.00983417 0.0274865 0.00430503 -0.0023554 -0.0177963 0.00336211 -0.00598715 -0.0162646 -0.0144294 -0.0169339 -0.00328037 -0.00372001 -0.0043798 -0.0019108 -0.0102492 0.00318528 0.00187056 -0.00589029 0.00425748 0.00246597 -0.0197929 0.00496423 0.00543526 0.00904594 0.00839475 -0.0145481 0.00774134 -0.00117109 0.00856559 -0.0157797 -0.00200946 0.0046752 -0.021073 0.00528632 -0.0169496 -0.0227159 -0.022398 -0.0225465 -0.00800518 -0.0209987 -0.0138362 -0.012538 -0.0233457 -0.0231516 -0.0206322 -0.00710555 -0.0208292 -0.0232838 -0.00940958 -0.0246959 -0.0246334 -0.0223219 -0.0233607 -0.0147677 -0.0248248 -0.0248263 -0.0248199
internal_weight=0 761.218 2038 731.647 147.313 29.5709 13.2346 26.133 711.814 33.148 678.666 374.669 367.158 286.333 232.042 584.334 488.427 1326.19 1056.46 54.0773 43.2664 1002.39 689.449 221.627 84.1257 467.822 244.604 303.997 269.037 26.2481 242.789 230.435 312.939 190.231 34.1119 121.18 269.726 95.9067 68.5854 50.0866 156.119 20.8385 15.7809 137.501 19.7428 223.218 21.4025 107.794 153.214 38.3916 80.8736 58.2818 100.342 54.2909 26.8387 80.8245 30.6785 34.9594 122.708 65.1868 50.146 131.324 37.1511 45.6441 94.1732 82.9476 116.512 86.4716 54.6976 68.5795 19.22 46.9657 33.917 21.8902 57.521 31.4737 26.5616 14.1704 27.3212 26.9201 18.4989 21.5053 22.5918 13.4541 20.7805 22.512 11.695 5.52036 13.1083 9.7154 17.2047 8.39702 380.633 256.26 8.68174 12.9785 8.29262 124.373 94.7712 29.6022
internal_count=11057 6454 4603 6360 928 94 63 132 2454 58 2396 1325 1292 1005 845 5432 4893 2149 1695 122 104 1573 1056 390 197 666 237 1071 859 75 784 743 517 227 61 796 454 539 350 240 166 115 87 193 80 429 52 827 326 121 556 353 681 160 71 287 95 212 290 170 192 269 89 245 180 166 128 103 436 77 55 53 277 57 120 156 71 89 189 271 110 129 203 83 159 151 119 53 76 94 177 53 4066 2734 69 57 50 1332 1015 317
cat_boundaries=0 1 2 3 4 5 6 7 8 9 10 11 12 13 14 15 16 17 18 19 20 21 22 23 24 25 26 27
cat_threshold=1 2 1 2 2 1 2 2 2 1 1 1 1 1 1 1 1 2 1 2 1 1 2 1 1 1 1
is_linear=0
shrinkage=0.05


Tree=41
num_leaves=98
num_cat=24
split_feature=2 3 2 2 2 3 2 1 3 2 2 2 3 2 2 3 2 0 2 3 2 3 3 2 2 2 2 2 0 3 3 2 3 2 2 2 1 2 0 2 3 1 2 3 3 0 2 1 3 2 2 1 3 2 1 2 1 2 2 0 1 2 2 2 3 1 2 2 3 2 3 2 0 3 1 2 2 0 2 1 2 3 3 3 2 2 1 2 3 0 1 3 2 3 1 0 0
split_gain=131.315 11.8891 8.5083 7.47856 7.99276 5.22887 11.0341 3.80544 2.60388 7.43894 2.18464 5.3423 2.18757 1.81207 3.31056 1.65054 1.62538 1.32308 2.39738 2.49207 4.86445 7.14956 14.5437 1.90439 5.35021 1.51249 1.41613 4.81829 1.06744 1.11829 2.79664 1.66922 7.85171 3.75789 0.928277 0.79837 0.682727 0.848033 1.04527 0.617523 0.573425 0.710566 0.491104 0.468388 0.327889 0.305974 0.281598 0.418054 0.2793 0.278712 0.274194 0.227255 0.188381 0.147579 0.11608 0.125114 0.114894 0.11058 0.106292 0.0795105 0.0669929 0.0625141 0.281064 0.0580227 0.0596725 0.0537922 0.0525559 0.0523644 0.0376466 0.0357021 0.0344534 0.0317659 0.0309498 0.0261539 0.0254361 0.0206216 0.0152189 0.0117292 0.0105956 0.00811801 0.00743557 0.00604515 0.0059184 0.00365151 0.00313411 0.00277786 0.00226557 0.00188696 0.00136918 0.00125755 0.00172199 0.00093084 0.000756079 0.000681884 3.8512e-07 6.08475e-07 2.50682e-07
threshold=13.500000000000002 5.5000000000000009 78.500000000000014 4.5000000000000009 5.5000000000000009 33.500000000000007 1.0000000180025095e-35 0 17.500000000000004 26.500000000000004 31.500000000000004 32.500000000000007 3.5000000000000004 67.500000000000014 64.500000000000014 1.0000000180025095e-35 1.0000000180025095e-35 1 79.500000000000014 1.0000000180025095e-35 93.500000000000014 10.500000000000002 2.5000000000000004 117.50000000000001 123.50000000000001 156.50000000000003 205.50000000000003 194.50000000000003 2 2.5000000000000004 6.5000000000000009 15.500000000000002 1.0000000180025095e-35 18.500000000000004 6.5000000000000009 248.50000000000003 3 1.0000000180025095e-35 4 609.50000000000011 1.0000000180025095e-35 5 88.500000000000014 1.0000000180025095e-35 31.500000000000004 6 2.5000000000000004 7 1.5000000000000002 96.500000000000014 8.5000000000000018 8 22.500000000000004 150.50000000000003 9 39.500000000000007 10 19.500000000000004 23.500000000000004 11 12 126.50000000000001 119.50000000000001 232.50000000000003 12.500000000000002 13 500.00000000000006 289.50000000000006 3.5000000000000004 12.500000000000002 17.500000000000004 83.500000000000014 14 1.5000000000000002 15 1.5000000000000002 2.5000000000000004 16 23.500000000000004 17 16.500000000000004 1.5000000000000002 1.0000000180025095e-35 1.5000000000000002 3.5000000000000004 29.500000000000004 18 1.5000000000000002 1.5000000000000002 19 20 2.5000000000000004 1.5000000000000002 1.0000000180025095e-35 21 22 23
decision_type=2 2 2 2 2 2 2 1 2 2 2 2 2 2 2 2 2 9 2 2 2 2 2 2 2 2 2 2 9 2 2 2 2 2 2 2 1 2 9 2 2 1 2 2 2 9 2 1 2 2 2 1 2 2 1 2 1 2 2 9 1 2 2 2 2 1 2 2 2 2 2 2 9 2 1 2 2 9 2 1 2 2 2 2 2 2 1 2 2 9 1 2 2 2 1 9 9
left_child=1 3 8 15 7 6 -3 43 10 -10 28 -12 13 14 -13 16 89 18 -4 25 21 22 -21 52 -25 42 27 -27 57 31 58 32 -30 -33 40 49 37 38 48 -28 41 -6 56 -5 -11 46 47 -18 -17 71 60 -15 -22 -44 59 -56 -20 80 -31 -14 72 62 74 64 -63 69 67 -37 -69 -52 -70 -19 -36 -62 -51 81 87 92 88 -48 93 -38 -67 -40 -79 -80 -78 -47 -59 90 -1 -83 -39 -2 95 -91 -96
right_child=2 5 17 4 34 -7 -8 -9 9 44 11 12 54 51 -16 36 45 35 19 20 23 -23 -24 24 -26 26 39 -29 29 30 -32 33 -34 -35 50 66 75 77 83 -41 -42 -43 53 -45 -46 76 79 -49 -50 61 65 -53 -54 -55 55 -57 -58 78 -60 -61 73 63 -64 -65 -66 82 -68 68 70 -71 -72 -73 -74 -75 -76 -77 86 84 85 -81 -82 91 -84 -85 -86 -87 -88 -89 -90 94 -92 -93 -94 -95 96 -97 -98
leaf_value=-0.024513391237327153 -0.014102741515066897 0.075053364797435587 0.03325406033836073 0.021492422341557536 -0.018337129113520888 -0.0064530770837305561 -0.01516233204035284 -0.018492907452545743 0.046450926088735453 -0.0069087600692313497 0.04460338401396282 0.0048388205245360749 -0.0015489003976320087 -0.0058624231559909175 0.023764547077114322 -0.0015365667558216011 -0.017273143506351962 -0.0044691428025600477 -0.0077977395711354468 0.0010473303135961462 0.00095303656554896919 -0.0067940120346510384 0.066767227605855226 0.032438510485182981 0.0097650425595608922 0.0066737611544929187 0.0048652086113888755 0.042529706181967081 -0.0048179755644014938 -0.018548667811504851 0.0097567904906813562 -0.016707772174883805 0.044190011549998243 0.0020265880472994718 -0.021730480231253922 0.010511972464209891 -0.023967992216491693 -0.023853013614320642 -0.023894132993952977 0.014053724879878061 -0.019993951543106778 0.005814775123349613 0.0036247242818875851 0.03868157744606187 0.0060320789259723749 -0.023618200361916128 -0.021819379107645781 -0.008203469724236254 -0.010092307403730655 0.0039697696323301238 -0.016425953287777354 0.00074812713105734154 0.0091486579143577867 -0.0031741754952516197 -0.0083123663338844044 -0.0002821977750645615 -0.0010807766428557815 -0.0098179164550387839 -0.012368810660665168 -0.0067211822949342706 -0.01529039732946985 0.0045087313895066736 -0.0045148638833287678 0.0014446730838730509 0.0076172348461812887 -0.013041044966225185 0.010532115636514522 0.0057676741206228298 0.0094965686617987741 -0.012252446378836736 0.0067851967130590236 -0.0005127541526465829 -0.017588632321054867 -0.019893252002949936 0.0071844907489662787 -0.019666755189143629 -0.021141367676325393 -0.02154790352869905 -0.0074497315364336035 -0.019900297113826154 -0.012184639303888481 -0.022722378323377708 -0.011287397642167227 -0.022090529934240277 -0.019100373039468335 -0.0058452785987513425 -0.01924325076401287 -0.022490497833843923 -0.0085211883866185053 -0.024827509949258964 -0.024778087789487795 -0.021665646130499653 -0.023043112099258814 -0.01502289663299365 -0.024817371146965219 -0.024813313881074883 -0.024829264852636562
leaf_weight=141.31462906301022 3.5956214666366559 7.719643712043764 10.560944080352781 14.893654346466066 4.1231386959552765 16.229248344898224 6.0421547591686249 6.2724250927567509 12.349111437797545 13.752775773406031 7.8805440068244925 207.71886166930199 9.0863355845212936 32.398275703191757 25.998751074075699 18.814927041530609 38.47849240899086 8.0112436115741747 13.675075948238373 14.868121296167372 59.390264958143234 11.851683497428892 19.40548774600029 27.241667240858078 579.25418919324875 36.767075181007385 135.97979789972305 12.573497563600538 26.727910950779915 20.487890362739567 15.152047276496885 32.504671633243561 11.772590011358259 151.65180446207523 25.330016039311886 18.088126361370087 13.5024765431881 4.4283710718154916 6.4737130254507047 21.126161098480225 4.9570765271782866 11.65060016512871 95.775757312774658 5.4000259637832633 7.5998051911592475 11.282175108790403 11.72543728351593 18.968875631690025 19.34786818921566 17.085985630750656 27.065043516457081 21.715067654848099 7.9501214325428 8.707176595926283 6.0433945208787945 24.576670631766319 11.911888718605042 4.7637959718704241 10.536323189735411 40.765294298529625 9.3176310732960683 62.943585008382797 10.540853917598723 11.242213904857634 20.456202894449234 12.819946989417078 30.370178759098053 21.742834508419037 26.12815135717392 6.3210427165031424 21.24157190322876 13.835030764341353 5.4874533191323307 4.6146527081727973 9.6164295673370379 4.7150585874915114 7.5281310304999334 3.1912574246525773 9.1982338130474073 10.396921753883362 5.0981361120939246 4.8174018859863263 7.7016830518841735 4.953612431883812 2.2163751274347305 3.8172737061977378 1.9870041757822035 5.5265824422240248 3.5545853227376938 84.155333787202835 108.70979791879654 3.6726970002055168 8.250450521707533 4.5754373967647552 23.41229210793972 8.2919943258166295 5.464248955249789
leaf_count=1542 25 31 19 58 34 31 32 52 6 30 33 795 37 99 50 71 216 20 35 37 155 23 40 46 785 70 153 20 91 58 37 139 21 468 107 26 82 20 69 13 28 53 234 22 22 120 111 137 50 49 227 61 20 15 21 74 30 31 45 155 73 127 18 14 39 101 25 24 30 50 23 37 49 16 22 38 75 32 56 92 33 39 58 50 21 20 19 57 22 924 1192 30 37 25 257 91 60
internal_value=0 -0.0180712 0.00640634 -0.0193603 -0.00925866 0.0127719 0.0354439 0.0155456 0.00199593 0.0155617 0.00132321 0.00386923 0.00299765 0.00503516 0.00694412 -0.0219395 -0.0231344 0.00875704 0.00954975 0.0093128 0.010973 0.0266817 0.0382575 0.00989774 0.0107835 0.00576081 0.00842152 0.015811 -0.0018332 -0.000769243 -0.00785056 0.000699334 0.0101676 -0.00128013 -0.0147781 0.00563928 -0.015898 -0.0132266 -0.00984645 0.0061008 -0.00516007 -0.000498354 0.00153774 0.0260664 -0.00230286 -0.0176701 -0.0161242 -0.0142784 -0.00587418 0.00326729 -0.0167991 -0.00320968 0.0019206 0.00305813 -0.00429014 -0.00186709 -0.00467069 -0.0100991 -0.0164499 -0.00577844 -0.0196922 0.00413377 0.00239845 0.00481664 0.00527118 -0.0143975 0.00874082 0.00811695 0.00749012 -0.0156358 0.00828073 -0.0019636 -0.020993 -0.016815 0.0051275 -0.0226674 -0.0223429 -0.0224944 -0.00786998 -0.0209175 -0.0136831 -0.0233107 -0.0123829 -0.0231123 -0.0205448 -0.00697917 -0.020745 -0.0232474 -0.0092638 -0.0246926 -0.0246285 -0.0222653 -0.023326 -0.014618 -0.0248247 -0.0248262 -0.0248196
internal_weight=0 747.572 2051.66 717.581 145.954 29.991 13.7618 26.5661 713.321 33.7017 679.62 376.183 368.303 287.831 233.718 571.626 477.242 1338.34 1067.04 1056.48 719.962 46.1253 34.2736 673.836 606.496 336.516 206.447 49.3406 303.436 268.833 46.1763 222.657 38.5005 184.156 119.388 271.302 94.3842 67.6766 49.5901 157.106 20.7308 15.7737 130.07 20.2937 21.3526 105.894 79.5697 57.4474 38.1628 153.732 98.6575 54.1133 67.3404 104.483 80.4717 30.6201 25.587 34.6031 31.0242 49.8516 44.7498 131.885 37.2433 94.642 83.3998 53.9077 117.571 87.2007 69.1126 33.3861 47.3697 21.8463 30.8175 13.9323 26.7024 26.7076 26.3239 18.0865 21.3339 22.1224 13.2692 21.9926 20.5216 11.4273 5.40763 13.0155 9.51514 16.8088 8.31838 371.348 250.024 8.4901 12.6788 8.17106 121.324 92.4473 28.8765
internal_count=11057 6454 4603 6360 928 94 63 132 2454 58 2396 1325 1292 1005 845 5432 4893 2149 1695 1676 1106 100 77 1006 831 570 256 90 1071 859 140 719 112 607 796 454 539 350 240 166 115 87 314 80 52 827 556 353 121 326 681 160 175 249 287 95 65 212 103 192 245 269 89 180 166 436 128 103 77 277 53 57 156 89 71 189 271 110 129 203 83 151 159 119 53 76 94 177 53 4066 2734 69 57 50 1332 1015 317
cat_boundaries=0 1 2 3 4 5 6 7 8 9 10 11 12 13 14 15 16 17 18 19 20 21 22 23 24
cat_threshold=1 2 1 1 2 2 2 1 1 1 1 1 1 1 2 1 2 1 1 2 1 1 1 1
is_linear=0
shrinkage=0.05


Tree=42
num_leaves=97
num_cat=23
split_feature=2 3 2 2 2 3 2 1 3 2 2 2 3 2 2 3 2 0 2 3 2 3 3 2 2 2 2 2 0 3 2 2 3 2 2 2 1 2 0 2 3 1 2 3 2 0 2 1 2 3 2 1 2 1 2 1 2 2 0 2 2 1 2 3 1 2 2 2 3 3 0 2 3 2 2 2 0 2 1 2 3 3 3 2 3 1 2 3 0 1 3 2 3 1 0 0
split_gain=126.399 11.5821 7.95273 7.48333 7.66402 4.75416 9.52576 3.53632 2.42592 6.65555 2.07094 4.81893 2.07226 1.70788 3.03562 1.66919 1.65129 1.22679 2.16132 2.30688 4.39791 20.3301 2.65732 3.87815 2.6047 1.41501 1.30435 4.28633 1.02793 1.07203 2.74976 1.56985 7.09829 3.63248 0.91603 0.745719 0.684102 0.844469 1.03394 0.572408 0.559666 0.684827 0.467089 0.407611 0.324047 0.307946 0.282046 0.413879 0.274516 0.270365 0.263952 0.217945 0.13985 0.111729 0.120255 0.110773 0.108585 0.0834604 0.076696 0.0688143 0.249374 0.0675177 0.0545339 0.0557481 0.0533981 0.0486031 0.0484876 0.035508 0.0350223 0.0319534 0.0312805 0.028429 0.0262139 0.0211931 0.0209537 0.0154747 0.0119267 0.0103254 0.00822392 0.00736671 0.00616655 0.00584133 0.00372318 0.00317041 0.0027414 0.00229166 0.00192449 0.00133898 0.00128869 0.00176426 0.000946788 0.000771787 0.00067779 3.94508e-07 6.23546e-07 2.56948e-07
threshold=13.500000000000002 5.5000000000000009 78.500000000000014 4.5000000000000009 5.5000000000000009 33.500000000000007 1.0000000180025095e-35 0 17.500000000000004 26.500000000000004 31.500000000000004 32.500000000000007 3.5000000000000004 67.500000000000014 64.500000000000014 1.0000000180025095e-35 1.0000000180025095e-35 1 79.500000000000014 1.0000000180025095e-35 85.500000000000014 8.5000000000000018 5.5000000000000009 152.50000000000003 252.50000000000003 156.50000000000003 205.50000000000003 194.50000000000003 2 2.5000000000000004 16.500000000000004 15.500000000000002 1.0000000180025095e-35 18.500000000000004 6.5000000000000009 248.50000000000003 3 1.0000000180025095e-35 4 609.50000000000011 1.0000000180025095e-35 5 88.500000000000014 1.0000000180025095e-35 50.500000000000007 6 2.5000000000000004 7 8.5000000000000018 1.5000000000000002 94.500000000000014 8 150.50000000000003 9 39.500000000000007 10 19.500000000000004 23.500000000000004 11 126.50000000000001 119.50000000000001 12 232.50000000000003 12.500000000000002 13 500.00000000000006 289.50000000000006 12.500000000000002 3.5000000000000004 17.500000000000004 14 110.50000000000001 1.5000000000000002 83.500000000000014 1.5000000000000002 2.5000000000000004 15 23.500000000000004 16 16.500000000000004 1.5000000000000002 1.0000000180025095e-35 1.5000000000000002 3.5000000000000004 1.0000000180025095e-35 17 1.5000000000000002 1.5000000000000002 18 19 2.5000000000000004 1.5000000000000002 1.0000000180025095e-35 20 21 22
decision_type=2 2 2 2 2 2 2 1 2 2 2 2 2 2 2 2 2 9 2 2 2 2 2 2 2 2 2 2 9 2 2 2 2 2 2 2 1 2 9 2 2 1 2 2 2 9 2 1 2 2 2 1 2 1 2 1 2 2 9 2 2 1 2 2 1 2 2 2 2 2 9 2 2 2 2 2 9 2 1 2 2 2 2 2 2 1 2 2 9 1 2 2 2 1 9 9
left_child=1 3 8 15 7 6 -3 43 10 -10 28 -12 13 14 -13 16 88 18 -4 25 21 -21 23 -22 -24 42 27 -27 56 31 -31 32 -30 -33 40 50 37 38 49 -28 41 -6 55 -5 -11 46 47 -18 61 -17 73 -15 -44 58 -55 -20 79 -32 -14 60 71 70 63 -61 67 66 -37 -50 -68 -70 -36 -52 -63 -19 80 86 91 87 -48 92 -38 -66 -40 -78 -79 -77 -47 -58 89 -1 -82 -39 -2 94 -90 -95
right_child=2 5 17 4 34 -7 -8 -9 9 44 11 12 53 51 -16 36 45 35 19 20 22 -23 24 -25 -26 26 39 -29 29 30 57 33 -34 -35 48 65 74 76 82 -41 -42 -43 52 -45 -46 75 78 -49 64 -51 59 -53 -54 54 -56 -57 77 -59 -60 62 -62 72 -64 -65 81 -67 68 -69 69 -71 -72 -73 -74 -75 -76 85 83 84 -80 -81 90 -83 -84 -85 -86 -87 -88 -89 93 -91 -92 -93 -94 95 -96 -97
leaf_value=-0.024505554117309848 -0.013950396485169976 0.067831249556785683 0.031354318074089234 0.020507477529066145 -0.018216984326520146 -0.0063341106772168213 -0.015014642025835865 -0.018374640347993697 0.043215619830058255 -0.0084379785121148909 0.041574504597236703 0.0046956087675395853 -0.0015128135158486797 -0.005750904970587398 0.022623351292523027 -0.0015007481056379696 -0.017141492675225103 -0.0043779468615593679 -0.0076644131697141196 -0.0053386693758067875 0.022584917606261669 0.089436354684950745 0.0038625424938931829 0.0091612367142212669 0.011263614282394146 0.0064642175820109338 0.0047210896306321345 0.039725015157785787 -0.0047213287263293156 0.012502550832290481 -0.017278375069400956 -0.016570940337970363 0.041206452873691977 0.001972217863868067 -0.02166240552695101 0.010142412217290385 -0.023947099537246861 -0.023829447307459936 -0.023871521292622183 0.013511095830828289 -0.019896301328774717 0.0056371039670813352 0.0035217730557471297 0.036271785302403679 0.0038952626537295042 -0.023589257370414285 -0.021752982797391174 -0.0080665196983722796 -0.016286780716258827 -0.0099428239889638361 0.0034579801323406257 0.00072899922007644245 -0.0031053292299193739 -0.0081744991715980223 -0.00027526961072472217 -0.0010550959961432274 -0.0096698102753358176 -0.01222972389747699 -0.0065990645180234427 0.0043767520382842684 -0.0044229395070404303 -0.015143423327018558 0.0014067432026618385 0.0073710211217230459 -0.012886307396620458 0.010161639920330506 0.0055917088641780285 -0.012097401643046823 0.0091721339746819123 0.0065714125730133612 -0.017460152608116158 0.0067313729974910795 -0.019794075542082706 -0.00095720532321806173 -0.019564220266152177 -0.021062570563860905 -0.021476429947444621 -0.0059515176862863731 -0.019801226630623198 -0.012029626733843831 -0.022673956088468481 -0.011133679123998803 -0.022029357002012685 -0.018989897023508152 -0.007441603504932507 -0.019134716508366987 -0.022437302233252524 -0.0083816305109366135 -0.024827463368770654 -0.024776804089826007 -0.021596356069773288 -0.023001475599730561 -0.01487446442805293 -0.024817072644864463 -0.024812913144760765 -0.024829264483867595
leaf_weight=137.89263394474983 3.5452691763639432 8.3213257342576998 10.918042898178099 15.217219889163973 4.0482210218906403 16.124857157468796 5.9512325823307028 6.1574955508112934 12.936270356178282 10.617392435669901 8.2399997115135175 208.72641059756279 9.0722726583480835 32.208898916840553 26.623999387025833 18.786037772893906 37.819553598761559 7.9755201041698482 13.568855881690979 14.46363687515259 87.304039984941483 9.2944885492324811 226.66086411476135 140.22343662381172 250.0022976398468 37.01327046751976 136.64298045635223 13.119778990745543 26.599445477128029 12.299669802188872 19.308386236429214 31.966102495789528 12.304486870765684 151.95945084095001 24.785519808530807 18.279271006584167 13.182696923613554 4.3239908814430246 6.3208622261881811 21.425158739089966 4.8589492365717879 11.718542434275152 96.123548418283463 5.6130000352859488 10.686482727527617 11.018832251429563 11.472366727888584 18.813901767134666 26.624105960130692 19.153586536645889 20.353886365890506 21.731319099664688 8.6795824468135816 5.9933680295944241 24.569736212491989 11.899021595716476 4.7172543108463305 14.210724249482153 40.492222532629967 63.228020876646042 10.493370831012724 9.1762445345520955 11.258466899394987 20.612617552280426 12.65384700894356 30.691731214523315 21.868602454662323 6.2440670430660239 26.377461194992065 21.386189937591553 5.3917804360389736 9.8393677771091443 4.5237593203783026 10.47439983487129 4.623234584927558 7.370646618306635 3.1232280582189569 5.0955026745796186 10.192065089941025 5.0363940447568885 4.7091734856367093 7.6152399182319632 4.845384269952774 2.1744433268904686 7.8294871002435684 1.9491333514451978 5.4036740586161605 3.5244247317314148 82.091691970825195 106.04927140474319 3.593981496989727 8.062508210539816 4.507214829325676 22.838411465287209 8.0887738242745382 5.3302462399005917
leaf_count=1542 25 31 19 58 34 31 32 52 6 25 33 795 37 99 50 71 216 20 35 36 197 14 429 193 237 70 153 20 91 28 53 139 21 468 107 26 82 20 69 13 28 53 234 22 27 120 111 137 227 50 57 61 15 21 74 30 31 59 155 127 18 73 14 39 101 25 24 50 30 23 49 24 16 27 38 75 32 31 92 33 39 58 50 21 45 19 57 22 924 1192 30 37 25 257 91 60
internal_value=0 -0.0179486 0.00620489 -0.0192537 -0.00911586 0.0122693 0.033287 0.0149149 0.00194035 0.0149265 0.00128699 0.00375714 0.00291361 0.00488448 0.00672368 -0.0218755 -0.0230947 0.0084626 0.00922107 0.00899447 0.0105802 0.0317386 0.00986635 0.014312 0.00774429 0.00558405 0.00814129 0.0151685 -0.00179277 -0.000752676 -0.00771809 0.00067957 0.00980465 -0.00125057 -0.0146287 0.0054677 -0.0157553 -0.0130726 -0.0096987 0.00591252 -0.00505984 -0.000487591 0.00149704 0.0247554 -0.00225136 -0.0175426 -0.0159828 -0.0141267 -0.0166631 -0.00576268 0.00317546 -0.0031403 0.00297293 -0.00420194 -0.00182429 -0.00457643 -0.00994967 -0.015138 -0.00566808 0.00393791 0.00221705 -0.0195901 0.00467415 0.00511291 -0.0142462 0.00844861 0.00785055 -0.0154909 0.00724891 0.00800766 -0.0209116 0.00452471 -0.0166791 -0.00243592 -0.0226178 -0.0222867 -0.0224413 -0.007736 -0.0208348 -0.0135295 -0.0232748 -0.0122278 -0.0230721 -0.0204558 -0.00685416 -0.0206594 -0.0232102 -0.00911894 -0.0246892 -0.0246235 -0.0222075 -0.0232905 -0.0144676 -0.0248245 -0.0248262 -0.0248194
internal_weight=0 734.256 2064.98 703.858 144.628 30.3974 14.2726 26.9877 714.802 34.2401 680.562 377.658 369.418 289.291 235.35 559.23 466.331 1350.18 1077.34 1066.42 727.949 23.7581 704.191 227.527 476.663 338.472 208.201 50.133 302.904 268.648 45.8188 222.829 38.9039 183.926 117.64 272.839 92.8991 66.79 49.1059 158.068 20.6257 15.7668 130.271 20.8302 21.3039 104.04 78.2979 56.6335 97.0146 37.9396 154.236 53.9402 104.803 80.1276 30.5631 25.4679 34.2555 33.5191 49.5645 135.786 40.6866 43.8773 95.0991 83.8406 53.1373 118.603 87.9115 32.8682 69.6323 47.7637 30.1773 30.1933 13.7 18.4499 26.1091 25.7423 17.6842 21.1667 21.6644 13.0889 21.4859 20.2691 11.1662 5.29767 12.925 9.31978 16.4225 8.24168 362.291 243.942 8.30315 12.3865 8.05248 118.349 90.1805 28.1687
internal_count=11057 6454 4603 6360 928 94 63 132 2454 58 2396 1325 1292 1005 845 5432 4893 2149 1695 1676 1106 50 1056 390 666 570 256 90 1071 859 140 719 112 607 796 454 539 350 240 166 115 87 314 80 52 827 556 353 681 121 326 160 249 287 95 65 212 112 192 279 99 245 180 166 436 128 103 277 77 53 156 81 89 47 189 271 110 129 203 83 151 159 119 53 76 94 177 53 4066 2734 69 57 50 1332 1015 317
cat_boundaries=0 1 2 3 4 5 6 7 8 9 10 11 12 13 14 15 16 17 18 19 20 21 22 23
cat_threshold=1 2 1 1 2 2 2 1 1 1 1 1 1 1 2 2 1 1 2 1 1 1 1
is_linear=0
shrinkage=0.05


Tree=43
num_leaves=96
num_cat=25
split_feature=2 3 2 2 2 3 2 1 3 2 2 2 3 3 2 2 2 0 2 3 2 3 3 2 2 2 2 2 0 0 2 2 3 3 2 2 1 2 0 3 1 2 2 3 2 0 2 1 2 3 2 1 3 2 1 2 1 2 0 1 2 2 2 3 1 2 2 2 3 0 3 2 3 2 2 0 2 1 1 2 3 3 3 2 1 2 0 1 2 3 2 3 1 0 0
split_gain=121.678 11.2874 7.48579 7.43741 7.35153 4.3353 8.30175 3.29232 2.26207 5.9781 1.96338 4.36129 1.96333 1.68763 1.67733 1.61018 2.78782 1.13843 1.95365 2.13729 4.03158 6.70285 12.0951 1.80361 6.75748 1.32453 1.20287 3.82753 0.989693 1.04116 4.84209 1.24091 3.80354 2.04604 0.903597 0.696934 0.685242 0.840621 1.02242 0.546125 0.660051 0.531065 0.444261 0.356461 0.310296 0.30983 0.282389 0.409571 0.274731 0.261638 0.250339 0.208981 0.133393 0.132541 0.107514 0.115562 0.106773 0.106579 0.073961 0.0680249 0.0567597 0.0992919 0.0779854 0.0773571 0.0529828 0.0449903 0.0449382 0.0352993 0.0326039 0.031606 0.0296593 0.0289084 0.0262639 0.0212872 0.015732 0.0121253 0.0100784 0.00961657 0.00832916 0.00729513 0.00628966 0.00576256 0.00379577 0.00320626 0.00231741 0.00196254 0.00132064 0.0018076 0.00128831 0.000962837 0.000787739 0.000673416 4.04557e-07 6.39177e-07 2.63462e-07
threshold=13.500000000000002 5.5000000000000009 4.5000000000000009 78.500000000000014 5.5000000000000009 33.500000000000007 1.0000000180025095e-35 0 17.500000000000004 26.500000000000004 31.500000000000004 32.500000000000007 3.5000000000000004 1.0000000180025095e-35 1.0000000180025095e-35 67.500000000000014 64.500000000000014 1 79.500000000000014 1.0000000180025095e-35 93.500000000000014 10.500000000000002 5.5000000000000009 119.50000000000001 123.50000000000001 156.50000000000003 205.50000000000003 194.50000000000003 2 3 22.500000000000004 16.500000000000004 1.0000000180025095e-35 2.5000000000000004 6.5000000000000009 248.50000000000003 4 1.0000000180025095e-35 5 1.0000000180025095e-35 6 609.50000000000011 88.500000000000014 1.0000000180025095e-35 50.500000000000007 7 2.5000000000000004 8 8.5000000000000018 1.5000000000000002 96.500000000000014 9 11.500000000000002 150.50000000000003 10 39.500000000000007 11 19.500000000000004 12 13 238.50000000000003 154.50000000000003 117.50000000000001 3.5000000000000004 14 500.00000000000006 289.50000000000006 12.500000000000002 3.5000000000000004 15 17.500000000000004 83.500000000000014 1.5000000000000002 1.5000000000000002 2.5000000000000004 16 25.500000000000004 17 18 16.500000000000004 1.5000000000000002 1.0000000180025095e-35 1.5000000000000002 3.5000000000000004 19 1.5000000000000002 20 21 29.500000000000004 2.5000000000000004 1.5000000000000002 1.0000000180025095e-35 22 23 24
decision_type=2 2 2 2 2 2 2 1 2 2 2 2 2 2 2 2 2 9 2 2 2 2 2 2 2 2 2 2 9 9 2 2 2 2 2 2 1 2 9 2 1 2 2 2 2 9 2 1 2 2 2 1 2 2 1 2 1 2 9 1 2 2 2 2 1 2 2 2 2 9 2 2 2 2 2 9 2 1 1 2 2 2 2 2 1 2 9 1 2 2 2 2 1 9 9
left_child=1 2 13 8 7 6 -3 43 10 -10 28 -12 15 14 86 16 -13 18 -5 25 21 22 -21 52 -25 42 27 -27 57 31 -31 32 -30 -33 39 50 37 38 49 40 -6 -28 56 -4 -11 46 47 -16 59 -15 71 -17 -22 -44 58 -56 -20 79 -14 69 61 62 -52 -63 67 66 -37 -50 -68 -36 -70 -19 -61 80 85 90 77 -59 -48 91 -38 -66 -40 -77 -76 -47 87 -1 -78 -82 -39 -2 93 -88 -94
right_child=3 5 4 17 34 -7 -8 -9 9 44 11 12 54 36 45 51 -18 35 19 20 23 -23 -24 24 -26 26 41 -29 29 30 -32 33 -34 -35 48 65 73 75 82 -41 -42 -43 53 -45 -46 74 78 -49 64 -51 60 -53 -54 -55 55 -57 -58 76 -60 72 -62 63 -64 -65 81 -67 68 -69 70 -71 -72 -73 -74 -75 84 83 88 -79 -80 -81 89 -83 -84 -85 -86 -87 92 -89 -90 -91 -92 -93 94 -95 -96
leaf_value=-0.024497520716777636 -0.013797568628630517 0.061754401074748978 0.019587204631859818 0.02962004975027361 -0.018095423695959428 -0.0062165888002706417 -0.014866167139466414 -0.018254942016071484 0.040337652049578225 -0.0082990838488299634 0.038870399557902162 0.0045572965507732367 -0.001477513336878319 -0.0014657120906683184 -0.017008576755182882 -0.0056408710371811189 0.02156186723107863 -0.004288215749889958 -0.0075323492189144671 0.016474052709004549 0.00064963884819627202 -0.0075882874602692836 0.080149396569136472 0.037567938595716832 0.0091142491862768373 0.0062625821256841342 0.0045819086112864746 0.037210862848232572 -0.0071898554585733358 0.044765155906708244 -0.016812381504843533 -0.0011348370488070234 0.017280968198553903 -0.015005034449584091 -0.02159305482946931 0.0097895078699688498 -0.023925719144519374 -0.023805335428502959 -0.023848382135858551 -0.019797170932459019 0.0054658451888603011 0.012996559233390185 0.00342210279611795 0.034095254742456442 0.0037835909144528796 -0.02355965823616463 -0.021685332021363787 -0.0079307564507016242 -0.016146512019535431 -0.009794071976912613 0.0051384500169602849 0.00071037406286011506 0.0054178875315834644 -0.0030377642673934599 -0.0080377969549438929 -0.00026850980508981632 -0.0010299986208476496 -0.0062922200173371502 -0.0064783645071055723 -0.014995630111194553 0.00029564878116801582 0.0036467647215113076 0.0015886148465782497 0.0073833685878205157 -0.012731411171955604 0.0098078754753783502 0.0054220784642424772 -0.011942443234140988 0.0088616944660890873 -0.017330357224415543 0.0063657422596391155 -0.00050308890481446571 -0.019693415664289352 -0.019460200042630216 -0.020982392399704463 -0.021403644135850441 -0.0068321289728899698 -0.0093978951919929041 -0.019700672752806118 -0.011874722009018568 -0.022624528163141963 -0.010980345064999494 -0.021966992221625906 -0.018877948330192594 -0.019024703986596777 -0.022383025375382518 -0.024827418140873244 -0.024775488637537577 -0.005603471412740038 -0.02152577891044094 -0.022958946968488228 -0.014725285794047175 -0.024816764927697962 -0.024812502760492919 -0.024829264532805036
leaf_weight=134.55457596480846 3.4961545616388303 8.9053553938865679 15.532508850097658 11.265793979167936 3.9751424640417099 16.023042768239975 5.8625444024801245 6.0453870147466686 13.507575035095213 10.528179958462717 8.5897945016622526 209.70881299674511 9.058558464050293 18.757865816354752 37.176794990897179 32.024199962615967 27.2331882417202 7.9406800270080593 13.465255856513977 25.605158686637878 55.250016361474991 12.397679179906843 10.522452324628828 21.630947351455688 590.36013236641884 37.253307372331619 137.28960961103439 13.65145283937454 32.898903086781502 6.226358160376547 6.5518431067466736 160.21618095040321 30.694631665945053 31.878581747412682 24.25438004732132 18.465610027313232 12.870759539306169 4.2221706658601761 6.1717606857418996 4.7632294446229926 11.784787885844709 21.71660041809082 96.462670207023621 5.8203307688236228 10.728190556168554 10.761948153376585 11.225502915680408 18.662749126553535 26.193997085094452 18.964089527726173 24.430707335472107 21.747166901826859 19.968674302101135 8.6526715159416181 5.9445748925209072 24.562973633408546 11.886473685503006 3.4701860100030899 40.225891277194023 9.0383319556713086 10.091737926006315 24.685959011316299 42.190091222524643 31.558417826890945 12.491831481456758 31.005199313163757 21.991227686405182 6.1689854115247718 26.620511829853058 5.2984561324119595 21.527190446853638 13.829533755779265 4.4350961148738852 4.5336635634303084 7.2170254066586477 3.0568674355745324 4.9163397848606092 8.8477841615676898 9.992234855890274 4.9761710464954376 4.6035993546247465 7.5309244096279135 4.7398107200860977 2.133540466427803 1.9121917635202406 5.2837805002927771 80.078656911849976 103.4539942741394 3.76926289498806 3.5171965211629868 7.8791750371456146 4.4406685084104538 22.278604596853256 7.8905373215675345 5.1995296776294735
leaf_count=1542 25 31 58 19 34 31 32 52 6 25 33 795 37 71 216 99 50 20 35 59 139 23 18 31 785 70 153 20 118 22 20 530 61 108 107 26 82 20 69 28 53 13 234 22 27 120 111 137 227 50 65 61 51 15 21 74 30 21 155 73 12 45 89 58 101 25 24 50 30 49 23 37 16 38 75 32 29 59 92 33 39 58 50 21 19 57 924 1192 20 30 37 25 257 91 60
internal_value=0 -0.0178247 -0.0191456 0.00601107 -0.00897393 0.0117951 0.0313377 0.0143194 0.00188653 0.0143275 0.00125188 0.00364879 0.00283221 -0.0218102 -0.0230542 0.00473906 0.00651174 0.00818052 0.00890668 0.00868983 0.0102055 0.0241341 0.03502 0.00922193 0.01012 0.00541376 0.00787274 0.0145622 -0.0017531 -0.000736375 0.0131921 -0.00143246 0.00462145 -0.00343663 -0.0144787 0.00530227 -0.0156115 -0.0129184 -0.00955175 -0.00496106 -0.000477036 0.00573116 0.00145747 0.0235418 -0.0022009 -0.0174137 -0.0158404 -0.0139746 -0.0165259 -0.00565266 0.0030865 -0.00307219 0.00191549 0.00289035 -0.00411518 -0.0017824 -0.00448364 -0.00980096 -0.0055592 -0.0194864 0.00390032 0.0041964 0.00289039 0.00574335 -0.0140944 0.00816858 0.00759495 -0.0153451 0.00701718 -0.0208288 0.00774574 -0.00188371 -0.016542 -0.0225672 -0.0222294 -0.0223871 -0.00760327 -0.00852297 -0.0207507 -0.0133756 -0.0232382 -0.0120728 -0.0230311 -0.0203654 -0.0205723 -0.0231722 -0.0246857 -0.0246183 -0.00629893 -0.0221486 -0.0232543 -0.0143166 -0.0248244 -0.0248261 -0.0248191
internal_weight=0 721.263 690.472 2077.96 143.333 30.7909 14.7679 27.3982 716.242 34.7639 681.478 379.095 370.505 547.139 455.688 290.713 236.942 1361.72 1087.38 1076.11 735.735 48.5253 36.1276 687.21 611.991 340.378 209.911 50.9048 302.383 268.466 12.7782 255.688 63.5935 192.095 115.935 274.337 91.4505 65.9253 48.6335 20.5232 15.7599 159.006 130.467 21.3528 21.2564 102.232 77.0573 55.8395 95.412 37.722 154.727 53.7714 75.2187 105.115 79.792 30.5075 25.3517 33.9166 49.2844 43.0263 132.957 122.865 66.6208 56.2444 52.3857 119.61 88.6045 32.363 70.1389 29.5528 48.1477 21.7702 13.4734 25.5252 25.1749 17.2918 21.0036 12.318 21.2177 12.913 20.9916 20.0228 10.9116 5.19041 9.12922 16.0457 353.456 238.009 8.6856 8.1208 12.1013 7.93682 115.447 87.9692 27.4781
internal_count=11057 6454 6360 4603 928 94 63 132 2454 58 2396 1325 1292 5432 4893 1005 845 2149 1695 1676 1106 100 77 1006 816 570 256 90 1071 859 42 817 179 638 796 454 539 350 240 115 87 166 314 80 52 827 556 353 681 121 326 160 190 249 287 95 65 212 192 245 269 257 154 103 436 128 103 277 77 156 53 57 89 189 271 110 129 80 203 83 151 159 119 53 94 177 4066 2734 49 69 57 50 1332 1015 317
cat_boundaries=0 1 2 3 4 5 6 7 8 9 10 11 12 13 14 15 16 17 18 19 20 21 22 23 24 25
cat_threshold=1 2 1 2 1 2 2 2 1 1 1 1 1 1 1 2 2 2 1 1 2 1 1 1 1
is_linear=0
shrinkage=0.05


Tree=44
num_leaves=98
num_cat=23
split_feature=2 3 2 2 2 3 2 1 0 0 2 3 3 2 2 2 2 3 3 3 2 3 3 0 2 3 2 3 3 2 2 2 2 2 1 2 0 2 2 3 1 2 2 3 3 0 2 1 2 3 2 2 2 2 1 1 1 2 2 1 2 3 2 2 2 3 0 3 3 2 3 1 2 2 2 2 2 0 2 2 1 3 3 3 3 2 1 2 0 1 3 2 3 2 1 0 0
split_gain=117.142 11.004 7.48593 7.05411 6.95896 3.96376 7.29356 3.07041 2.19766 3.50863 6.1702 4.49083 1.70585 1.70349 1.24711 4.74612 2.28083 6.55782 3.77348 1.97068 1.80341 1.75939 1.89278 1.0573 1.77022 1.98192 3.69101 16.9013 2.43083 3.4568 2.43393 1.26227 1.81606 0.890988 0.686143 0.836492 1.01073 0.651689 0.538784 0.5328 0.636196 0.420151 0.417951 0.401075 0.313127 0.311623 0.282624 0.405136 0.274838 0.253117 0.237042 0.179297 0.169641 0.118686 0.116324 0.102891 0.0685136 0.0639448 0.23224 0.0525468 0.0483367 0.0497122 0.0416838 0.0416844 0.0350763 0.0325978 0.0319258 0.0303732 0.0275518 0.02651 0.0263039 0.0224348 0.0216218 0.0197204 0.019349 0.0159907 0.012697 0.0123251 0.0107338 0.0203649 0.00843361 0.00641447 0.0056822 0.00398108 0.0038693 0.00324418 0.00234281 0.00200109 0.00135334 0.00185193 0.000978988 0.000803942 0.000668765 0.00057875 4.14656e-07 6.55199e-07 2.70049e-07
threshold=13.500000000000002 5.5000000000000009 4.5000000000000009 5.5000000000000009 78.500000000000014 33.500000000000007 1.0000000180025095e-35 0 1 2 43.500000000000007 1.0000000180025095e-35 1.0000000180025095e-35 1.0000000180025095e-35 31.500000000000004 32.500000000000007 20.500000000000004 6.5000000000000009 1.5000000000000002 3.5000000000000004 67.500000000000014 2.5000000000000004 1.0000000180025095e-35 3 79.500000000000014 1.0000000180025095e-35 85.500000000000014 8.5000000000000018 5.5000000000000009 152.50000000000003 252.50000000000003 204.50000000000003 225.50000000000003 6.5000000000000009 4 1.0000000180025095e-35 5 248.50000000000003 88.500000000000014 1.0000000180025095e-35 6 649.50000000000011 48.500000000000007 31.500000000000004 1.0000000180025095e-35 7 2.5000000000000004 8 8.5000000000000018 1.5000000000000002 94.500000000000014 20.500000000000004 52.500000000000007 25.500000000000004 9 10 11 126.50000000000001 119.50000000000001 12 232.50000000000003 12.500000000000002 500.00000000000006 289.50000000000006 12.500000000000002 3.5000000000000004 13 3.5000000000000004 17.500000000000004 110.50000000000001 1.5000000000000002 14 1.5000000000000002 60.500000000000007 83.500000000000014 2.5000000000000004 16.500000000000004 15 42.500000000000007 28.500000000000004 16 1.5000000000000002 1.0000000180025095e-35 1.5000000000000002 1.5000000000000002 2.5000000000000004 17 1.5000000000000002 18 19 2.5000000000000004 1.5000000000000002 1.0000000180025095e-35 18.500000000000004 20 21 22
decision_type=2 2 2 2 2 2 2 1 9 9 2 2 2 2 2 2 2 2 2 2 2 2 2 9 2 2 2 2 2 2 2 2 2 2 1 2 9 2 2 2 1 2 2 2 2 9 2 1 2 2 2 2 2 2 1 1 1 2 2 1 2 2 2 2 2 2 9 2 2 2 2 1 2 2 2 2 2 9 2 2 1 2 2 2 2 2 1 2 9 1 2 2 2 2 1 9 9
left_child=1 2 12 7 8 6 -3 44 42 14 11 -11 13 88 16 -16 17 18 -10 20 -17 22 -18 24 -6 31 27 -27 29 -28 -30 38 -33 39 35 36 49 50 55 40 -5 -34 51 -21 -4 46 47 -15 56 -14 74 76 -12 -23 -40 -26 66 58 69 64 61 -59 63 -39 -50 78 -35 -65 -69 -52 -58 73 81 -44 -25 87 92 91 79 -53 -48 -36 -61 -75 -38 -79 -77 -47 89 -1 -83 -37 -2 -78 95 -90 -96
right_child=4 5 3 33 23 -7 -8 -9 9 10 52 -13 34 45 15 19 21 -19 -20 43 -22 53 -24 37 25 26 28 -29 30 -31 -32 32 41 48 72 77 84 62 54 -41 -42 -43 71 -45 -46 75 80 -49 59 -51 57 65 -54 -55 -56 -57 70 60 -60 82 -62 -63 -64 67 -66 -67 -68 68 -70 -71 -72 -73 -74 83 -76 86 93 85 -80 -81 -82 90 -84 -85 -86 -87 -88 -89 94 -91 -92 -93 -94 -95 96 -97 -98
leaf_value=-0.024489294257097723 -0.013644302851798929 0.05656923007388346 0.018725674346441196 -0.017972463480267226 0.028030908311977212 -0.0061005208264231642 -0.014716947774788837 -0.018133826703997442 0.004851488950011665 0.055943243720750518 -0.011886352469007355 0.013455029051994045 -0.0014314427424350947 -0.016874420602603794 0.042464435255335185 0.0074508955382653758 -0.0063884421324900843 0.035421646867764327 -0.018444367801497538 -0.004818026531942265 -0.0040242762647801867 -0.018679500325238053 0.0074341788747917291 -0.0041999422550258484 -0.007401570965839788 -0.0057082798585217408 0.021047337519471351 0.077606457595912878 0.0034432166806837648 0.0085456856364203009 0.010535561752865699 0.021027938549383587 0.0051090424783686297 -0.021522415339748985 -0.023903840114404162 -0.023780668849899572 -0.023824708677421712 0.0094522604183885778 0.0021678609143037041 -0.019696557450784104 0.0053007071724301812 0.013106682807959022 -0.0036499325386484386 0.0082831895297791162 0.032120073174714298 -0.023529392811280941 -0.021616410578528412 -0.0077962047215868139 -0.016005177889061913 -0.0096460938202220358 0.0032418718409023338 -0.0081917134724979728 -0.0018677021695177585 -0.012139566679443166 0.0049019945887878178 -0.0010054727848437959 -0.014847057730413813 0.0041383911177229277 -0.0043650194001627748 -0.012576403714448287 0.0013481590393082396 0.0069490637492777511 0.0094698191226238217 0.0052584971879891451 -0.011787620975196922 -0.003524671457285725 -0.017199265234305688 0.0085644544816960537 0.0061677936109987086 0.0063872690817946874 -0.019591270809543385 0.00086346485954018565 -0.019354693772922812 -0.0015312319433829595 -0.00092231958547163016 -0.020900823774057144 -0.010689919632259258 -0.021603383356028103 -0.0090054646868938746 -0.0055001353973020452 -0.019598634001076535 -0.022574079533684593 -0.010827441273064935 0.0001612685707506837 -0.021903421022881588 -0.01907435980920336 -0.01891321625558769 -0.022327654976024507 -0.024827371719582839 -0.024774140138602366 -0.021453897937300962 -0.02291550954719954 -0.014575400782149315 -0.011618841706030308 -0.024816451562054882 -0.024812082034509936 -0.024829264526418923
leaf_weight=131.29836416244507 3.4482474625110608 9.4726359993219393 15.839746147394182 3.9038573801517487 11.604478895664213 15.923743039369581 5.7760354727506629 5.9360299631953266 84.555983394384384 11.306618466973307 7.6963181793689754 13.821629986166952 18.730392128229141 36.549817427992821 7.8228625506162635 188.71909177303314 80.573858126997948 14.955102622509001 21.881355926394463 72.945905283093452 41.827135652303696 16.798406183719639 35.756751865148544 7.906701564788821 13.364212065935135 14.743220657110216 90.230083227157593 10.367872744798659 230.02260360121727 142.80964803695679 255.1490723490715 24.420575797557831 117.6546483039856 23.736267782747746 12.566472172737127 4.1228472590446472 6.0263153538107854 18.64726722240448 80.906323373317719 4.6698582470417014 11.849378801882269 19.085745215415955 9.5175424069166201 6.3502948284149161 6.0221982449293128 10.511363223195078 10.984694503247738 18.51532518863678 25.774451576173309 18.77926005423069 20.510582536458973 12.273320734500887 9.3685206621885282 11.817831069231032 74.929605215787888 11.874236822128296 8.903807304799555 63.74829426407814 10.463671296834944 12.333800986409189 11.283663034439085 20.886315047740936 31.31079089641571 22.110789656639099 6.0957505702972403 8.1092498451471311 5.207423277199271 26.857462704181671 21.664663970470428 9.9478284716606122 4.3486083447933188 10.740422159433363 4.4462904557585707 7.0389405786991102 10.459115236997603 7.0671724155545217 2.9774254411458969 2.4116482362151155 5.8194106817245475 16.442392200231552 9.7973076701164246 4.5006142482161513 7.4486845433711997 6.8610548973083496 4.6368266046047211 2.6741276979446411 1.876156762242317 5.1668270230293265 78.114989429712296 100.92235904932022 3.4422951862215996 7.7003383636474609 4.3757574707269669 3.838397204875946 21.732524923980236 7.6971620991826049 5.0720188021659878
leaf_count=1542 25 31 58 34 19 31 32 52 296 37 17 30 71 216 28 662 245 22 75 243 123 37 105 20 35 36 197 14 429 193 237 32 124 107 82 20 69 26 196 28 53 11 38 19 22 120 111 137 227 50 57 78 28 45 142 30 73 127 18 101 14 39 25 24 50 42 49 30 23 24 16 36 38 26 27 75 22 26 20 84 92 39 58 22 50 27 19 57 924 1192 30 37 25 24 257 91 60
internal_value=0 -0.0176994 -0.019036 -0.00883292 0.00582459 0.0113469 0.0295668 0.0137564 0.0018345 0.00289184 0.016816 0.0325729 -0.0217437 -0.0230128 0.00188584 0.00400151 -0.000637531 0.00441847 6.23338e-05 0.0030304 0.005369 -0.00487191 -0.00213976 0.00791019 0.00860585 0.0083982 0.00984784 0.0286907 0.00918903 0.0133862 0.00717304 0.00524963 0.00846835 -0.014328 -0.0154668 -0.012764 -0.00940563 0.00514273 0.00238489 -0.00486371 -0.000466688 0.00622533 -0.00540619 -0.00376884 0.0224154 -0.0172835 -0.015697 -0.0138219 -0.0163876 -0.00554412 0.00300034 -0.00801648 -0.00638616 -0.0159787 0.0034825 -0.00439232 -0.0193813 0.0037162 0.00206143 -0.013942 0.00442218 0.00483202 0.00790008 0.00734957 -0.0151985 -0.00637748 -0.0207446 0.00679446 0.00749437 0.00426917 -0.0164038 -0.00102864 -0.0225156 -0.00189645 -0.00233337 -0.022171 -0.0127907 -0.0223318 -0.00704736 -0.00665054 -0.0206652 -0.0232008 -0.0119179 -0.000695812 -0.0229892 -0.0202736 -0.0204839 -0.0231334 -0.0246821 -0.0246131 -0.0220886 -0.0232172 -0.014165 -0.0112131 -0.0248243 -0.024826 -0.0248189
internal_weight=0 708.586 677.413 142.07 2090.6 31.1724 15.2487 27.798 717.64 626.198 42.1931 25.1282 535.344 445.306 584.005 317.665 266.339 121.392 106.437 309.842 230.546 144.947 116.331 1372.96 1097.16 1085.56 743.323 25.1111 718.211 233.04 485.172 342.235 161.161 114.272 90.0374 65.0818 48.1728 275.797 181.074 20.4231 15.7532 136.74 91.4422 79.2962 21.8619 100.469 75.8471 55.0651 93.8488 37.5097 155.206 57.2842 17.0648 28.6162 155.836 25.2384 42.1961 136.84 40.9221 51.6527 95.9183 84.6346 120.591 89.2802 31.8702 42.6444 28.9437 70.6329 48.5221 30.4584 13.2524 34.158 24.9557 23.4175 18.3658 24.6215 14.6398 16.909 34.5351 28.7157 20.782 20.5094 19.7825 13.9 10.6631 5.08578 8.94333 15.6782 344.837 232.221 7.94291 11.8232 7.824 6.81582 112.617 85.8122 26.8045
internal_count=11057 6454 6360 928 4603 94 63 132 2454 2012 112 67 5432 4893 1900 1075 825 393 371 1047 785 432 350 2149 1695 1676 1106 50 1056 390 666 570 167 796 539 350 240 454 403 115 87 135 442 262 80 827 556 353 681 121 326 320 45 82 338 65 245 279 99 436 180 166 128 103 277 224 156 77 53 81 89 122 189 86 47 271 96 110 182 162 203 151 159 48 119 53 94 177 4066 2734 69 57 50 46 1332 1015 317
cat_boundaries=0 1 2 3 4 5 6 7 8 9 10 11 12 13 14 15 16 17 18 19 20 21 22 23
cat_threshold=1 1 2 2 1 2 2 2 1 1 1 1 1 2 1 2 1 1 2 1 1 1 1
is_linear=0
shrinkage=0.05


Tree=45
num_leaves=98
num_cat=23
split_feature=2 3 2 2 2 3 2 1 0 0 2 3 3 2 2 2 2 3 3 3 3 3 2 0 2 3 2 3 3 2 2 2 2 2 1 2 0 2 3 1 2 2 2 3 0 2 1 3 2 3 2 2 2 3 2 1 1 1 1 2 2 2 3 2 2 2 0 3 2 2 3 2 2 1 2 2 2 0 2 2 1 3 3 3 2 2 1 2 0 1 3 2 3 2 1 0 0
split_gain=112.782 10.7309 7.48374 6.77074 6.51603 3.63267 6.45252 2.868 2.09043 3.25924 5.61386 3.84573 1.72383 1.72975 1.18016 4.28982 2.17037 5.9868 3.63873 1.86527 1.71262 1.80192 1.69984 0.982811 1.60761 1.83917 3.36693 6.29228 10.6687 1.70374 5.92636 1.18068 1.66501 0.878215 0.686804 0.832087 0.998874 0.609708 0.519694 0.613222 0.511636 0.403334 0.389689 0.381501 0.313322 0.28275 0.400579 0.276194 0.274835 0.244801 0.225005 0.175272 0.164655 0.142045 0.118337 0.109437 0.0991251 0.0689831 0.0520905 0.0513739 0.0895681 0.0712555 0.070321 0.038654 0.038698 0.0348391 0.0322396 0.031537 0.0293944 0.0607697 0.0263336 0.026295 0.0219574 0.0213796 0.0188726 0.0162505 0.0125501 0.0125258 0.0104451 0.0197701 0.00853715 0.006541 0.00560035 0.00394374 0.00383983 0.00328291 0.00236781 0.00204014 0.00138687 0.00189734 0.000995225 0.00082039 0.000663841 0.000569379 4.25457e-07 6.71818e-07 2.76895e-07
threshold=13.500000000000002 5.5000000000000009 4.5000000000000009 5.5000000000000009 78.500000000000014 33.500000000000007 1.0000000180025095e-35 0 1 2 43.500000000000007 1.0000000180025095e-35 1.0000000180025095e-35 1.0000000180025095e-35 31.500000000000004 32.500000000000007 20.500000000000004 6.5000000000000009 1.5000000000000002 3.5000000000000004 2.5000000000000004 1.0000000180025095e-35 67.500000000000014 3 79.500000000000014 1.0000000180025095e-35 93.500000000000014 10.500000000000002 2.5000000000000004 119.50000000000001 123.50000000000001 204.50000000000003 225.50000000000003 6.5000000000000009 4 1.0000000180025095e-35 5 248.50000000000003 1.0000000180025095e-35 6 88.500000000000014 48.500000000000007 649.50000000000011 31.500000000000004 7 2.5000000000000004 8 1.0000000180025095e-35 8.5000000000000018 1.5000000000000002 96.500000000000014 20.500000000000004 52.500000000000007 11.500000000000002 25.500000000000004 9 10 11 12 238.50000000000003 154.50000000000003 117.50000000000001 3.5000000000000004 500.00000000000006 289.50000000000006 12.500000000000002 13 3.5000000000000004 318.50000000000006 381.50000000000006 1.5000000000000002 83.500000000000014 1.5000000000000002 14 60.500000000000007 2.5000000000000004 16.500000000000004 15 42.500000000000007 28.500000000000004 16 1.5000000000000002 1.0000000180025095e-35 1.5000000000000002 70.500000000000014 3.5000000000000004 17 1.5000000000000002 18 19 2.5000000000000004 1.5000000000000002 1.0000000180025095e-35 18.500000000000004 20 21 22
decision_type=2 2 2 2 2 2 2 1 9 9 2 2 2 2 2 2 2 2 2 2 2 2 2 9 2 2 2 2 2 2 2 2 2 2 1 2 9 2 2 1 2 2 2 2 9 2 1 2 2 2 2 2 2 2 2 1 1 1 1 2 2 2 2 2 2 2 9 2 2 2 2 2 2 1 2 2 2 9 2 2 1 2 2 2 2 2 1 2 9 1 2 2 2 2 1 9 9
left_child=1 2 12 7 8 6 -3 47 41 14 11 -11 13 88 16 -16 17 18 -10 22 21 -18 -17 24 -6 31 27 28 -27 53 -31 40 -33 38 35 36 49 50 39 -5 56 51 -34 -21 45 46 -15 -4 57 -14 71 76 -12 -28 -22 -42 -26 66 65 60 61 -52 -62 64 -39 -50 -35 78 -66 -70 -59 -25 81 74 -43 87 92 91 79 -53 -47 -36 -60 -38 -76 -79 -77 -46 89 -1 -83 -37 -2 -78 95 -90 -96
right_child=4 5 3 33 23 -7 -8 -9 9 10 52 -13 34 44 15 19 20 -19 -20 43 54 -23 -24 37 25 26 29 -29 -30 30 -32 32 42 48 72 77 83 63 -40 -41 55 73 -44 -45 75 80 -48 -49 58 -51 59 67 -54 -55 -56 -57 -58 70 82 -61 62 -63 -64 -65 68 -67 -68 -69 69 -71 -72 -73 -74 -75 84 86 93 85 -80 -81 -82 90 -84 -85 -86 -87 -88 -89 94 -91 -92 -93 -94 -95 96 -97 -98
leaf_value=-0.024480865480924593 -0.013490645956768861 0.052092398899724834 0.017917670456763346 -0.017848116261855545 0.026569764328291157 -0.005985916620973422 -0.014567024808087787 -0.018011304968189635 0.0047078421616916994 0.051548642076733736 -0.011731590198509861 0.012943362229421121 -0.0013979259563334338 -0.016739048002591395 0.03966667300676921 0.0072112731422942153 -0.0062702562955089212 0.033324816427896288 -0.018325509543158876 -0.0047213792215849539 -0.018563546062701899 0.0071952159215353034 -0.0039403825025040463 -0.0041131180502096609 -0.0072721000272544653 0.00013859873425133655 0.00025667697325937333 -0.0082457620205676554 0.054136926106139432 0.034521609624111778 0.0085186000913368854 0.020073724155958081 0.0049564764595358343 -0.021450472513303117 -0.023881453346793872 -0.023755433944512582 -0.023800488774480408 0.009129749190024768 -0.019594458350256538 0.0051414210402270311 0.0021093983227040494 -0.0035724881854754878 0.012612712870186036 0.0080100453662810302 -0.0234984437120224 -0.021546202795638177 -0.0076628926167596955 0.030319918947315984 -0.015862810753688918 -0.0094989264380508295 0.0048601389270894893 -0.0080548637477641412 -0.0018247765991058849 0.0051510482362472389 -0.011984580396064919 0.0047566087373556061 -0.00098150664306838721 -0.014697745304399632 -0.012421333553745043 0.00025438213411254544 0.0034279728815728183 0.0014794998140848438 0.0069729074857852102 0.0091465461115287951 0.0047928408119108142 -0.011632981204326506 -0.017066900118743199 -0.0034494472386757558 0.0094756906020739551 0.0059383177947372537 -0.019487640118420031 -0.00049310004959198352 -0.019247702622392161 0.00084128967138022133 1.1892058758703719e-05 -0.020817851497797409 -0.010537960102657404 -0.021254860296435391 -0.0088623202426672317 -0.0053935295950519602 -0.019495109857221578 -0.022522591153462789 -0.010675013671166994 -0.021838627601807801 -0.0016792875925357193 -0.018647741271294083 -0.018800259913920855 -0.022271171418367503 -0.024827325858866031 -0.024772757325522518 -0.021380700144469866 -0.022871148942414668 -0.014424851829054603 -0.011464456641258503 -0.024816127572487575 -0.024811650191677029 -0.02482926400420972
leaf_weight=128.12201097607613 3.4015180170536023 10.023942217230799 16.139149993658069 3.8343221098184586 11.934364557266234 15.826895713806151 5.6916522830724707 5.8293570876121548 84.967201933264732 11.957174807786943 7.6053788065910366 14.008857503533362 18.703599780797958 35.93823504447937 8.1622101515531522 190.13047052919865 80.060757786035538 15.494331032037733 21.481467396020889 72.595295429229736 16.487532943487171 36.023564279079437 41.659150004386902 7.8735635280609158 13.265661001205444 15.409262031316755 56.115487605333328 12.889201313257216 22.509312003850937 22.741208910942078 600.90496096014977 24.939526915550232 118.25728976726532 23.230864115059376 12.269646577537065 4.0259597301483154 5.8844367787241918 18.824361681938171 4.5787780359387389 11.912354983389379 81.081907123327255 9.4828673750162142 19.337542057037354 6.4031140506267539 10.266924798488619 10.749793455004692 18.371537148952484 6.2187720835208884 25.365210421383384 18.598983630537987 24.65972313284874 12.173191741108896 9.351039454340933 20.146405339241028 11.675235182046888 75.297811686992645 11.862303853034973 8.7725886926054937 12.179657533764841 10.108340561389921 24.877099066972733 42.365073889493942 31.965732902288437 31.608706712722778 17.379536628723145 6.0243180468678466 5.1186251491308239 8.0807176530361158 18.533842921257019 35.201156437397003 4.2642426192760459 13.823857396841047 4.3610614016652098 10.749700069427488 8.2155796587467176 6.9209957346320135 2.9457666128873825 2.9296260699629793 5.7672394812107077 16.352205276489258 9.6071628928184509 4.4001553431153289 7.3684693500399581 4.5363685190677643 5.6747523844242087 2.0540849789977074 1.8410060778260229 5.0527422800660124 76.199470996856689 98.452811539173126 3.3692311942577362 7.5258875340223312 4.3124416470527649 3.794057622551918 21.199839271605015 7.5085295066237441 4.947634935379031
leaf_count=1542 25 31 58 34 19 31 32 52 296 37 17 30 71 216 28 662 245 22 75 243 37 105 123 20 35 37 139 23 40 31 785 32 124 107 82 20 69 26 28 53 196 38 11 19 120 111 137 22 227 50 65 78 28 51 45 142 30 73 101 12 45 89 58 25 22 50 49 42 21 34 16 37 38 36 30 75 22 32 20 84 92 39 58 50 18 21 19 57 924 1192 30 37 25 24 257 91 60
internal_value=0 -0.0175727 -0.018925 -0.00869286 0.0056449 0.0109225 0.0279506 0.0132235 0.00178358 0.00280952 0.0161084 0.0307208 -0.0216759 -0.0229706 0.00183399 0.00388536 -0.000623971 0.00428642 5.96845e-05 0.00294564 -0.0047751 -0.00209162 0.00520701 0.00765105 0.00831794 0.00811897 0.00950633 0.0219344 0.0321932 0.00860415 0.0094668 0.00509168 0.00818699 -0.0141768 -0.0153213 -0.0126095 -0.00926039 0.00498879 -0.0047678 -0.00045654 0.00231992 -0.00530109 0.00603248 -0.00368945 -0.0171521 -0.0155526 -0.0136688 0.0213673 -0.0162482 -0.00543707 0.00291682 -0.00788125 -0.00626823 0.00154964 -0.0158362 0.00338405 -0.00430246 -0.0192747 -0.0137892 0.0036818 0.00396149 0.0027233 0.00542148 0.00764249 0.00711389 -0.015051 -0.020659 -0.00625947 0.00658029 0.0071584 -0.0162645 -0.00180673 -0.0224629 -0.00100418 -0.00185295 -0.0221114 -0.0126357 -0.0222754 -0.00692162 -0.00652925 -0.0205782 -0.0231626 -0.0117631 -0.0229465 -0.000679022 -0.0201803 -0.0203939 -0.0230937 -0.0246784 -0.0246077 -0.0220274 -0.0231793 -0.0140129 -0.0110595 -0.0248242 -0.0248259 -0.0248186
internal_weight=0 696.217 664.674 140.837 2102.93 31.5425 15.7156 28.1873 719.013 628.063 42.9225 25.966 523.838 435.179 585.14 318.95 266.19 121.943 106.449 310.788 144.247 116.084 231.79 1383.91 1106.69 1094.76 750.716 50.8078 37.9186 699.908 623.646 344.042 162.534 112.649 88.659 64.2589 47.7234 277.221 20.3255 15.7467 181.508 90.95 137.595 78.9984 98.7484 74.6667 54.3098 22.3579 92.324 37.3026 155.673 56.8271 16.9564 76.2619 28.1628 156.38 25.128 41.3863 50.9377 133.976 123.868 67.0248 56.8428 121.548 89.9389 31.3895 28.3495 42.3734 71.1145 53.735 13.0368 21.6974 24.4001 34.1229 23.3732 24.0817 14.4538 16.5356 34.2926 28.5254 20.357 20.039 19.5481 10.4208 13.8903 4.98371 8.762 15.3197 336.43 226.575 7.76939 11.5518 7.71396 6.73982 109.855 83.708 26.1475
internal_count=11057 6454 6360 928 4603 94 63 132 2454 2012 112 67 5432 4893 1900 1075 825 393 371 1047 432 350 785 2149 1695 1676 1106 100 77 1006 816 570 167 796 539 350 240 454 115 87 403 442 135 262 827 556 353 80 681 121 326 320 45 190 82 338 65 245 436 269 257 154 103 128 103 277 156 224 77 55 89 57 189 122 86 271 96 110 182 162 203 151 159 119 48 53 94 177 4066 2734 69 57 50 46 1332 1015 317
cat_boundaries=0 1 2 3 4 5 6 7 8 9 10 11 12 13 14 15 16 17 18 19 20 21 22 23
cat_threshold=1 1 2 2 1 2 2 2 1 1 1 1 1 2 1 2 1 1 2 1 1 1 1
is_linear=0
shrinkage=0.05


Tree=46
num_leaves=87
num_cat=21
split_feature=2 3 2 2 2 3 2 1 3 3 3 2 2 2 3 2 2 0 2 3 2 3 3 2 2 2 3 3 3 2 2 1 2 0 2 3 1 2 2 2 2 0 2 1 2 2 3 3 2 2 1 2 1 0 2 2 1 1 2 3 2 2 2 0 3 3 2 3 2 2 2 0 1 3 3 3 2 1 2 0 1 3 2 1 0 0
split_gain=108.59 10.4672 7.47919 6.50048 6.10417 3.3364 5.74318 2.6829 2.00966 5.65148 1.74155 1.7561 1.73217 3.27211 1.68108 1.37338 4.74848 0.914229 1.463 1.70805 3.10857 14.5435 2.21619 3.07759 2.2755 1.11865 0.869075 5.57823 2.48358 1.21898 0.865291 0.687222 0.827409 0.986867 0.57071 0.506805 0.591092 0.475841 6.37873 0.452331 0.315788 0.314924 0.282768 0.395905 0.274723 0.266509 0.244542 0.236689 0.212997 0.12782 0.104713 0.11251 0.0694328 0.0693135 0.0594953 0.21645 0.0516146 0.0456038 0.0428715 0.0443833 0.0358749 0.0359545 0.0345881 0.032547 0.0282572 0.0263529 0.0247494 0.0247384 0.0222938 0.0176553 0.0165115 0.0127274 0.00863972 0.0066692 0.0055171 0.00401907 0.00332351 0.00239239 0.0020797 0.00142119 0.0019438 0.00101154 0.000837083 4.35812e-07 6.88661e-07 2.83819e-07
threshold=13.500000000000002 5.5000000000000009 4.5000000000000009 5.5000000000000009 78.500000000000014 33.500000000000007 1.0000000180025095e-35 0 17.500000000000004 23.500000000000004 1.0000000180025095e-35 1.0000000180025095e-35 31.500000000000004 32.500000000000007 3.5000000000000004 37.500000000000007 43.500000000000007 1 79.500000000000014 1.0000000180025095e-35 85.500000000000014 8.5000000000000018 5.5000000000000009 152.50000000000003 291.50000000000006 127.50000000000001 7.5000000000000009 6.5000000000000009 2.5000000000000004 14.500000000000002 6.5000000000000009 2 1.0000000180025095e-35 3 248.50000000000003 1.0000000180025095e-35 4 205.50000000000003 197.50000000000003 609.50000000000011 81.500000000000014 5 2.5000000000000004 6 8.5000000000000018 119.50000000000001 1.0000000180025095e-35 1.5000000000000002 94.500000000000014 23.500000000000004 7 39.500000000000007 8 9 126.50000000000001 119.50000000000001 10 11 232.50000000000003 12.500000000000002 500.00000000000006 289.50000000000006 12.500000000000002 12 3.5000000000000004 1.5000000000000002 110.50000000000001 17.500000000000004 1.5000000000000002 83.500000000000014 2.5000000000000004 13 14 1.5000000000000002 1.0000000180025095e-35 1.5000000000000002 2.5000000000000004 15 1.5000000000000002 16 17 2.5000000000000004 1.5000000000000002 18 19 20
decision_type=2 2 2 2 2 2 2 1 2 2 2 2 2 2 2 2 2 9 2 2 2 2 2 2 2 2 2 2 2 2 2 1 2 9 2 2 1 2 2 2 2 9 2 1 2 2 2 2 2 2 1 2 1 9 2 2 1 1 2 2 2 2 2 9 2 2 2 2 2 2 2 9 1 2 2 2 2 1 2 9 1 2 2 1 9 9
left_child=1 2 10 7 8 6 -3 46 12 -10 11 79 26 -14 15 57 -17 18 -6 25 21 -21 23 -22 -24 40 27 28 29 -2 35 32 33 47 48 36 -5 38 -27 -39 -20 42 43 -13 52 -42 -4 -12 69 -30 53 -52 63 -16 55 66 62 -15 59 -56 61 -36 -46 -32 -63 -54 -50 -66 73 -19 78 82 -44 -33 -58 -35 -73 -72 -43 80 -1 -75 -34 84 -81 -85
right_child=4 5 3 30 17 -7 -8 -9 9 -11 31 41 13 14 50 16 -18 34 19 20 22 -23 24 -25 -26 37 -28 -29 49 -31 44 68 71 75 60 -37 -38 39 -40 -41 45 70 72 -45 56 -47 -48 -49 54 -51 51 -53 65 -55 58 -57 74 -59 -60 -61 -62 64 -64 -65 67 -67 -68 -69 -70 -71 77 76 -74 81 -76 -77 -78 -79 -80 83 -82 -83 -84 85 -86 -87
leaf_value=-0.024472231461031797 0.0097933137190991792 0.048187943489213285 0.017158564926444995 -0.017722397262744181 0.02522208697121138 -0.0058727834719113107 -0.014416440267530743 -0.017887392327981692 0.033702023960124887 -0.0060974865742135682 -0.0013651482554523904 -0.016602485323449379 0.032193017721854282 -0.0071026790898601911 -0.001338949959684176 0.019934031176575266 0.0024026119095282451 -0.0040277346572370858 -0.0075703157178838108 -0.006139429983210213 0.019625392307652798 0.068800055825393988 0.0035782779580054783 0.0079809974728978997 0.010403990177877048 0.0046512217308628421 -0.016119189625603467 0.043574128556011761 -0.017005431315818751 -0.0017092926100182365 -0.021377213018365773 -0.023858545646620224 -0.023729617965382942 -0.023775708605164921 0.0088211229338081582 -0.019490873830216818 0.0049877237333546143 0.0040015028001383389 0.045573892458062676 0.011635122790570064 0.0025886815880892824 -0.023466801960888798 -0.021474698178737241 -0.0075308442551495977 -0.015719443098979741 -0.0051713704785631542 0.028672895969634737 -0.0093526106709077364 0.0030397578454027397 -0.010653315257777962 -0.0077747468026798236 -5.4071732279148741e-05 -0.014547735424583355 -0.0061986018217078994 0.0039151882383540162 -0.004305884277588541 -0.012266249284354583 -0.0031786131429303553 0.0012929763116682415 0.0065560091579075766 0.0088372016848977646 0.0049010867006106943 -0.011478572795263334 -0.016933283748152582 0.0080493080765798274 -0.019382523495699407 0.0060647363081035872 0.0057937628515371178 -0.019139229906656629 -0.00088845717719017816 -0.020733467300283737 -0.02146212204284776 -0.019390100203824732 -0.022470049330636496 -0.010523107284765068 -0.021772598491928211 -0.01884974736542417 -0.01868584082826702 -0.022213559993497712 -0.024827275672284779 -0.024771338910281285 -0.021306173079982785 -0.022825848089030081 -0.024815799058916406 -0.024811206596557098 -0.024829264838458289
leaf_weight=125.02355182170868 25.668031394481659 10.559953376650816 16.430933028459553 3.7664938271045685 12.255707979202269 15.732440441846846 5.609342858195304 5.7253026515245464 17.399593472480774 18.301695361733437 18.677471846342087 35.341670230031013 9.5956708043813688 18.996140494942665 9.0051243007183075 47.017963036894798 216.35680669546127 7.8412451446056393 11.290595650672911 15.083327561616899 93.116221219301224 11.343033522367476 270.64346212148666 145.26750364899635 222.46870982646942 78.792814046144485 10.103002443909643 6.7935126721858969 22.630824357271194 224.33795424550772 22.737857528030872 11.980100840330129 3.9314485192298889 5.746038079261778 18.997010171413422 4.4899326115846625 11.973759420216085 140.05345141887665 10.831405043601988 22.527412414550781 69.135230749845505 10.028480216860773 10.520653389394283 18.231295987963676 24.966021902859215 13.172332614660261 6.4102120995521537 18.42315037548542 20.659331023693088 12.182923048734663 5.852885469794276 24.350372582674026 8.6445941999554616 39.621849447488785 64.243304491043091 10.43352150917053 12.02930571883917 12.133100897073748 11.307499706745146 21.147885501384735 31.899143576622009 22.376599907875061 5.9546432644128791 5.032007277011874 27.278269588947296 4.1819471269845954 10.051683604717253 21.929276943206787 4.2779236286878577 10.444321781396864 6.7784048542380315 2.3104728385806093 9.4216839969158173 4.302160143852233 7.2902294024825087 4.4383742809295654 2.5736773088574409 1.8067179918289182 4.9414557740092269 74.330938160419464 96.043824195861816 3.2979593649506569 7.3557153195142746 20.680214464664459 7.3245229274034491 4.8263011872768429
leaf_count=1542 77 31 58 34 19 31 32 52 20 38 71 216 33 100 37 184 666 20 25 36 197 14 479 193 187 157 27 18 80 811 107 82 20 69 26 28 53 153 15 13 185 120 111 137 227 22 22 50 57 58 21 74 73 155 127 18 101 55 14 39 25 24 50 49 30 16 24 23 38 27 75 26 92 39 58 50 27 19 57 924 1192 30 37 257 91 60
internal_value=0 -0.0174447 -0.0188125 -0.00855378 0.00547182 0.0105199 0.0264697 0.0127184 0.00173428 0.0132994 -0.0216069 -0.0229274 0.0011312 0.0033636 0.00262261 0.00435848 0.00553234 0.00740238 0.00804203 0.00785127 0.00917986 0.026027 0.00857123 0.0125295 0.00665771 0.00493929 -0.0017021 -0.00120261 -0.00227063 -0.000528324 -0.014025 -0.0151749 -0.012455 -0.00911606 0.00484023 -0.00467332 -0.000446594 0.00667174 0.00959687 0.00505923 0.000271124 -0.0170194 -0.0154073 -0.0135153 -0.0161077 0.00134678 0.02039 -0.0053315 0.00283589 -0.0147825 -0.00386246 -0.00155021 -0.0191666 -0.00529865 0.00350852 0.00191604 -0.013636 -0.00557321 0.0041861 0.00456921 0.00739521 0.0068874 -0.0149027 -0.020572 0.00637423 -0.0161241 0.00402983 0.00704413 -0.0224091 -0.00223465 -0.0220506 -0.0222179 -0.0204898 -0.0231236 -0.0116085 -0.0229028 -0.0200855 -0.0203025 -0.0230531 -0.0246746 -0.0246022 -0.021965 -0.0231406 -0.0248241 -0.0248258 -0.0248183
internal_weight=0 684.149 652.247 139.633 2114.94 31.9017 16.1693 28.5664 720.347 35.7013 512.614 425.3 684.646 382.93 373.334 294.504 263.375 1394.59 1115.98 1103.73 757.922 26.4264 731.496 238.384 493.112 345.803 301.716 291.613 284.82 250.006 111.067 87.3145 63.4563 47.285 278.609 20.2302 15.7403 252.205 89.6242 162.581 93.5982 97.0704 73.5153 53.573 90.8366 82.3076 22.8411 37.1006 156.129 34.8137 78.8302 30.2033 40.5964 48.627 137.843 41.1445 50.2402 31.1292 96.6987 85.3912 122.48 90.5812 30.9207 27.7699 71.5841 12.8265 30.711 49.2075 23.8581 18.2856 23.5551 16.1713 19.9423 19.5802 19.3195 10.1844 4.88415 8.58512 14.9699 328.229 221.067 7.60012 11.2872 107.162 81.6555 25.5065
internal_count=11057 6454 6360 928 4603 94 63 132 2454 58 5432 4893 2396 1325 1292 1005 850 2149 1695 1676 1106 50 1056 390 666 570 1071 1044 1026 888 796 539 350 240 454 115 87 338 172 166 232 827 556 353 681 207 80 121 326 138 287 95 245 192 279 99 436 155 180 166 128 103 277 156 77 89 81 53 189 47 271 110 203 151 159 119 53 94 177 4066 2734 69 57 1332 1015 317
cat_boundaries=0 1 2 3 4 5 6 7 8 9 10 11 12 13 14 15 16 17 18 19 20 21
cat_threshold=1 2 1 2 2 2 1 1 1 1 1 1 2 2 1 1 2 1 1 1 1
is_linear=0
shrinkage=0.05


Tree=47
num_leaves=104
num_cat=26
split_feature=2 3 2 2 2 3 3 3 1 0 0 2 3 3 2 3 1 3 2 2 2 3 2 2 2 2 2 0 2 3 2 3 3 2 2 2 2 2 2 2 1 2 0 2 3 1 2 2 1 0 2 1 2 3 3 2 2 2 3 1 1 1 1 1 2 2 2 2 2 0 3 2 2 3 2 2 1 2 2 2 3 2 0 2 2 2 1 3 3 3 3 2 1 2 0 1 3 2 3 2 1 0 0
split_gain=104.56 10.2122 7.47229 6.24246 5.72008 3.07031 2.79074 4.79287 2.51319 1.9733 2.96751 5.02143 3.38259 1.75899 1.78253 1.17371 3.48914 6.22485 7.41245 6.4527 2.76374 9.49474 2.7376 1.44201 5.39859 0.994775 0.852226 0.850964 1.33401 1.58805 2.8279 5.92076 9.05247 1.61479 5.21946 1.09027 1.65084 0.767373 4.58223 1.18486 0.687395 0.822463 0.974718 0.534475 0.494133 0.56977 0.460012 0.386465 0.345887 0.316427 0.282676 0.391119 0.274499 0.22878 0.217277 0.202358 0.167819 0.160243 0.149214 0.103499 0.0943167 0.0698618 0.0511195 0.0499207 0.103276 0.215909 0.0343234 0.0333217 0.0334304 0.0328477 0.0322451 0.0271732 0.0556468 0.0263618 0.0239066 0.0226308 0.0201095 0.0179341 0.0167734 0.016365 0.0154893 0.0333409 0.0129297 0.0125949 0.010609 0.0167003 0.00874122 0.00679906 0.00543255 0.00409531 0.00398026 0.00335932 0.00241653 0.00211974 0.00145637 0.00199138 0.00102794 0.000854023 0.000544188 0.000534296 4.46969e-07 7.05928e-07 2.90916e-07
threshold=13.500000000000002 5.5000000000000009 4.5000000000000009 5.5000000000000009 78.500000000000014 33.500000000000007 20.500000000000004 7.5000000000000009 0 1 2 43.500000000000007 1.0000000180025095e-35 1.0000000180025095e-35 1.0000000180025095e-35 1.0000000180025095e-35 3 1.5000000000000002 45.500000000000007 31.500000000000004 19.500000000000004 6.5000000000000009 24.500000000000004 36.500000000000007 38.500000000000007 46.500000000000007 6.5000000000000009 4 79.500000000000014 1.0000000180025095e-35 93.500000000000014 10.500000000000002 2.5000000000000004 119.50000000000001 123.50000000000001 204.50000000000003 224.50000000000003 20.500000000000004 18.500000000000004 22.500000000000004 5 1.0000000180025095e-35 6 248.50000000000003 1.0000000180025095e-35 7 88.500000000000014 48.500000000000007 8 9 2.5000000000000004 10 8.5000000000000018 1.5000000000000002 1.0000000180025095e-35 96.500000000000014 20.500000000000004 52.500000000000007 11.500000000000002 11 12 13 14 15 125.50000000000001 117.50000000000001 12.500000000000002 500.00000000000006 289.50000000000006 16 3.5000000000000004 318.50000000000006 381.50000000000006 1.5000000000000002 83.500000000000014 1.5000000000000002 17 60.500000000000007 2.5000000000000004 203.50000000000003 8.5000000000000018 143.50000000000003 18 16.500000000000004 42.500000000000007 28.500000000000004 19 1.5000000000000002 1.0000000180025095e-35 1.5000000000000002 1.5000000000000002 2.5000000000000004 20 1.5000000000000002 21 22 2.5000000000000004 1.5000000000000002 1.0000000180025095e-35 18.500000000000004 23 24 25
decision_type=2 2 2 2 2 2 2 2 1 9 9 2 2 2 2 2 1 2 2 2 2 2 2 2 2 2 2 9 2 2 2 2 2 2 2 2 2 2 2 2 1 2 9 2 2 1 2 2 1 9 2 1 2 2 2 2 2 2 2 1 1 1 1 1 2 2 2 2 2 9 2 2 2 2 2 2 1 2 2 2 2 2 9 2 2 2 1 2 2 2 2 2 1 2 9 1 2 2 2 2 1 9 9
left_child=1 2 13 8 9 6 7 -3 54 47 15 12 -12 14 94 23 20 18 -18 -19 21 -17 -22 37 -25 -26 44 28 -6 35 31 32 -31 58 -35 46 -37 38 -11 -39 41 42 53 55 45 -5 60 56 -38 50 51 -16 61 -15 -4 74 83 -13 -32 -48 -30 69 66 64 65 -57 -54 68 -45 -28 84 -70 -73 -63 -29 87 77 -49 93 -66 81 -65 97 98 85 -58 -52 -42 -64 -44 -79 -84 -80 -51 95 -1 -89 -43 -2 -85 101 -96 -102
right_child=4 5 3 26 27 -7 -8 -9 -10 10 11 57 -14 40 49 16 17 19 -20 -21 22 -23 -24 24 25 -27 52 43 29 30 33 -33 -34 34 -36 36 48 39 -40 -41 75 82 89 67 -46 -47 59 76 -50 78 86 -53 62 -55 -56 63 70 -59 -60 -61 -62 73 88 80 79 -67 -68 -69 71 -71 -72 72 -74 -75 -76 -77 -78 90 92 -81 -82 -83 91 99 -86 -87 -88 96 -90 -91 -92 -93 -94 -95 100 -97 -98 -99 -100 -101 102 -103 -104
leaf_value=-0.024463386997409693 -0.013366906042610774 0.049951774146775527 0.01644425988073666 -0.017595323136496498 0.023975472790418617 -0.0057611286131732352 0.055057306292346044 -0.016166698623769824 -0.017762102948514401 -0.0086368243705760468 0.047466936616754357 -0.011603474049553125 0.011998750693327787 -0.0013330939706053641 -0.016464760428010011 -0.005628131604643323 0.047264306684908219 -0.015401700824223988 -0.0031077381031511669 0.014524051149756856 -0.019771517133619083 0.048956111519971493 -0.00045916889499672498 0.042086285554945424 -0.0068540336174517926 0.0033685140994088487 -0.021302623326433918 -0.0039437826394693115 -0.0070911862752457994 -6.1608532236848639e-05 -0.00010033519717560068 -0.0088044731020610802 0.048881137715738238 0.031830071455434004 0.0079736741149869558 0.020229603247563538 0.003369664635315555 -0.017395382478242075 0.019735884374974203 -0.0036748461959411637 -0.023835106736288171 -0.023703212484476554 -0.023750360918163543 0.0085255940597245752 -0.019385803166294756 0.0048393744390664035 0.0018951678855642267 -0.0035204997267585347 0.0083102216695569286 -0.023434451600742728 -0.021401881916426984 -0.0074000797172988006 -0.015575110629836962 -0.009207185143499632 0.027160617916955683 0.0035838597843042331 -0.0078602665579923774 -0.001801791641543028 0.0048904792645923512 0.0044578721008685278 -0.00093715431437888365 -0.014397068970670654 -0.012111199408950531 0.0062487009944474543 0.0042890991701395658 -0.0062451070429158061 -0.011324442989360559 0.0085409950684660254 0.0044663325533174222 -0.016798440045587001 -0.0033219025289015084 0.0089256137201528408 0.0055655645811879869 -0.01927592232101789 -0.00048284607631082527 -0.019029278258213 0.00076958602083999688 -0.0015335943041012859 -0.020647660219735454 0.0025930836676958183 0.0065411900870329057 0.0028180820098617516 -0.021389074464071095 -0.010352275570867944 -0.0088021917741618015 -0.0054064866545880177 -0.019283604554100209 -0.022416438281250839 -0.01037176719227091 -0.021705315950255381 0.00015864327154473348 -0.0187359655851193 -0.01856996707944002 -0.022154805361997244 -0.024827227628750049 -0.024769886010796105 -0.021230304228183561 -0.022779593138817871 -0.014218987225989937 -0.011256092874884735 -0.024815461046836577 -0.024810755250553394 -0.024829264441283749
leaf_weight=122.00107955932617 3.364797577261923 4.6624263450503367 16.715296357870105 3.7003306001424789 12.568753838539122 15.640318065881727 5.2974669635295859 6.6504383012652397 5.6238024011254337 43.965496137738228 12.63225404918194 7.5317061543464687 14.36817456781864 18.65199139714241 34.759755164384842 24.50860820710659 20.802781596779823 28.732737317681313 11.254571437835692 48.282885238528252 21.506112426519394 11.803919374942778 125.04678128659725 8.4329050779342634 31.980024769902229 93.021277606487274 22.256944306194782 7.8097261488437679 13.130361884832382 15.533821403980253 56.925628185272217 13.338588565587996 24.114297568798065 23.821503698825836 610.88725942373276 22.800673544406891 73.98086941242218 19.77223938703537 21.040582343935966 77.058749720454216 11.697656027972704 3.8392548412084562 5.6110328882932645 19.165326416492462 4.4032672494649878 12.033630624413492 81.731882721185684 9.4597312211990374 67.976983308792114 9.7958835214376467 10.297133713960648 18.094514444470406 24.57663802057505 18.251649096608162 6.5966718047857276 15.478378981351854 12.033592015504839 9.3417055755853635 20.323039621114731 76.065869122743607 11.840283036231995 8.5197452977299672 11.882652498781683 12.776486068964006 51.178504556417465 8.7432551681995374 5.8866832479834548 32.182291865348816 17.57323682308197 4.9475163593888309 8.0327967405319196 18.835874497890472 35.632852613925934 4.101670876145362 13.818035155534742 4.196825996041297 10.779810577630995 7.0396545231342298 6.6393120586872083 19.697337687015533 11.180271178483961 15.890964090824125 2.2614135444164267 2.9079836755990982 5.7456026077270499 16.36311386525631 9.2407565116882324 4.2065682560205451 7.2139156460762015 4.3427839279174805 6.861775666475296 2.5256185382604599 1.7732713893055914 4.8328987061977378 72.508220583200455 93.693922758102417 3.2284357100725174 7.1897165030241013 4.228769838809967 3.7358143925666809 20.173334561288357 7.1450284570455542 4.7079433500766781
leaf_count=1542 25 22 58 34 19 31 11 30 52 179 37 17 30 71 216 66 57 80 32 134 54 12 468 30 116 273 107 20 35 37 139 23 40 31 785 28 78 63 70 266 82 20 69 26 28 53 196 38 61 120 111 137 227 50 22 44 78 28 51 142 30 73 101 27 112 15 50 25 22 49 42 21 34 16 37 38 36 26 75 29 18 24 26 22 20 84 92 39 58 50 22 27 19 57 924 1192 30 37 25 24 257 91 60
internal_value=0 -0.0173154 -0.0186985 -0.00841572 0.0053051 0.0101374 0.0251076 0.011083 0.0122392 0.00168681 0.00267722 0.0152207 0.0285927 -0.0215366 -0.0228833 0.00174003 0.00398815 0.0110658 0.0295799 0.00335945 -0.000233449 0.0121153 -0.00329319 -0.000482714 0.00336541 0.000753203 -0.0138727 0.00716352 0.00777736 0.00759435 0.00886767 0.0200114 0.0297058 0.00803831 0.00886904 0.00479164 0.00774129 -0.00365548 0.000546599 -0.00647649 -0.0150276 -0.0123004 -0.00897267 0.00469679 -0.00458028 -0.000436843 0.00213265 -0.00521556 0.00573547 -0.0168854 -0.0152611 -0.0133615 -0.0159661 -0.00522743 0.0194767 0.00275741 -0.00775667 -0.00617692 0.00121268 0.00313051 -0.00417314 -0.0190571 -0.0134823 0.00347702 0.00285451 3.5909e-05 -0.0147537 0.00715775 0.00666967 -0.0204835 -0.00617218 0.00617594 0.00672751 -0.0159826 -0.00173258 -0.0223543 -0.0010168 -0.00184111 -0.0219887 0.00381775 0.00496266 0.00434704 -0.0221593 -0.0124504 -0.00684277 -0.00644632 -0.0204 -0.0230837 -0.0114541 -0.0228581 -0.000698302 -0.0199893 -0.0202097 -0.0230117 -0.0246708 -0.0245965 -0.0219014 -0.0231011 -0.0138414 -0.0108605 -0.0248239 -0.0248258 -0.0248181
internal_weight=0 672.375 640.125 138.459 2126.64 32.2506 16.6103 11.3129 28.9358 721.637 631.084 43.8738 27.0004 501.666 415.663 587.21 291.938 109.073 32.0574 77.0156 182.865 36.3125 146.553 295.271 133.434 125.001 109.523 1405 1125.04 1112.47 764.944 52.9867 39.6481 711.957 634.709 347.527 164.759 161.837 65.0061 96.831 86.0029 62.6735 46.8575 279.963 20.1372 15.734 182.768 90.5534 141.958 95.4335 72.3922 52.8543 89.3858 36.9036 23.312 156.573 56.4125 16.8734 77.2487 157.798 24.9706 39.8259 49.5599 134.945 95.0975 24.2216 30.4633 123.39 91.2073 27.2045 42.1751 72.042 54.4687 12.6214 21.6278 23.3295 34.141 23.3612 23.0414 70.8758 39.8477 28.6675 15.816 14.2374 34.1423 28.3967 19.5379 19.1327 19.0966 9.95382 13.9014 4.78703 8.41258 14.6288 320.23 215.695 7.435 11.029 7.59357 6.6438 104.535 79.6532 24.8813
internal_count=11057 6454 6360 928 4603 94 63 52 132 2454 2012 112 67 5432 4893 1900 903 303 89 214 600 78 522 997 419 389 796 2149 1695 1676 1106 100 77 1006 816 570 167 578 249 329 539 350 240 454 115 87 403 442 139 827 556 353 681 121 80 326 320 45 190 338 65 245 436 269 200 59 277 128 103 156 224 77 55 89 57 189 122 86 271 141 69 51 110 96 182 162 203 151 159 119 48 53 94 177 4066 2734 69 57 50 46 1332 1015 317
cat_boundaries=0 1 2 3 4 5 6 7 8 9 10 11 12 13 14 15 16 17 18 19 20 21 22 23 24 25 26
cat_threshold=1 1 2 1 2 1 2 2 1 2 1 1 1 1 1 1 2 1 2 1 1 2 1 1 1 1
is_linear=0
shrinkage=0.05


Tree=48
num_leaves=103
num_cat=26
split_feature=2 3 2 2 2 3 0 3 3 0 0 2 3 3 2 3 1 3 2 2 2 3 2 2 2 2 2 0 2 3 2 2 2 2 2 2 2 2 1 2 0 2 3 1 3 2 0 2 1 2 3 3 2 1 2 2 2 3 1 1 1 1 2 2 3 2 0 2 3 3 2 3 2 2 1 2 2 0 3 2 2 2 0 1 2 3 3 3 3 2 1 2 0 1 3 3 2 3 2 1 0 0
split_gain=100.679 9.96394 7.46301 5.99594 5.36674 2.82904 2.44971 2.41892 4.35535 1.87665 2.76365 4.59443 2.93881 1.77614 1.80903 1.10866 3.26548 5.65465 6.53951 6.12193 2.60187 8.53218 2.66659 1.3722 4.89625 0.948674 0.839034 0.792706 1.09591 8.75387 4.75897 1.27953 6.70899 1.30157 2.16287 0.736501 4.30621 1.15874 0.687322 0.817255 0.962436 0.500777 0.481679 0.549223 0.480576 0.372774 0.317827 0.282473 0.386226 0.274165 0.226435 0.221073 0.191556 0.171257 0.163944 0.155445 0.095214 0.0896314 0.0789902 0.0702694 0.0506058 0.0469329 0.09756 0.205877 0.0346811 0.0340454 0.0331412 0.0309745 0.0311897 0.0327092 0.0372021 0.0263601 0.0229682 0.0228771 0.0191642 0.0171599 0.0170361 0.0162369 0.0144942 0.0312755 0.0134955 0.0145169 0.0131327 0.0088415 0.00694048 0.00693057 0.00534682 0.00417241 0.00379304 0.00339807 0.00244019 0.00216026 0.0014924 0.00204006 0.00121721 0.00104439 0.000871208 0.000539661 5.1108e-05 4.58106e-07 7.23833e-07 2.98192e-07
threshold=13.500000000000002 5.5000000000000009 4.5000000000000009 5.5000000000000009 78.500000000000014 33.500000000000007 0 20.500000000000004 7.5000000000000009 1 2 43.500000000000007 1.0000000180025095e-35 1.0000000180025095e-35 1.0000000180025095e-35 1.0000000180025095e-35 3 1.5000000000000002 45.500000000000007 31.500000000000004 19.500000000000004 6.5000000000000009 24.500000000000004 36.500000000000007 38.500000000000007 46.500000000000007 6.5000000000000009 4 85.500000000000014 8.5000000000000018 79.500000000000014 92.500000000000014 93.500000000000014 119.50000000000001 123.50000000000001 20.500000000000004 18.500000000000004 22.500000000000004 5 1.0000000180025095e-35 6 248.50000000000003 1.0000000180025095e-35 7 1.0000000180025095e-35 48.500000000000007 8 2.5000000000000004 9 8.5000000000000018 2.5000000000000004 1.5000000000000002 96.500000000000014 10 19.500000000000004 52.500000000000007 81.500000000000014 1.0000000180025095e-35 11 12 13 14 125.50000000000001 117.50000000000001 3.5000000000000004 12.500000000000002 15 500.00000000000006 3.5000000000000004 20.500000000000004 372.00000000000006 1.5000000000000002 1.5000000000000002 83.500000000000014 16 60.500000000000007 2.5000000000000004 17 8.5000000000000018 143.50000000000003 23.500000000000004 42.500000000000007 18 19 16.500000000000004 1.5000000000000002 1.0000000180025095e-35 1.5000000000000002 1.5000000000000002 3.5000000000000004 20 1.5000000000000002 21 22 1.0000000180025095e-35 2.5000000000000004 1.5000000000000002 1.0000000180025095e-35 37.500000000000007 23 24 25
decision_type=2 2 2 2 2 2 9 2 2 9 9 2 2 2 2 2 1 2 2 2 2 2 2 2 2 2 2 9 2 2 2 2 2 2 2 2 2 2 1 2 9 2 2 1 2 2 9 2 1 2 2 2 2 1 2 2 2 2 1 1 1 1 2 2 2 2 9 2 2 2 2 2 2 2 1 2 2 9 2 2 2 2 9 1 2 2 2 2 2 2 1 2 9 1 2 2 2 2 2 1 9 9
left_child=1 2 13 6 9 7 44 8 -3 45 15 12 -12 14 92 23 20 18 -18 -19 21 -17 -22 35 -25 -26 42 28 29 30 -6 50 -33 57 -35 36 -11 -37 39 40 51 52 43 -5 -4 54 47 48 -16 59 58 -15 73 56 84 -13 -32 -34 -30 66 65 62 63 -54 80 -51 -28 68 -43 70 -70 -61 85 -29 75 -47 91 -64 79 -63 94 -82 96 -49 97 -40 -62 -42 -77 -84 -78 -48 93 -1 -56 -87 -41 -2 -66 100 -94 -101
right_child=4 5 3 26 27 -7 -8 -9 -10 10 11 55 -14 38 46 16 17 19 -20 -21 22 -23 -24 24 25 -27 49 41 31 -31 53 32 33 34 -36 37 -38 -39 72 82 87 67 -44 -45 -46 74 76 83 -50 60 -52 -53 61 -55 64 -57 -58 -59 -60 71 86 78 77 -65 98 -67 -68 -69 69 -71 -72 -73 -74 -75 -76 88 90 -79 -80 -81 81 -83 89 -85 -86 95 -88 -89 -90 -91 -92 -93 99 -95 -96 -97 -98 -99 -100 101 -102 -103
leaf_value=-0.024454326951129392 -0.013212660711294694 0.046308090086056623 0.014380047662064669 -0.017466913181222468 0.034018540886651544 -0.0056509577896357447 -0.019128524077514739 0.050777856958868661 -0.016025515251986505 -0.008496367492632783 0.044115426541572259 -0.011449115109010269 0.011559500861108558 -0.0013017516089930126 -0.016325901039794186 -0.0055197599603522326 0.04393612658241404 -0.015255376277333031 -0.0030401281169206906 0.013956612410061568 -0.019670522587354643 0.045430861642854703 -0.00044797636485154605 0.039328494789096002 -0.006730407713376462 0.0032736890747458469 -0.021226690418184948 -0.003861252217547561 -0.0019201543757499996 0.046715364989994068 -0.011381136460190809 0.049618219959370262 0.0040191362455300932 0.020282519769322778 0.0072524917315478464 -0.017264936384187062 0.018864972395340907 -0.0035969646449494023 -0.023811126968746085 -0.023676202251049633 -0.023724429502052512 0.0051483699110303222 -0.019279247423145979 0.0046961450739597043 0.030542753534261027 -0.0034453499765112732 -0.023401377420345811 -0.021327738742588132 -0.0072706243940461081 -0.015429847750635307 -0.0072313293001673084 -0.0090626851495743763 0.0034822133746373546 -0.0011792191616393022 -0.0082265565825851497 -0.001760263458732517 -0.0046638418695931052 0.001181053775219158 0.0045402986511952521 -0.014245789876346546 -0.011956231722488527 0.0060551094948979858 0.0040352141168807166 -0.0061286837349301924 -0.0033888571177550088 -0.011170639040211152 -0.016662395152079599 0.0082571935157693191 0.009404937300473367 0.0056058833072185569 0.0062895925271685407 -0.019167837679572582 -0.018917852057315634 -0.00047108757095836411 0.00074989306587391002 -0.0014978407341229181 -0.020560422706923792 0.0019618174621357435 0.0063366597300680136 0.0027402791464092389 -0.0058436122422714969 -0.0086604959207962698 -0.021022122795156282 -0.019175626240196378 -0.0112442221979858 -0.022361740059620133 -0.010221037095441726 -0.021636769013533879 0.00015467929170112478 -0.018290174028470253 -0.018452645845813857 -0.022094892689773563 -0.024827176829021497 -0.024768395078500722 -0.009576786381659156 -0.021153080764395649 -0.022732366492322017 -0.014067041940144838 -0.0031367730525967488 -0.024815115355790847 -0.02481028863162197 -0.024829264843032172
leaf_weight=119.05273300409317 3.3201199769973737 4.9012377113103884 17.840456843376163 3.6357915550470352 9.8054266571998578 15.550471216440199 5.2585494145751026 5.5973098278045645 6.5437871739268303 43.587409734725952 13.24632713198662 7.4448173493146923 14.541613340377806 18.627143621444702 34.192129448056221 24.371058091521263 21.809616759419441 28.29359482228756 11.219649463891981 48.989265516400337 21.085079878568649 12.396172046661375 124.98937766253948 8.7953890562057477 31.761581763625145 93.335150182247162 21.787827499210835 7.7789868712425259 10.154417365789415 15.353038370609282 10.973851233720781 9.3525314033031446 43.447163850069046 33.049473106861115 875.92897352576256 19.431267604231834 21.459961384534836 76.776091188192368 11.422137334942823 3.7493222355842573 5.4793389514088613 30.33777517080307 4.3187285140156737 12.092006526887419 6.1965237259864798 9.4264868348836917 9.568991884589197 10.079097144305706 17.96110787987709 24.196819633245472 14.341256916522978 18.084374293684959 15.533950835466387 15.096698015928267 3.386470600962638 9.3248889148235303 10.158999174833296 77.342589199542999 8.8592962622642499 8.3979646116495115 11.739607311785223 12.856572538614275 59.939012497663498 8.6888227462768537 3.6209943294525129 5.820395976305007 4.8651000112295177 32.458337903022766 21.148310661315918 22.808738470077515 17.522968351840973 4.0233646184206 4.1177184283733359 13.81136494874954 10.788109660148619 7.028866767883299 6.5036313012242299 11.207954019308088 11.253643065690992 15.935809433460234 23.227218821644787 5.6952506005763999 2.7505324259400359 9.0642687082290649 4.7452204897999763 4.1133210957050315 7.1394812539219847 4.2495379596948624 6.8628644943237305 1.9417643249034879 1.740645684301853 4.7270039767026892 70.730203002691269 91.401641845703125 3.2913967967033386 3.1606174111366272 7.0277890413999557 4.1690665185451508 4.521151214838028 19.678883619606495 6.9699362590908995 4.5924876630306271
leaf_count=1542 25 22 70 34 15 31 43 11 30 179 37 17 30 71 216 66 57 80 32 134 54 12 468 30 116 273 107 20 32 18 22 17 111 43 1133 63 70 266 82 20 69 35 28 53 19 38 120 111 137 227 25 50 44 36 24 28 31 190 22 73 101 27 118 15 22 50 49 25 26 25 17 16 38 37 36 26 75 23 18 24 129 20 32 92 33 39 58 50 22 21 19 57 924 1192 21 30 37 25 21 257 91 60
internal_value=0 -0.0171848 -0.0185831 -0.00827872 0.00514375 0.00977037 0.011784 0.0238417 0.0106683 0.00163896 0.00260008 0.014606 0.0270787 -0.0214649 -0.0228383 0.00169076 0.00386867 0.0106626 0.0279789 0.00326197 -0.000230256 0.0116584 -0.00322265 -0.000472451 0.00326898 0.000733687 -0.01372 0.0069342 0.00752361 0.0140208 0.00311696 0.00715171 0.00746113 0.00707825 0.00772625 -0.00357902 0.000530489 -0.00635752 -0.0148796 -0.0121458 -0.00883027 0.00455827 -0.00448866 -0.000427284 0.0185467 -0.00511318 -0.0167502 -0.0151141 -0.0132073 -0.0158236 -0.0024878 -0.00512485 0.0026813 -0.00524647 -0.00762382 -0.00606157 -0.00815199 0.00220189 0.00109004 -0.018946 -0.0133283 0.00337866 0.00277547 3.47394e-05 -0.00619278 -0.014604 -0.0203935 0.00692956 0.00646023 0.00710758 0.00799329 -0.0158401 -0.0222984 -0.00169256 -0.000992608 -0.00179877 -0.0219255 0.00370859 0.00481514 0.00422044 -0.00686607 -0.0063983 -0.0220994 -0.0203087 -0.0127403 -0.0230429 -0.0113 -0.0228125 -0.000681454 -0.0198916 -0.0201154 -0.0229694 -0.0246668 -0.0245907 -0.00889206 -0.0218366 -0.0230607 -0.0136883 -0.00324888 -0.0248238 -0.0248257 -0.0248178
internal_weight=0 660.892 628.299 137.313 2138.09 32.5928 29.2955 17.0423 11.445 722.942 632.858 44.5576 27.7879 490.986 406.263 588.301 293.154 110.312 33.0293 77.2829 182.842 36.7672 146.074 295.147 133.892 125.097 108.017 1415.15 1133.86 61.388 46.035 1072.48 1039.12 1029.77 908.978 161.255 65.0474 96.2074 84.7236 61.9098 46.4404 281.282 20.0465 15.7278 24.037 90.0832 93.8369 71.2966 52.1532 87.9706 33.355 36.7115 157.006 36.2295 55.9769 16.7697 21.1329 120.79 19.0137 39.0743 48.8963 135.416 95.3697 24.2228 43.7425 30.0172 26.6529 124.276 91.8178 61.48 38.6713 12.4213 22.8138 21.5904 34.1063 23.3182 22.5403 71.147 40.046 28.7924 35.6003 28.9225 15.4694 19.1434 12.2344 18.6961 18.8791 9.72888 13.8917 4.6923 8.24428 14.296 312.426 210.454 6.67787 7.27394 10.7771 7.48919 8.14215 101.972 77.7001 24.2714
internal_count=11057 6454 6360 928 4603 94 132 63 52 2454 2012 112 67 5432 4893 1900 903 303 89 214 600 78 522 997 419 389 796 2149 1695 122 104 1573 1494 1477 1176 578 249 329 539 350 240 454 115 87 89 442 827 556 353 681 79 121 326 89 320 45 53 301 54 245 436 269 200 59 237 277 156 128 103 68 43 89 189 57 122 86 271 141 69 51 194 149 110 203 83 151 159 119 48 53 94 177 4066 2734 45 69 57 50 43 1332 1015 317
cat_boundaries=0 1 2 3 4 5 6 7 8 9 10 11 12 13 14 15 16 17 18 19 20 21 22 23 24 25 26
cat_threshold=2 1 2 1 2 1 2 2 2 1 1 1 1 1 1 2 1 1 2 1 1 2 1 1 1 1
is_linear=0
shrinkage=0.05


Tree=49
num_leaves=104
num_cat=25
split_feature=2 3 2 2 2 3 2 1 3 2 0 0 2 3 3 1 3 2 2 2 3 2 2 2 2 2 0 2 3 2 3 3 2 2 2 2 2 2 2 1 2 0 2 3 1 2 2 2 0 2 1 2 3 3 2 2 2 2 1 1 1 3 2 1 3 3 1 2 0 2 3 2 2 3 2 2 2 3 1 2 2 0 2 2 2 2 1 3 3 3 2 2 1 2 0 1 3 2 2 3 1 0 0
split_gain=96.9464 9.72346 7.45132 5.76 5.03736 2.61124 4.77829 2.31488 1.79298 1.83559 1.78488 2.57598 4.21262 2.56732 1.04749 3.05801 5.14838 5.81115 5.79814 2.45074 7.69774 2.59694 1.30581 4.4538 0.904701 0.825725 0.738974 1.03057 1.4436 2.47215 11.4914 2.00225 2.72573 2.1101 0.999537 1.50569 0.706761 4.04989 1.13283 0.687001 0.811788 0.950033 0.471583 0.469442 0.529419 0.400457 0.359474 0.323283 0.319123 0.282158 0.381232 0.273718 0.213565 0.171792 0.1615 0.160184 0.114269 0.11419 0.0976443 0.0864405 0.0706551 0.052693 0.0762611 0.0500743 0.0337865 0.0441567 0.0359938 0.0337544 0.0334272 0.0307679 0.0301144 0.0288136 0.0307892 0.0263478 0.0256255 0.0233058 0.0192418 0.0186559 0.0182625 0.0172995 0.0164548 0.0133363 0.0122433 0.0105509 0.0100403 0.0159881 0.00894049 0.00706371 0.00526 0.00425036 0.00343605 0.00277501 0.00246334 0.00220127 0.00152926 0.00209001 0.0010609 0.000888638 0.000555091 0.000534924 4.69257e-07 7.41553e-07 3.05755e-07
threshold=13.500000000000002 5.5000000000000009 4.5000000000000009 5.5000000000000009 78.500000000000014 33.500000000000007 1.0000000180025095e-35 0 1.0000000180025095e-35 1.0000000180025095e-35 1 2 43.500000000000007 1.0000000180025095e-35 1.0000000180025095e-35 3 1.5000000000000002 31.500000000000004 45.500000000000007 19.500000000000004 6.5000000000000009 24.500000000000004 36.500000000000007 38.500000000000007 46.500000000000007 6.5000000000000009 4 79.500000000000014 1.0000000180025095e-35 85.500000000000014 8.5000000000000018 5.5000000000000009 152.50000000000003 252.50000000000003 204.50000000000003 224.50000000000003 20.500000000000004 18.500000000000004 22.500000000000004 5 1.0000000180025095e-35 6 154.50000000000003 1.0000000180025095e-35 7 88.500000000000014 48.500000000000007 649.50000000000011 8 2.5000000000000004 9 8.5000000000000018 1.5000000000000002 1.0000000180025095e-35 56.500000000000007 20.500000000000004 89.500000000000014 248.50000000000003 10 11 12 3.5000000000000004 201.50000000000003 13 2.5000000000000004 10.500000000000002 14 12.500000000000002 15 120.50000000000001 3.5000000000000004 500.00000000000006 289.50000000000006 1.5000000000000002 318.50000000000006 1.5000000000000002 124.50000000000001 18.500000000000004 16 2.5000000000000004 58.500000000000007 17 16.500000000000004 189.50000000000003 42.500000000000007 28.500000000000004 18 1.5000000000000002 1.0000000180025095e-35 1.5000000000000002 2.5000000000000004 70.500000000000014 19 1.5000000000000002 20 21 2.5000000000000004 1.5000000000000002 18.500000000000004 1.0000000180025095e-35 22 23 24
decision_type=2 2 2 2 2 2 2 1 2 2 9 9 2 2 2 1 2 2 2 2 2 2 2 2 2 2 9 2 2 2 2 2 2 2 2 2 2 2 2 1 2 9 2 2 1 2 2 2 9 2 1 2 2 2 2 2 2 2 1 1 1 2 2 1 2 2 1 2 9 2 2 2 2 2 2 2 2 2 1 2 2 9 2 2 2 2 1 2 2 2 2 2 1 2 9 1 2 2 2 2 1 9 9
left_child=1 2 8 7 10 6 -3 53 9 94 46 14 13 -13 22 19 18 -18 -17 20 -16 -21 36 -24 -25 43 27 -6 34 30 -30 32 -31 -33 45 -36 37 -12 -38 40 41 52 56 44 -5 59 55 -37 49 50 -11 60 -10 -4 -14 82 -28 61 -47 -29 68 62 -44 67 66 69 76 -53 -27 -66 84 72 -59 -62 -74 87 -58 83 80 93 -48 97 99 -63 85 -57 -51 -41 -65 -43 -83 -82 -81 -50 95 -1 -89 -42 -84 -2 101 -96 -102
right_child=4 5 3 25 26 -7 -8 -9 39 48 11 12 54 -15 15 16 17 -19 -20 21 -22 -23 23 24 -26 51 42 28 29 31 -32 33 -34 -35 35 47 38 -39 -40 75 81 89 57 -45 -46 58 78 -49 79 86 -52 63 -54 -55 -56 70 64 71 -60 -61 73 77 -64 88 65 -67 -68 -69 -70 -71 -72 -73 74 -75 -76 -77 -78 -79 -80 92 91 90 98 -85 -86 -87 -88 96 -90 -91 -92 -93 -94 -95 100 -97 -98 -99 -100 -101 102 -103 -104
leaf_value=-0.024445043489756711 -0.013058156446821057 0.040992706689150629 0.015388423545357563 -0.017337186126993732 0.021085768430340254 -0.005542274890072643 -0.014667389225373494 -0.017694877354898327 -0.0012711032660713045 -0.016185936042251492 -0.0083570061184267061 0.04114001736883105 -0.010268376334031633 0.011141286825884498 -0.005412880795037732 0.04098025010847281 -0.015108203285943783 0.01341905356874005 -0.002973785630198868 -0.01956804277497682 0.042310303373015876 -0.00043705159599693734 0.036854245355373481 -0.0066081843031206705 0.0031818393379711412 -0.021149402696242884 -0.0028452380206670192 -0.0068234285043757229 -0.006417531225662439 0.018015515668746235 0.057677072059505133 0.0025430563375800261 0.0072283319819508463 0.0090233797304013329 0.019008150972058283 0.0043859354387232579 -0.017133204953237904 0.018048408579177045 -0.003520454980939865 -0.023786592348224861 -0.023648576501561065 -0.023697902835089546 0.0047949543553371422 -0.019171209531482953 0.0045578133311676853 0.001640894647320883 -0.0035600182441182003 0.011225377801721392 -0.023367570114754141 -0.021252257409334039 -0.0071424973161414666 -0.015283691617607729 -0.0089191475470656884 0.024720419180313258 -0.00034158299414525434 -0.0076037855579525436 0.00096542501185715762 0.0080259522906192485 0.0041168059457247939 -0.0009090918365095281 -0.014093941102259221 0.0050488436800551163 -0.0005038796951876886 -0.011801394758993326 0.0015971244894922203 0.0036216654824437694 0.0055692158482783319 -0.011017208109991636 -0.016525176021080008 -0.0017688424048091953 -0.0031801686165178165 0.0079851170510277548 0.0041362274763798263 -0.019058273980008394 0.0063192061480019162 -0.018804955842425738 0.0037890761192275052 0.0038319606158724096 0.0007307186264041654 -0.020471745428168025 -0.0002504624532247081 -0.021240034291080744 -0.010036222803419863 0.0070450851106628578 -0.0085198581089775561 -0.005186744786714657 -0.01906616780403321 -0.022305940378619687 -0.010070959953088841 -0.021566940462857814 -0.018502386308816145 -0.00165094367789194 -0.01833388771824359 -0.022033805227686113 -0.024827120433334779 -0.02476687233222297 -0.02107448981351924 -0.022684152685903305 -0.010967350836256105 -0.013914579490659541 -0.024814759144516745 -0.024809813384594225 -0.024829265907515833
leaf_weight=116.17668543756008 3.2765408530831319 11.714299991726877 17.15412333607674 3.5728369057178497 13.359779536724089 15.46284434199333 5.7478662133216849 5.5708114132285145 18.602911591529846 33.638444289565086 43.218644008040428 13.843775823712351 9.4134778231382388 14.710682496428488 24.236906796693802 22.789208963513374 27.865240931510925 49.677783250808716 11.185592055320738 20.674377962946892 12.972329705953596 124.93339689075947 9.1481903046369535 31.548530578613281 93.641201362013817 21.330217592418194 13.349019974470137 12.935105532407761 15.311154425144197 96.615029215812683 12.872229546308516 237.58707854151726 148.67817363142967 266.54646426439285 23.435973584651947 123.73243224620819 19.098667219281197 21.868646413087845 76.500424638390541 11.153376057744032 3.6615951210260373 5.3508750423789007 15.5503565967083 4.2362641096115103 12.148926541209223 82.517001569271088 8.1995157301425952 20.08162522315979 9.3476635962724703 9.8664088770747185 17.83099253475666 23.826332002878193 17.921222001314163 6.9215418994426718 7.2550784498453131 11.854416102170946 13.891625970602037 19.456780850887299 76.962138950824738 11.826392531394958 8.2791770547628385 12.66162756085396 12.053435206413267 11.600081756711008 14.657354563474657 12.545252650976179 11.621788352727888 5.7557402178645125 4.7847073003649738 12.647360473871229 7.9802070856094351 32.72746205329895 17.773510217666626 3.946979731321334 55.182713329792023 4.040552355349063 10.66575315594673 13.914793342351912 10.796202749013899 6.3712790608406049 9.4090091288089734 2.1675096079707137 2.8458547219634056 13.870079189538954 5.6461399346590033 16.180058792233467 8.892111599445343 4.0223608687520018 7.0668801814317694 4.1585793644189835 2.4323762506246567 5.6678128093481055 1.7088207304477689 4.6237066090106955 68.995797693729401 89.165569365024567 3.0944627672433853 6.8698329627513885 3.657997652888298 4.1108306720852852 19.196559101343155 6.7991371750831595 4.479863494634631
leaf_count=1542 25 31 58 34 19 31 32 52 71 216 179 37 24 30 66 57 80 134 32 54 12 468 30 116 273 107 34 35 36 197 14 429 193 237 28 128 63 70 266 82 20 69 31 28 53 196 33 11 120 111 137 227 50 22 21 78 37 26 142 30 73 24 17 101 38 27 24 50 49 25 42 25 22 16 55 38 26 22 36 75 35 26 22 21 20 84 92 39 58 50 27 18 19 57 924 1192 30 37 24 25 257 91 60
internal_value=0 -0.017053 -0.0184663 -0.00814286 0.00498827 0.00942127 0.0226716 0.0113505 -0.021392 -0.0227923 0.00159272 0.00252557 0.0140258 0.0256853 0.00164313 0.00375352 0.0102789 0.00316773 0.0265092 -0.000226936 0.0112249 -0.0031534 -0.000462333 0.00317574 0.000714697 -0.0135668 0.0067139 0.00728016 0.00711681 0.0083188 0.0228565 0.00777209 0.0114771 0.00596935 0.00445761 0.00725609 -0.00350386 0.000514936 -0.00623999 -0.0147309 -0.0119914 -0.00868889 0.00442445 -0.00439847 -0.000417917 0.0019172 -0.00501229 0.00534097 -0.0166139 -0.0149663 -0.0130529 -0.01568 -0.00502375 0.0180713 -0.00594769 -0.00749224 0.00142139 0.00581379 0.00283573 -0.00399867 -0.0188335 0.00416535 0.00248117 -0.013174 0.00217051 0.0011662 0.00327672 -0.0144536 -0.0203022 3.80312e-05 -0.00594187 0.0067102 0.0062587 -0.0156966 0.00578739 -0.0222413 0.00219179 0.00531476 -0.00096897 -0.0218612 -0.00175733 -0.0220384 -0.0121419 0.00609243 -0.00659622 -0.00620879 -0.020216 -0.0230013 -0.0111463 -0.022766 -0.0197924 -0.000776944 -0.0200196 -0.0229262 -0.0246627 -0.0245848 -0.0217705 -0.0230195 -0.0105599 -0.0135347 -0.0248236 -0.0248256 -0.0248175
internal_weight=0 649.688 616.763 136.195 2149.24 32.925 17.4622 29.6465 480.569 397.093 724.207 634.582 45.223 28.5545 589.359 294.335 111.518 77.543 33.9748 182.817 37.2092 145.608 295.024 134.338 125.19 106.548 1425.03 1142.46 1129.1 777.61 28.1834 749.427 245.293 504.134 351.491 167.25 160.686 65.0873 95.5991 83.4757 61.1649 46.0336 282.569 19.958 15.7218 184.241 89.6246 143.814 92.2794 70.228 51.4694 86.5901 36.5241 24.0757 16.6686 55.552 89.3782 193.191 159.479 24.7615 38.3411 68.0503 27.6038 48.249 76.0291 39.85 36.1792 29.5821 26.1149 27.3047 41.6608 125.14 92.413 12.2262 72.9562 22.3108 24.5574 40.4465 34.0725 22.0515 23.2763 15.1313 13.8912 26.5317 33.6806 28.0345 18.7585 18.2702 18.667 9.50945 4.59989 15.0768 8.0801 13.9714 304.814 205.342 7.11682 10.5314 6.50385 7.38737 99.4714 75.7949 23.6764
internal_count=11057 6454 6360 928 4603 94 63 132 5432 4893 2454 2012 112 67 1900 903 303 214 89 600 78 522 997 419 389 796 2149 1695 1676 1106 50 1056 390 666 570 167 578 249 329 539 350 240 454 115 87 403 442 139 827 556 353 681 121 80 45 320 211 243 338 65 245 115 48 436 177 90 87 277 156 63 224 128 103 89 77 189 63 67 122 271 86 110 96 45 182 162 203 151 159 119 53 53 94 177 4066 2734 69 57 46 50 1332 1015 317
cat_boundaries=0 1 2 3 4 5 6 7 8 9 10 11 12 13 14 15 16 17 18 19 20 21 22 23 24 25
cat_threshold=1 1 2 1 2 1 2 2 2 1 1 1 1 1 1 2 1 2 1 1 2 1 1 1 1
is_linear=0
shrinkage=0.05


Tree=50
num_leaves=96
num_cat=22
split_feature=2 3 2 2 1 2 0 3 3 2 2 2 3 3 3 2 3 2 2 2 2 2 1 3 1 1 2 2 3 2 2 1 2 2 2 2 2 2 2 2 2 1 3 0 2 2 2 2 0 1 3 0 1 2 2 3 2 3 2 2 2 2 2 2 0 2 2 2 2 2 2 2 2 3 3 2 2 2 2 1 3 2 2 2 0 3 2 2 0 1 1 0 1 0 1
split_gain=83.4737 11.9035 10.8574 6.97864 3.80023 3.99541 5.10893 3.25254 7.20677 3.36026 2.95972 2.36627 2.38821 3.5187 2.40727 6.11786 6.53007 2.30971 10.5919 2.44603 2.26748 4.33995 2.32812 2.16982 6.47476 1.97835 1.82452 3.0861 1.66051 1.10753 4.441 1.97011 1.09488 1.07134 1.36734 0.965569 1.31381 0.760818 0.744731 1.61897 0.740184 0.739481 0.737872 0.724402 0.604927 0.468604 0.244659 0.25323 0.239686 0.234775 0.232341 0.208742 0.16059 0.15839 0.127734 0.125723 0.123496 0.118323 0.0910831 0.085743 0.0759216 0.0762059 0.0718849 0.0713897 0.0624792 0.0535866 0.043916 0.036091 0.0718503 0.0344206 0.0340696 0.0234878 0.0164811 0.0126867 0.0124687 0.0121109 0.00831655 0.00792644 0.00579379 0.00533807 0.00460404 0.00410966 0.00384412 0.00182943 0.00179613 0.00140172 0.00100297 0.00055683 5.2479e-05 4.61751e-06 4.00912e-06 1.31186e-06 1.31596e-06 1.04818e-06 5.29863e-08
threshold=15.500000000000002 1.0000000180025095e-35 92.500000000000014 1.0000000180025095e-35 0 7.5000000000000009 1 29.500000000000004 5.5000000000000009 4.5000000000000009 94.500000000000014 16.500000000000004 1.5000000000000002 8.5000000000000018 23.500000000000004 23.500000000000004 9.5000000000000018 43.500000000000007 41.500000000000007 74.500000000000014 21.500000000000004 23.500000000000004 2 1.5000000000000002 3 4 79.500000000000014 78.500000000000014 86.500000000000014 4.5000000000000009 6.5000000000000009 5 32.500000000000007 122.50000000000001 125.50000000000001 120.50000000000001 119.50000000000001 1.5000000000000002 147.50000000000003 151.50000000000003 38.500000000000007 6 31.500000000000004 7 5.5000000000000009 81.500000000000014 48.500000000000007 46.500000000000007 8 9 40.500000000000007 10 11 64.500000000000014 23.500000000000004 1.0000000180025095e-35 2.5000000000000004 8.5000000000000018 98.500000000000014 13.500000000000002 13.500000000000002 8.5000000000000018 43.500000000000007 136.50000000000003 12 82.500000000000014 10.500000000000002 13.500000000000002 7.5000000000000009 2.5000000000000004 2.5000000000000004 13.500000000000002 10.500000000000002 3.5000000000000004 1.5000000000000002 139.50000000000003 14.500000000000002 8.5000000000000018 5.5000000000000009 13 1.5000000000000002 14.500000000000002 12.500000000000002 3.5000000000000004 14 2.5000000000000004 3.5000000000000004 5.5000000000000009 15 16 17 18 19 20 21
decision_type=2 2 2 2 1 2 9 2 2 2 2 2 2 2 2 2 2 2 2 2 2 2 1 2 1 1 2 2 2 2 2 1 2 2 2 2 2 2 2 2 2 1 2 9 2 2 2 2 9 1 2 9 1 2 2 2 2 2 2 2 2 2 2 2 9 2 2 2 2 2 2 2 2 2 2 2 2 2 2 1 2 2 2 2 9 2 2 2 9 1 1 9 1 9 1
left_child=1 3 11 88 5 6 7 8 9 -3 -4 23 17 32 15 -15 -17 18 20 46 22 -22 -13 24 -2 -20 27 -21 50 37 31 44 51 35 -35 36 49 41 55 -40 -16 43 -41 -5 -31 -28 47 -19 65 64 56 73 67 -48 -53 75 57 74 -51 66 61 -58 -50 -57 -12 -34 77 68 -32 84 80 72 -54 -14 -6 -36 -69 -7 -72 83 -8 -73 93 -71 -39 -82 -81 -33 89 -1 -86 94 -93 -68 -90
right_child=2 4 10 29 28 59 70 -9 -10 -11 33 12 13 14 40 16 -18 19 25 26 21 -23 -24 -25 -26 -27 45 -29 -30 30 52 87 48 34 38 -37 -38 69 39 42 -42 -43 -44 -45 -46 -47 53 -49 62 58 -52 54 71 -55 -56 63 60 -59 -60 -61 -62 -63 -64 -65 -66 -67 82 76 -70 79 78 81 -74 -75 -76 -77 -78 -79 -80 86 85 -83 -84 -85 90 -87 -88 -89 91 -91 -92 92 -94 -95 -96
leaf_value=-0.024772261177908157 0.044885920038823288 0.0011004798424868647 0.027163947834205355 -0.0039802465553813336 -0.023678174355299571 -0.018787305141284041 -0.023394800347872748 -0.013615100345583676 0.053667309968636029 0.029753142447494874 -4.8230772512138565e-05 -0.016570230701881919 -0.0085987282150828872 0.037172422032275179 -0.017773758130739042 0.038813914232000812 -0.0074168022142954426 -0.0054761907756415958 0.065711967333751856 0.00029151864234740714 0.017918182874750839 -0.00049997960281996409 0.0050091707823391981 0.038026666747637355 -0.019877859361733679 0.029726595461612118 -0.0083238953148622209 0.04049591220509776 0.019830497341720182 0.016554836219010986 -0.020631784048464538 -0.018097441561827753 -0.0030190570512366984 0.019726921069873189 0.0044514883985506907 -0.007808657884318549 0.017908353557767192 -0.021931038785698832 0.020101231088567355 0.0058290851139490129 -0.0011789919131194699 -0.023454113893114123 0.0089878503303854745 -0.02347978731050112 0.0022453906962322931 0.0028983580650167348 -0.0035558918687985199 -0.01369585466975338 -0.009110705839470044 0.0091091297831642128 -0.0049583976525655084 -0.017864950283505238 -0.013521719813958472 -0.0073438978169900644 -0.012776335740553955 7.59201848055625e-05 -0.017339047899825117 -0.013268493086662975 0.0039103276051531757 -0.02034050081888511 -0.019911854739051372 -0.010517964882717647 -0.006318613441465038 0.0030868481957314932 0.0030655746623599895 0.0024109595131859649 -0.012725169587811872 -0.020406775533284766 -0.015552347095720884 -0.021323850341163728 -0.018981378332999056 -0.016151171873814808 -0.010524261659632168 -0.0048212221350476744 -0.021206518708040384 0.0064497909829417388 -0.018217013107756329 -0.015722934655164209 -0.015874144024003622 -0.019683797967406127 -0.022028857049315832 -0.014206847498802001 -0.01022179389523427 -0.020226490357076292 -0.023046834955084913 -0.020457612969382217 -0.018675953222889494 -0.017261342458142787 -0.024825423163851223 -0.024787346146417751 -0.023000173499218166 -0.02479399678383162 -0.024829264976786929 -0.012676576686536137 -0.024822538667653726
leaf_weight=115.57684403657913 6.2293087616562843 49.691688187420368 16.916732132434845 23.146682381629944 13.294689163565641 4.1083315461874026 5.408358573913576 13.447130888700483 9.5334440469741804 12.88601993024349 64.51577353477478 30.356994770467281 6.8582265377044678 14.521954119205473 13.125259011983873 9.2343275398015958 44.193616390228271 17.78717352449894 6.1365847438573837 10.761702179908752 43.315101653337479 122.26318654417992 21.246503844857216 6.998106822371482 10.143201366066938 10.114587470889093 12.672098338603972 8.5775011777877808 3.0639964044094077 16.650501370429993 9.6485153138637525 4.3064685985445958 25.611251875758175 19.748973339796066 20.475942045450211 19.864970535039902 15.11981552839279 4.6816426515579224 22.63072794675827 777.35515132546425 13.768142983317373 10.526602625846861 242.56839209794998 5.9968666136264828 13.273730367422106 34.979803919792175 65.548908486962318 19.80148246884346 29.313325852155685 9.8821144104003888 3.2208430469036093 23.985462054610252 11.287992395460611 47.661192178726196 25.383680373430252 41.695930749177933 9.3334627151489311 3.9024018794298163 57.139323383569717 12.844264820218084 9.7045543044805509 7.2951767146587363 107.93239742517471 37.296228289604187 21.471414566040039 5.5234116315841666 2.1660374626517296 12.766852036118509 25.004511587321758 7.0952792167663565 3.7538030222058287 5.6528170853853208 7.7236254066228858 3.2884336113929749 8.2807002961635572 12.040809035301207 6.5660081654787055 4.3390037417411804 2.4989195168018341 5.7966659516096115 3.3805351555347443 5.2342415526509285 2.4151091054081917 8.1728715747594833 10.449056774377823 2.4468113854527473 4.2995066791772842 3.704207181930542 69.853307723999023 90.414098426699638 8.2283122837543523 7.2884917259216291 4.151501476764679 2.2757350578904143 20.620527744293213
leaf_count=1572 22 188 37 120 96 26 71 20 21 34 174 141 42 14 14 21 117 61 18 33 93 499 84 17 37 37 28 13 7 54 58 42 98 32 48 28 16 59 34 964 32 103 234 79 57 102 246 44 116 22 8 76 103 118 102 88 66 14 122 36 18 60 307 76 61 16 19 38 244 83 37 25 67 21 76 27 32 41 25 62 42 21 21 95 104 22 46 36 959 1239 53 100 57 21 283
internal_value=0 -0.0160783 0.0036928 -0.0199987 -0.00534779 -0.000633425 0.00392697 0.00896038 0.0131702 0.00700064 0.00637864 -0.000951471 -0.00142479 -0.00470889 0.00338394 0.00839532 0.000573578 0.000924175 0.00437951 -0.00277935 0.00146607 0.00431819 -0.00768543 0.0147235 0.00476305 0.043315 0.00517074 0.0181233 -0.015994 -0.0129757 -0.00988424 0.004312 -0.00807688 0.00612044 0.00668168 0.00261612 0.00384785 -0.0172363 0.00645844 0.00687383 -0.00927803 -0.0120954 0.00658033 -0.00799267 0.0102075 -8.59824e-05 -0.00631111 -0.00980626 -0.00601646 0.00245843 -0.0179886 -0.0139062 -0.0163042 -0.00515063 -0.0152486 0.0025747 -0.0187987 -0.0212804 0.00467688 -0.0173282 -0.0163975 -0.0143466 -0.00691496 0.00149753 0.000729301 -0.00205575 -0.0148002 -0.0179322 -0.0169666 -0.0214219 -0.0206979 -0.0133645 -0.012304 -0.00737448 -0.0227295 0.00519145 -0.0196631 -0.0172133 -0.0177396 -0.0201466 -0.0223442 -0.0152164 -0.0118273 -0.0207364 -0.0228068 -0.0213691 -0.0192546 -0.0177108 -0.0247934 -0.0247789 -0.0230263 -0.0248227 -0.0248068 -0.0127003 -0.0248248
internal_weight=0 707.409 2176.06 518.118 189.291 131.195 103.047 85.5583 72.1112 62.5777 1378.72 797.333 773.962 322.739 94.8433 67.9499 53.4279 451.223 233.433 217.79 217.182 165.578 51.6035 23.3706 16.3725 16.2512 66.9911 19.3392 58.0958 210.213 121.819 37.9349 227.896 1361.81 1173.81 187.993 168.128 88.3935 1154.06 1042.55 26.8934 39.6702 1019.92 29.1435 29.9242 47.6519 150.799 37.5887 168.38 153.009 55.0318 59.5158 83.8846 113.21 49.3691 111.509 51.811 25.4778 67.0214 28.1485 26.3332 16.6286 137.246 78.9922 85.9872 31.1347 15.3042 53.9859 34.653 48.7233 17.4884 29.8987 19.0116 10.1467 21.5754 32.5168 19.3329 8.44734 6.25272 25.3643 11.2357 10.8871 6.85688 15.2682 23.359 5.82735 10.0962 8.01068 307.905 205.991 18.6774 101.914 11.44 4.44177 90.4738
internal_count=11292 6760 4532 5791 969 624 460 263 243 222 1963 2569 2493 976 198 152 138 1517 872 645 817 592 225 76 59 55 176 46 345 1581 777 189 778 1926 1503 423 395 804 1471 1232 46 302 1198 199 111 130 469 105 537 379 338 241 588 364 178 239 330 186 144 164 144 126 423 164 235 114 128 372 302 502 197 216 170 63 172 75 70 67 62 286 135 46 61 178 216 64 108 78 4210 2811 157 1399 157 40 1242
cat_boundaries=0 1 2 3 4 5 6 7 8 9 10 11 12 13 14 15 16 17 18 19 20 21 22
cat_threshold=1 2 1 2 2 1 1 2 1 1 1 1 2 1 1 2 1 1 1 1 1 1
is_linear=0
shrinkage=0.05


Tree=51
num_leaves=84
num_cat=19
split_feature=2 3 2 2 1 2 0 3 3 2 2 2 2 2 3 2 2 2 3 1 3 3 3 3 2 2 1 2 2 2 2 2 2 1 0 2 2 3 2 3 1 1 2 3 3 3 2 2 2 2 2 0 2 2 2 2 2 2 2 1 3 2 2 2 2 1 3 2 3 2 3 2 0 3 2 2 0 1 1 0 1 0 1
split_gain=80.4926 11.8006 10.2369 7.0347 3.69356 3.85239 4.89645 3.06572 6.35291 3.07401 2.7024 2.21837 2.3169 3.96081 2.76755 2.63015 9.19252 2.33427 1.94747 5.97529 1.92146 2.22899 1.60204 1.39998 1.09664 4.31726 1.87995 1.00313 1.25726 0.919508 1.2188 0.894417 0.761535 0.734894 0.714141 0.708128 3.20165 0.686532 0.558508 0.230483 0.221478 0.160247 0.124336 0.119224 0.0989702 0.0909629 0.0903041 0.0859788 0.0850653 0.0759916 0.0756313 0.0591883 0.0436568 0.0362665 0.0720987 0.0349305 0.0344499 0.0232796 0.0162605 0.0142707 0.0126946 0.00838836 0.00794238 0.00697425 0.00581052 0.00539419 0.00468505 0.00409252 0.00382745 0.00378655 0.00266361 0.00185265 0.00182894 0.00142175 0.00101095 0.000558705 5.37882e-05 4.73499e-06 4.08763e-06 1.34477e-06 1.34894e-06 1.036e-06 5.43521e-08
threshold=15.500000000000002 1.0000000180025095e-35 92.500000000000014 1.0000000180025095e-35 0 7.5000000000000009 1 29.500000000000004 5.5000000000000009 4.5000000000000009 94.500000000000014 16.500000000000004 18.500000000000004 19.500000000000004 1.5000000000000002 43.500000000000007 41.500000000000007 74.500000000000014 1.5000000000000002 2 8.5000000000000018 10.500000000000002 86.500000000000014 1.5000000000000002 4.5000000000000009 6.5000000000000009 3 122.50000000000001 125.50000000000001 120.50000000000001 119.50000000000001 32.500000000000007 1.5000000000000002 4 5 150.50000000000003 151.50000000000003 31.500000000000004 5.5000000000000009 40.500000000000007 6 7 2.5000000000000004 8.5000000000000018 1.0000000180025095e-35 15.500000000000002 136.50000000000003 13.500000000000002 98.500000000000014 13.500000000000002 8.5000000000000018 8 10.500000000000002 13.500000000000002 7.5000000000000009 2.5000000000000004 2.5000000000000004 13.500000000000002 10.500000000000002 9 1.5000000000000002 14.500000000000002 8.5000000000000018 137.50000000000003 5.5000000000000009 10 1.5000000000000002 14.500000000000002 1.0000000180025095e-35 12.500000000000002 1.0000000180025095e-35 3.5000000000000004 11 2.5000000000000004 3.5000000000000004 5.5000000000000009 12 13 14 15 16 17 18
decision_type=2 2 2 2 1 2 9 2 2 2 2 2 2 2 2 2 2 2 2 1 2 2 2 2 2 2 1 2 2 2 2 2 2 1 9 2 2 2 2 2 1 1 2 2 2 2 2 2 2 2 2 9 2 2 2 2 2 2 2 1 2 2 2 2 2 1 2 2 2 2 2 2 9 2 2 2 9 1 1 9 1 9 1
left_child=1 3 11 76 5 6 7 8 9 -3 -4 18 45 23 15 16 -15 -17 19 -2 31 -22 39 -14 32 26 38 29 -29 30 40 -16 33 34 -5 44 -37 -38 -26 42 51 53 43 60 63 59 -46 52 -42 50 -44 -12 62 54 -27 72 66 58 -43 68 -6 -55 -7 -30 -58 71 -8 -59 -13 81 -61 -57 -34 -68 -67 -28 77 -1 -74 82 -81 -54 -78
right_child=2 4 10 24 22 47 56 -9 -10 -11 27 12 13 14 20 17 -18 -19 -20 -21 21 -23 -24 -25 25 41 75 28 35 -31 -32 -33 55 -35 -36 36 37 -39 -40 -41 48 57 49 -45 46 -47 -48 -49 -50 -51 -52 -53 69 61 -56 65 64 67 -60 70 -62 -63 -64 -65 -66 74 73 -69 -70 -71 -72 -73 78 -75 -76 -77 79 -79 -80 80 -82 -83 -84
leaf_value=-0.024770831554329072 0.041825878202074236 0.0010719593240660046 0.025770616371272231 -0.0038970991807117301 -0.023650593262874858 -0.018672720186245193 -0.023360844508066747 -0.013461374528119425 0.04956565546748426 0.028153067257811904 -4.7035542960205401e-05 -0.014652740725726657 0.010998949492907218 0.0019987349904379615 -0.013551075384163898 -0.0061939741503567181 0.040416373233935536 0.0050129989906239382 0.035681340163620699 -0.019778451787282297 0.018012775651464974 -0.0026771007030942512 0.018953596222889467 0.037976571400511271 0.015875368929439176 -0.020544282770433228 -0.01797450353642039 0.018856576677629321 0.0041452663921018188 -0.0076752297577420683 0.01714980524534878 -0.0059029804598833462 -0.02186677479910144 -0.023421480072563408 -0.023447725591182286 0.031829159473154948 0.0056508948205479751 0.008685268940553114 0.0021846671623916287 -0.0048596253712059898 0.0088013843771005459 -0.013367784452954596 -0.017208042244511099 -0.013114077106680208 7.4029412549934636e-05 -0.022279654387109622 0.0032979860631246125 -0.020248261951101992 0.0037981658325468913 -0.019812958380072077 -0.010366644690684377 0.0029801918884036758 -0.012570159024419181 -0.020315598331928163 -0.01540694142671541 -0.02124829944424228 -0.018869317781398727 -0.016009872641830448 -0.010372917357297876 -0.012094538815016069 -0.021128872300815241 -0.018095452826869873 -0.015578624950587292 0.0055523568425301286 -0.015730854796195879 -0.019581512215913408 -0.021966482525961589 -0.014054859578691393 -0.016346703024917 -0.010071713541163206 -0.013822631024008235 -0.020132444565425681 -0.023005278515650797 -0.020367258300692376 -0.018559953927236604 -0.017129575477615306 -0.024825326307571807 -0.024786297671561278 -0.022957616918537403 -0.024793111259656938 -0.024829264402335741 -0.012521541616646046 -0.024822368386744363
leaf_weight=112.74891784787178 6.5152874290943146 49.746403582394123 17.382555574178696 23.054734468460083 12.983592912554746 4.031867593526842 5.2832999527454394 13.265287190675734 10.059056252241133 13.275180056691168 64.512661933898926 6.3182318955659866 13.680592089891435 188.4727743268013 49.542775645852089 149.85085995495319 16.973149061203003 67.345213890075684 7.2693459987640372 9.9435666501522117 16.022135868668556 69.418717667460442 3.1253633797168723 7.4157924503087989 16.928442388772964 9.451488792896269 4.2292335182428351 20.142428070306778 16.625701487064362 19.710455626249313 15.393025398254393 167.37082877755165 4.5800872594118118 10.282583206892012 5.8577019497752216 12.503442108631132 781.89965325593948 244.75838738679886 13.303568936884405 3.2049122750759116 9.9725432693958265 11.136386387050157 9.173024304211145 3.8509647995233527 41.699096649885178 4.5383794903755179 45.334583818912506 12.585645280778406 57.363194346427917 9.513229623436926 7.2188484445214263 21.537337720394135 2.1386488899588585 12.508962884545328 24.618641152977943 6.9455820471048346 3.6832225248217574 5.5622507482767087 7.6427660807967177 4.4275091886520421 8.1069444864988309 6.4474782720208159 4.2713154032826424 18.724057674407959 2.4595644846558571 5.6836811751127243 3.3068801015615463 5.160405121743679 7.0613850802183151 2.3905481025576591 4.4923767149448395 8.0092236250638962 10.210992902517319 2.3972640037536621 4.2199545651674271 3.6408163607120514 68.140518449246883 88.200513884425163 8.0412193536758458 7.1100026369094831 4.0496917739510536 2.2470686212182036 20.114975593984127
leaf_count=1572 22 188 37 120 96 26 71 20 21 34 174 39 40 690 196 469 55 176 17 37 40 149 7 20 54 58 42 32 39 28 16 537 59 103 79 14 964 234 57 8 22 103 66 14 88 3 90 36 122 18 60 61 19 38 244 83 37 25 67 25 76 32 41 42 25 62 42 21 35 21 19 95 104 22 46 36 959 1239 53 100 57 21 283
internal_value=0 -0.0159374 0.00358621 -0.0199013 -0.00524715 -0.000623473 0.00380762 0.00865215 0.0126661 0.00677646 0.00617989 -0.000931269 -0.00139356 -0.000874361 -0.0014958 0.00111709 0.00517265 -0.00271907 0.0141275 0.00460781 -0.0051482 0.00120273 -0.015852 0.0204821 -0.0128217 -0.00973693 0.00418416 0.00593135 0.00647168 0.00254393 0.00373735 -0.0076498 -0.0171045 -0.0119411 -0.00785808 0.00625691 0.00668058 0.0063743 0.00985079 -0.0178646 0.00239134 -0.0161641 -0.0186843 -0.0212041 0.00265951 -0.0158272 0.00175334 -0.0171972 0.00453915 -0.0162582 -0.0141951 0.000710645 -0.0146507 -0.0178075 -0.0168321 -0.0213482 -0.0206115 -0.0132103 -0.0121489 -0.014514 -0.0226813 -0.0195605 -0.0170811 0.00489057 -0.0176127 -0.0200513 -0.022288 -0.015069 -0.0155468 -0.0116726 -0.0129649 -0.0206507 -0.0227601 -0.0212944 -0.0191462 -0.0175836 -0.0247925 -0.0247776 -0.0229843 -0.0248226 -0.0248062 -0.0125452 -0.0248247
internal_weight=0 696.199 2184.22 507.881 188.318 131.141 103.476 86.3459 73.0806 63.0216 1387.56 796.659 772.931 746.093 724.996 422.642 205.446 217.196 23.7282 16.4589 302.354 85.4409 57.1769 21.0964 207.516 120.63 38.1021 1370.18 1181.69 188.489 168.779 216.914 86.8858 39.195 28.9124 1161.54 1039.16 1026.66 30.232 54.0515 153.386 82.5284 50.8466 24.9415 122.383 26.8379 87.0337 27.6651 67.3357 25.9051 16.3919 86.05 15.0794 53.0266 34.0701 47.6907 17.1302 29.5018 18.7792 22.2995 21.0905 18.9564 8.30318 35.3498 6.14279 24.8584 10.9874 10.7227 13.3796 6.77627 8.91989 14.9548 22.8323 5.70414 9.90364 7.87005 300.365 200.949 18.2522 99.4152 11.1597 4.38572 88.2555
internal_count=11292 6760 4532 5791 969 624 460 263 243 222 1963 2569 2493 2372 2312 1390 745 645 76 59 922 189 345 60 1581 777 189 1926 1503 423 395 733 804 302 199 1471 1212 1198 111 338 379 588 330 186 259 121 178 164 144 144 126 235 128 372 302 502 197 216 170 118 172 70 67 81 62 286 135 46 74 61 44 178 216 64 108 78 4210 2811 157 1399 157 40 1242
cat_boundaries=0 1 2 3 4 5 6 7 8 9 10 11 12 13 14 15 16 17 18 19
cat_threshold=1 2 2 1 1 2 1 1 2 1 1 1 2 1 1 1 1 1 1
is_linear=0
shrinkage=0.05


Tree=52
num_leaves=85
num_cat=19
split_feature=2 3 2 2 1 2 0 3 3 2 3 2 2 2 3 2 2 2 3 3 3 1 3 3 2 2 1 2 2 2 2 2 2 2 1 0 2 2 3 2 3 1 1 2 3 3 3 2 2 2 2 2 0 2 2 2 2 2 2 2 1 3 2 2 2 2 1 3 2 3 2 3 2 0 3 2 2 0 1 1 0 1 0 1
split_gain=77.6164 11.6947 9.65164 7.08943 3.58912 3.71457 4.69462 2.89169 5.66568 2.472 2.21328 2.08088 2.24411 3.69657 2.64618 2.49129 8.32516 2.23006 1.84856 2.08412 1.75344 5.53182 1.54657 1.23978 1.0854 4.19633 1.79457 0.954579 0.939694 1.15757 0.87569 1.13175 0.874276 0.761976 0.7301 0.70385 0.662778 2.90752 0.639214 0.51623 0.228562 0.208981 0.159837 0.12514 0.120099 0.09323 0.0912297 0.086183 0.0854289 0.0794905 0.076032 0.0750282 0.0560767 0.04338 0.0364295 0.0723212 0.0354403 0.0348251 0.0230627 0.0160354 0.0141748 0.0129225 0.00845812 0.00795522 0.00653439 0.00582505 0.0054493 0.00476671 0.00407366 0.00381522 0.00372812 0.00263468 0.00187568 0.00186206 0.00144173 0.00101866 0.000560369 5.51362e-05 4.85172e-06 4.16754e-06 1.37846e-06 1.38295e-06 1.02346e-06 5.56539e-08
threshold=15.500000000000002 1.0000000180025095e-35 92.500000000000014 1.0000000180025095e-35 0 7.5000000000000009 1 29.500000000000004 2.5000000000000004 94.500000000000014 6.5000000000000009 16.500000000000004 18.500000000000004 19.500000000000004 1.5000000000000002 43.500000000000007 41.500000000000007 75.500000000000014 8.5000000000000018 10.500000000000002 1.5000000000000002 2 86.500000000000014 1.5000000000000002 4.5000000000000009 6.5000000000000009 3 1.0000000180025095e-35 122.50000000000001 125.50000000000001 120.50000000000001 119.50000000000001 32.500000000000007 1.5000000000000002 4 5 150.50000000000003 151.50000000000003 31.500000000000004 5.5000000000000009 40.500000000000007 6 7 2.5000000000000004 8.5000000000000018 1.0000000180025095e-35 15.500000000000002 13.500000000000002 136.50000000000003 98.500000000000014 13.500000000000002 8.5000000000000018 8 10.500000000000002 13.500000000000002 7.5000000000000009 2.5000000000000004 2.5000000000000004 13.500000000000002 10.500000000000002 9 1.5000000000000002 14.500000000000002 8.5000000000000018 137.50000000000003 5.5000000000000009 10 1.5000000000000002 14.500000000000002 1.0000000180025095e-35 12.500000000000002 1.0000000180025095e-35 3.5000000000000004 11 2.5000000000000004 3.5000000000000004 5.5000000000000009 12 13 14 15 16 17 18
decision_type=2 2 2 2 1 2 9 2 2 2 2 2 2 2 2 2 2 2 2 2 2 1 2 2 2 2 1 2 2 2 2 2 2 2 1 9 2 2 2 2 2 1 1 2 2 2 2 2 2 2 2 2 9 2 2 2 2 2 2 2 1 2 2 2 2 2 1 2 2 2 2 2 2 9 2 2 2 9 1 1 9 1 9 1
left_child=1 3 11 77 5 6 7 8 27 -4 -10 20 46 23 15 16 -15 -17 32 -20 21 -2 40 -14 33 26 39 -3 30 -30 31 41 -16 34 35 -5 45 -38 -39 -26 43 52 54 44 61 64 60 53 -47 -43 51 -45 -11 63 55 -27 73 67 59 -44 69 -6 -56 -7 -31 -59 72 -8 -60 -13 82 -62 -58 -35 -69 -68 -28 78 -1 -75 83 -82 -55 -79
right_child=2 4 9 24 22 47 57 -9 10 28 -12 12 13 14 18 17 -18 -19 19 -21 -22 -23 -24 -25 25 42 76 -29 29 36 -32 -33 -34 56 -36 -37 37 38 -40 -41 -42 49 58 50 -46 48 -48 -49 -50 -51 -52 -53 -54 70 62 -57 66 65 68 -61 71 -63 -64 -65 -66 -67 75 74 -70 -71 -72 -73 -74 79 -76 -77 -78 80 -80 -81 81 -83 -84 -85
leaf_value=-0.0247693673217593 0.039095469781457774 0.0088444970223596885 0.024483285900945548 -0.0038153637987372729 -0.023622384770745158 -0.018556681166914123 -0.023326138462651025 -0.013307312295830818 0.054775480975148998 -4.5869845009094764e-05 0.0198244783771502 -0.014502529148265709 0.010607036857663062 0.0019451661465755569 -0.013397203621232312 -0.0060051310116261865 0.037831960267962164 0.0050331791565469504 0.017247980403958793 -0.0026177174525645452 0.033560306738182423 -0.019677560532637618 0.018131568562525339 0.035636142554327829 0.015234268384129043 -0.020455339645248802 -0.017850177852246577 -0.0051013742360997913 0.018040529708079314 0.004025407877069012 -0.0075430619800569785 0.016436012110344133 -0.0057909285324642323 -0.021801281367380864 -0.023388117785530616 -0.023414948816251235 0.030054170926125584 0.0054791404040230255 0.008395446593322687 0.0021257135916036107 -0.0047623443059843541 0.0085066871787653989 -0.013213540781797165 -0.017075761180397261 -0.012959431037158292 7.2185899989302702e-05 -0.022222212933583261 -0.020154559053652779 0.0032053756593910286 0.003689640278345974 -0.019712579775464093 -0.010215936323753505 0.0028974377999143558 -0.012415087575819918 -0.020222962925389901 -0.015260648519734677 -0.021171395149830047 -0.01875578968072654 -0.015867539393185425 -0.010222182418374699 -0.011939582868206055 -0.021049855668661927 -0.017972492664072189 -0.015433384432171971 0.0053841346747142468 -0.015586597153848351 -0.019477740643127728 -0.021902901619279783 -0.01390235747945706 -0.016206901519180996 -0.009922328817140065 -0.013669433980488331 -0.020036927246282147 -0.02291414956348627 -0.020275447447241621 -0.01844250971555636 -0.016996547285746958 -0.024825227410428165 -0.024785218095546981 -0.022962830916595088 -0.024792203810318728 -0.024829266889881629 -0.012366461198775186 -0.024822196894807805
leaf_weight=109.99034026265144 6.7935743033885956 37.662800580263138 17.836336702108383 22.965062856674194 12.680125899612909 3.9572800844907778 5.1613077297806758 13.087914794683455 8.638228118419649 64.509627461433411 9.5231989026069623 6.2263273447751999 13.831895038485529 188.84985767304897 48.875945821404457 150.94997900724411 17.673193424940109 65.659239530563354 16.313353911042213 69.233126252889633 7.5334089249372473 9.7488303780555778 3.1851651966571799 7.7028347104787818 17.199332013726234 9.2592960596084577 4.1538944244384757 18.199961960315704 20.525848835706711 16.694762200117111 19.559752523899078 15.659289896488188 166.38575229048729 4.4810225516557693 10.044548615813254 5.7219499647617367 12.907817363739012 786.33059006929398 246.89343816041946 13.33266467601061 3.1893754303455344 10.060702621936796 10.988508239388471 9.0165248513221794 3.8007927760481826 41.702183663845062 4.4383839368820182 12.333370618522165 45.484343379735947 57.581483960151672 9.3265993446111661 7.144399642944335 21.601618856191635 2.1119339689612389 12.257399678230287 24.242249853909016 6.7995573133230209 3.6143742948770514 5.4739087820053083 7.5638980492949477 4.3742830902338063 7.9374506920576087 6.3318573832511893 4.2052897736430168 18.82830947637558 2.4211761727929115 5.5734686851501465 3.2350315898656845 5.0883838310837746 6.9468930810689926 2.3665920346975327 4.4307074099779129 7.8495908379554749 7.8587157279253006 2.3489321917295456 4.1423546075820923 3.5789817869663239 66.469735257327557 86.041218437254429 9.9787675738334709 6.9358907639980298 3.9503787830471992 2.2191072702407828 19.621819399297237
leaf_count=1572 22 128 37 120 96 26 71 20 30 174 19 39 40 690 196 475 55 170 40 149 17 37 7 20 54 58 42 66 32 39 28 16 537 59 103 79 14 964 234 57 8 22 103 66 14 88 3 36 90 122 18 60 61 19 38 244 83 37 25 67 25 76 32 41 42 25 62 42 21 35 21 19 95 53 22 46 36 959 1239 104 100 57 21 283
internal_value=0 -0.0157955 0.00348347 -0.0198025 -0.00514774 -0.000613363 0.00369275 0.00835767 0.0121882 0.0059885 0.0364484 -0.000910512 -0.00136201 -0.000854513 -0.00146177 0.00108703 0.00501618 -0.00265917 -0.00504703 0.00117059 0.013565 0.00445913 -0.015709 0.0195598 -0.0126675 -0.00959038 0.00406071 0.00430096 0.00574917 0.00626956 0.00247393 0.00363045 -0.00751796 -0.0169715 -0.0117868 -0.00772472 0.00606285 0.00647063 0.006176 0.00951005 -0.0177391 0.00232625 -0.0160229 -0.0185685 -0.0211264 0.00258645 -0.0156836 -0.0170648 0.00170674 0.0044061 -0.0161178 -0.0140432 0.00069248 -0.0145005 -0.0176813 -0.0166964 -0.0212731 -0.0205237 -0.0130558 -0.011994 -0.0143632 -0.022632 -0.0194564 -0.0169476 0.00474557 -0.0174845 -0.0199545 -0.0222308 -0.0149208 -0.0154013 -0.0115182 -0.0128101 -0.0205635 -0.0227125 -0.0212183 -0.0190364 -0.0174551 -0.0247916 -0.0247763 -0.0229414 -0.0248224 -0.0248057 -0.0123902 -0.0248245
internal_weight=0 685.262 2192.14 497.895 187.367 131.087 103.893 87.1121 74.0242 1396.18 18.1614 795.968 771.892 745.475 723.94 423.132 206.523 216.609 300.808 85.5465 24.0758 16.5424 56.2804 21.5347 204.885 119.47 38.2649 55.8628 1378.34 1189.37 188.972 169.413 215.262 85.415 38.7316 28.687 1168.84 1046.13 1033.22 30.532 53.0953 153.753 81.2055 49.9059 24.4184 122.71 26.4166 27.1936 87.1865 67.6422 25.4875 16.1609 86.1112 14.8602 52.0908 33.5015 46.6835 16.7808 29.1147 18.5524 21.9782 20.6176 18.5893 8.16257 35.5231 6.03555 24.365 10.7453 10.5623 13.1732 6.69763 8.80499 14.6491 22.3185 5.58396 9.71582 7.73288 293.009 196.032 17.8375 96.9778 10.8863 4.33104 86.0916
internal_count=11292 6760 4532 5791 969 624 460 263 243 1963 49 2569 2493 2372 2312 1390 745 645 922 189 76 59 345 60 1581 777 189 194 1926 1503 423 395 733 804 302 199 1471 1212 1198 111 338 379 588 330 186 259 121 164 178 144 144 126 235 128 372 302 502 197 216 170 118 172 70 67 81 62 286 135 46 74 61 44 178 216 64 108 78 4210 2811 157 1399 157 40 1242
cat_boundaries=0 1 2 3 4 5 6 7 8 9 10 11 12 13 14 15 16 17 18 19
cat_threshold=1 2 2 1 1 2 1 1 2 1 1 1 2 1 2 1 1 1 1
is_linear=0
shrinkage=0.05


Tree=53
num_leaves=84
num_cat=20
split_feature=2 3 2 2 1 2 0 3 3 2 2 2 2 2 3 2 2 2 3 3 3 1 3 1 2 2 1 2 2 2 2 2 2 1 0 2 2 2 2 3 1 1 2 3 3 3 2 2 2 2 2 0 2 2 2 2 2 2 2 1 3 2 2 2 2 1 3 2 3 2 3 2 0 3 2 2 0 1 1 0 1 0 1
split_gain=74.8385 11.586 9.10223 7.14277 3.48683 3.58166 4.50267 2.72931 5.37582 2.80348 2.26511 1.95316 2.1732 3.45312 2.5299 2.36014 7.56135 2.12984 1.77808 1.95014 1.5833 5.13575 1.49386 1.11637 1.07381 4.07814 1.71365 0.88067 1.06711 0.854246 0.833998 1.05187 0.762139 0.725105 0.693535 0.620636 2.64637 0.621326 0.477659 0.22677 0.197234 0.159361 0.136212 0.100245 0.091465 0.0878463 0.0863551 0.0808285 0.0760423 0.0743974 0.0743218 0.053134 0.043086 0.0365799 0.0725174 0.0359496 0.0351947 0.0228373 0.0158062 0.0140731 0.0131525 0.00852573 0.00796492 0.00612498 0.00583736 0.00550335 0.00484896 0.00405307 0.00380137 0.00366889 0.00260486 0.00189851 0.00189548 0.00146166 0.00102608 0.000561822 5.65187e-05 4.97254e-06 4.24784e-06 1.41306e-06 1.41761e-06 1.0106e-06 5.70866e-08
threshold=15.500000000000002 1.0000000180025095e-35 92.500000000000014 1.0000000180025095e-35 0 7.5000000000000009 1 29.500000000000004 5.5000000000000009 4.5000000000000009 94.500000000000014 16.500000000000004 18.500000000000004 19.500000000000004 1.5000000000000002 43.500000000000007 41.500000000000007 74.500000000000014 8.5000000000000018 10.500000000000002 1.5000000000000002 2 86.500000000000014 3 4.5000000000000009 6.5000000000000009 4 122.50000000000001 125.50000000000001 32.500000000000007 120.50000000000001 119.50000000000001 1.5000000000000002 5 6 150.50000000000003 151.50000000000003 204.50000000000003 5.5000000000000009 31.500000000000004 7 8 2.5000000000000004 8.5000000000000018 15.500000000000002 1.0000000180025095e-35 13.500000000000002 136.50000000000003 13.500000000000002 8.5000000000000018 98.500000000000014 9 10.500000000000002 13.500000000000002 7.5000000000000009 2.5000000000000004 2.5000000000000004 13.500000000000002 10.500000000000002 10 1.5000000000000002 14.500000000000002 8.5000000000000018 137.50000000000003 5.5000000000000009 11 1.5000000000000002 14.500000000000002 1.0000000180025095e-35 12.500000000000002 1.0000000180025095e-35 3.5000000000000004 12 2.5000000000000004 3.5000000000000004 5.5000000000000009 13 14 15 16 17 18 19
decision_type=2 2 2 2 1 2 9 2 2 2 2 2 2 2 2 2 2 2 2 2 2 1 2 1 2 2 1 2 2 2 2 2 2 1 9 2 2 2 2 2 1 1 2 2 2 2 2 2 2 2 2 9 2 2 2 2 2 2 2 1 2 2 2 2 2 1 2 2 2 2 2 2 9 2 2 2 9 1 1 9 1 9 1
left_child=1 3 11 76 5 6 7 8 9 -3 -4 20 44 23 15 16 -15 -17 29 -20 21 -2 39 -14 32 26 38 30 -29 -16 31 40 33 34 -5 45 -37 -38 -26 42 51 53 43 60 59 63 52 -47 49 -44 -42 -12 62 54 -27 72 66 58 -43 68 -6 -55 -7 -30 -58 71 -8 -59 -13 81 -61 -57 -34 -68 -67 -28 77 -1 -74 82 -81 -54 -78
right_child=2 4 10 24 22 46 56 -9 -10 -11 27 12 13 14 18 17 -18 -19 19 -21 -22 -23 -24 -25 25 41 75 28 35 -31 -32 -33 55 -35 -36 36 37 -39 -40 -41 50 57 48 -45 -46 47 -48 -49 -50 -51 -52 -53 69 61 -56 65 64 67 -60 70 -62 -63 -64 -65 -66 74 73 -69 -70 -71 -72 -73 78 -75 -76 -77 79 -79 -80 80 -82 -83 -84
leaf_value=-0.024767864980856751 0.03664452547902701 0.00076406824492966478 0.023290612616396394 -0.003735034720857117 -0.023593536038114191 -0.018439195725764201 -0.023290663485387098 -0.013152960849329258 0.044334738084225611 0.026217597394835479 -4.4733025095152593e-05 -0.014351673412592381 0.010037015414993798 0.0018931361025381198 -0.013243015473017856 -0.0059652479376588107 0.035505645496756992 0.0047244034997663839 0.016528453994635203 -0.0025594979979176886 0.031633252312479675 -0.019575182686128449 0.01735964028421404 0.033371633125211471 0.014628557325886582 -0.020364948316210052 -0.017724481683725351 0.017274070150665847 0.0039094896777209032 -0.0056803590603405783 -0.0074121780468910121 0.015763318376810564 -0.02173454186495441 -0.023354014920718813 -0.023381442285855564 0.02842923274996885 0.0036634840791443303 0.0066286520066964399 0.0020684761706312358 -0.0058144359802160348 0.0082243111704959453 -0.013059037635242444 -0.01694222727867218 -0.012987865329713659 -0.022163629401829713 7.0388441937564714e-05 -0.02005938654305179 0.0031156579880730877 -0.019610715801324431 -0.010065882139449438 0.003584609696119425 0.0028172176694266121 -0.012260003564614277 -0.020128862157818058 -0.01511350500320674 -0.021093127031352799 -0.018640801766823308 -0.015724205046996603 -0.010072100243738179 -0.011784762973311035 -0.020969456324618069 -0.017848145624854605 -0.015287249153011601 0.0052218988095038468 -0.015441406871859379 -0.019372482994826676 -0.021838099963447027 -0.013749386713029488 -0.016066021490055926 -0.0097736809095231303 -0.013515837871314985 -0.019939935533213559 -0.022919476228000162 -0.020182174162835482 -0.018323629464697969 -0.016862280121763922 -0.024825126474742897 -0.02478411194231565 -0.022869761275567481 -0.024791273961355709 -0.024829267206740085 -0.012211383300047188 -0.024822018869010021
leaf_weight=107.29941299557686 7.06443190574646 50.344858974218369 18.27841854095459 22.877610325813293 12.384101204574113 3.8845233023166674 5.0423078089952487 12.91490402817726 10.819829076528547 13.778515577316282 64.50666880607605 6.1366816982626915 13.811366483569145 189.21755999326706 48.225511386990547 148.03391921520233 18.354613587260246 68.002849787473679 16.59716685116291 69.052129879593849 7.7905228286981574 9.5588725209236198 3.2434439957141867 8.1503083258867264 17.463356912136078 9.0718179047107679 4.080404505133628 20.899506509304047 16.762100547552109 165.42500905692577 19.412767171859741 15.918792665004728 4.3843878656625748 9.812351390719412 5.5895270779728916 13.301639616489409 225.64380007982254 813.98197561502457 13.361035354435446 3.7780082821845999 10.146651089191435 10.844266332685953 8.8638678714633006 3.1480688080191603 4.3408411443233481 41.705194056034088 12.087285198271273 45.630371421575546 9.1445482075214368 7.0717845186591139 57.794330835342407 21.664299011230469 2.0858762189745903 12.012007936835291 23.875106304883957 6.6571144834160805 3.5472156181931487 5.3877367973327619 7.4869724214076987 4.3223665207624471 7.772114746272563 6.2190746217966071 4.1408862322568893 18.929957032203674 2.3837308511137962 5.4659605473279953 3.16494520008564 5.0181327760219574 6.835212804377079 2.3432260677218437 4.3705542981624603 7.693874180316925 9.7522377669811249 2.3017861172556877 4.0666593015193939 3.5186655521392822 64.839922107756138 83.934882782399654 7.6806868910789534 6.7660488188266736 3.8535013496875763 2.1918337866663924 19.140757642686367
leaf_count=1572 22 188 37 120 96 26 71 20 21 34 174 39 35 690 196 469 55 176 40 149 17 37 7 25 54 58 42 32 39 537 28 16 59 103 79 14 394 804 57 9 22 103 66 13 3 88 36 90 18 60 122 61 19 38 244 83 37 25 67 25 76 32 41 42 25 62 42 21 35 21 19 95 104 22 46 36 959 1239 53 100 57 21 283
internal_value=0 -0.0156526 0.00338408 -0.0197022 -0.00504964 -0.00060324 0.00358195 0.00807588 0.0117342 0.0062334 0.00580419 -0.000890131 -0.00133109 -0.000835049 -0.00142842 0.00105786 0.00486533 -0.00260042 -0.00494734 0.00113938 0.0130334 0.0043166 -0.0155651 0.0186968 -0.0125132 -0.00944464 0.00394147 0.00557363 0.00607501 -0.00738741 0.00240604 0.00352701 -0.0168373 -0.0116328 -0.00759261 0.00587598 0.00626862 0.00598508 0.00918431 -0.0176123 0.00226307 -0.0158807 -0.0185336 -0.0212857 -0.0155391 0.00251558 -0.0169313 0.00166146 -0.0159763 -0.0138907 0.00427753 0.000674792 -0.0143497 -0.0175538 -0.0165595 -0.0211966 -0.0204344 -0.0129011 -0.0118391 -0.0142118 -0.0225817 -0.0193509 -0.0168129 0.00460555 -0.0173549 -0.0198563 -0.0221724 -0.0147719 -0.015255 -0.011364 -0.0126551 -0.0204749 -0.0226639 -0.0211409 -0.018925 -0.0173252 -0.0247906 -0.024775 -0.0228976 -0.0248222 -0.0248051 -0.0122351 -0.0248244
internal_weight=0 674.591 2199.87 488.154 186.438 131.032 104.298 87.8581 74.9432 64.1234 1404.58 795.29 770.876 744.87 722.909 423.609 207.572 216.037 299.3 85.6493 24.4138 16.6233 55.4059 21.9617 202.319 118.339 38.4235 1386.3 1196.85 213.651 189.444 170.031 83.9804 38.2795 28.4671 1175.96 1052.93 1039.63 30.8244 52.1625 154.112 79.9151 48.3845 23.3043 26.0057 123.028 26.7336 87.3356 25.0802 15.9357 67.941 86.171 14.6463 51.178 32.9469 45.7009 16.44 28.7371 18.3312 21.6648 20.1562 18.2311 8.02541 35.6921 5.93095 23.8836 10.509 10.4059 12.9719 6.62094 8.69292 14.351 21.8173 5.46673 9.53262 7.59907 285.835 191.234 17.4329 94.6002 10.6196 4.27771 83.9807
internal_count=11292 6760 4532 5791 969 624 460 263 243 222 1963 2569 2493 2372 2312 1390 745 645 922 189 76 59 345 60 1581 777 189 1926 1503 733 423 395 804 302 199 1471 1212 1198 111 338 379 588 329 185 121 259 164 178 144 126 144 235 128 372 302 502 197 216 170 118 172 70 67 81 62 286 135 46 74 61 44 178 216 64 108 78 4210 2811 157 1399 157 40 1242
cat_boundaries=0 1 2 3 4 5 6 7 8 9 10 11 12 13 14 15 16 17 18 19 20
cat_threshold=1 2 2 1 1 1 2 1 1 2 1 1 1 2 1 1 1 1 1 1
is_linear=0
shrinkage=0.05


Tree=54
num_leaves=109
num_cat=22
split_feature=2 3 2 2 1 2 0 3 3 2 2 2 3 3 3 3 2 1 2 2 2 2 1 3 2 2 1 1 3 2 3 2 2 3 3 2 2 1 2 0 2 3 3 2 3 2 2 2 3 2 0 1 3 3 2 3 2 3 3 2 1 2 3 3 2 2 2 2 2 2 2 2 2 2 2 2 2 2 2 0 2 1 3 2 3 2 3 2 2 2 2 1 2 3 2 2 0 2 3 2 2 0 1 1 0 1 0 1
split_gain=72.1554 11.4746 8.60221 7.19468 3.38667 3.4535 4.32 2.57764 4.79581 2.57691 2.3241 5.35478 3.10312 2.67895 5.85463 5.28532 7.54409 2.22013 6.67197 4.22402 3.71384 2.39503 1.45463 1.44366 1.06189 3.96264 1.63691 0.85883 1.25283 0.794789 0.855074 1.74581 1.11004 1.0793 3.07799 2.37552 0.762022 0.719912 0.69431 0.683202 0.519431 0.63944 2.37116 0.472893 0.452296 0.442417 0.383627 0.331045 0.297525 0.280896 0.251312 0.261827 0.225072 0.195298 0.186827 0.1804 0.165528 0.161215 1.16155 0.356841 0.158818 0.126675 0.121571 0.098001 0.152734 0.102653 0.0961074 0.175176 0.0958826 0.0864944 0.0760223 0.0737395 0.0601141 0.054702 0.0427751 0.0367172 0.0726868 0.0364581 0.0355583 0.0240349 0.0226036 0.0225321 0.02035 0.015573 0.0133845 0.0130971 0.0123942 0.0220981 0.00859108 0.00797144 0.0058474 0.00555628 0.00545434 0.0049318 0.00403078 0.00360893 0.0019292 0.0019211 0.0014815 0.00103321 0.000563057 5.7928e-05 5.09589e-06 4.32936e-06 1.44852e-06 1.45315e-06 9.97417e-07 5.85549e-08
threshold=15.500000000000002 1.0000000180025095e-35 78.500000000000014 1.0000000180025095e-35 0 7.5000000000000009 1 29.500000000000004 5.5000000000000009 4.5000000000000009 43.500000000000007 41.500000000000007 1.5000000000000002 1.0000000180025095e-35 6.5000000000000009 23.500000000000004 19.500000000000004 2 26.500000000000004 21.500000000000004 22.500000000000004 22.500000000000004 3 86.500000000000014 4.5000000000000009 6.5000000000000009 4 5 1.5000000000000002 204.50000000000003 9.5000000000000018 81.500000000000014 87.500000000000014 5.5000000000000009 2.5000000000000004 92.500000000000014 1.5000000000000002 6 80.500000000000014 7 208.50000000000003 31.500000000000004 35.500000000000007 27.500000000000004 151.50000000000003 5.5000000000000009 736.00000000000011 155.50000000000003 26.500000000000004 160.50000000000003 8 9 40.500000000000007 1.0000000180025095e-35 316.50000000000006 8.5000000000000018 68.500000000000014 1.5000000000000002 2.5000000000000004 248.50000000000003 10 2.5000000000000004 8.5000000000000018 3.5000000000000004 48.500000000000007 64.500000000000014 150.50000000000003 138.50000000000003 29.500000000000004 13.500000000000002 13.500000000000002 8.5000000000000018 46.500000000000007 170.50000000000003 10.500000000000002 13.500000000000002 7.5000000000000009 2.5000000000000004 2.5000000000000004 11 13.500000000000002 12 1.0000000180025095e-35 10.500000000000002 1.5000000000000002 182.50000000000003 4.5000000000000009 60.500000000000007 14.500000000000002 8.5000000000000018 5.5000000000000009 13 57.500000000000007 1.5000000000000002 14.500000000000002 12.500000000000002 14 3.5000000000000004 2.5000000000000004 3.5000000000000004 5.5000000000000009 15 16 17 18 19 20 21
decision_type=2 2 2 2 1 2 9 2 2 2 2 2 2 2 2 2 2 1 2 2 2 2 1 2 2 2 1 1 2 2 2 2 2 2 2 2 2 1 2 9 2 2 2 2 2 2 2 2 2 2 9 1 2 2 2 2 2 2 2 2 1 2 2 2 2 2 2 2 2 2 2 2 2 2 2 2 2 2 2 9 2 1 2 2 2 2 2 2 2 2 2 1 2 2 2 2 9 2 2 2 2 9 1 1 9 1 9 1
left_child=1 3 10 101 5 6 7 8 9 -3 11 13 22 17 27 16 -16 19 20 79 -19 -21 -13 52 36 26 45 43 -29 30 31 38 -32 34 53 -36 37 39 -4 -5 -31 46 -43 -15 54 -26 57 55 50 66 81 63 61 -33 -44 -35 72 59 -59 -42 75 62 84 64 -52 -65 67 -34 -20 74 71 -63 -53 -51 89 76 -27 96 93 -2 83 86 -58 -62 -6 -75 87 -12 -77 -7 -80 97 -83 -8 -82 106 -38 -79 -95 -93 -28 102 -1 -98 107 -106 -76 -103
right_child=2 4 29 24 23 69 78 -9 -10 -11 48 12 -14 14 15 -17 -18 18 68 21 -22 -23 -24 -25 25 60 100 28 -30 40 32 33 49 47 35 -37 77 -39 -40 -41 41 42 44 -45 -46 -47 -48 -49 -50 73 51 56 -54 -55 -56 -57 82 58 -60 -61 80 70 -64 65 -66 -67 -68 -69 -70 -71 -72 -73 -74 85 95 88 -78 91 90 -81 94 92 -84 -85 -86 -87 -88 -89 -90 -91 -92 99 -94 98 -96 -97 103 -99 -100 -101 -102 104 -104 -105 105 -107 -108 -109
leaf_value=-0.024766326384609211 -0.017295178292953833 0.00074452064070999963 0.010611388828741651 -0.0036561000147231231 -0.02356403433472597 -0.018320275393218618 -0.023254409278955293 -0.012998368889628565 0.041335350637335642 0.024896665244370744 -0.0043120287709318642 0.050837526777494237 -0.0070654705019622191 -0.0168617680538562 0.055219414632389031 -0.016675462511957406 0.0047688880349569087 0.013147079880917505 -0.012489637932285939 0.031774365170070672 0.045012946069927146 0.0025702344618464233 0.022434530270784563 0.016633577286100768 0.014055546681968806 -0.020273100721234533 -0.017597430282246852 0.0032508789089291724 -0.011926726836909372 0.013320821519627032 -0.011517785830121224 0.0020705663145881808 0.00044732421835166669 -0.0016393138926739576 -0.0054361579497334295 0.016349355136174984 -0.021666545020755684 -0.023319156046020237 0.025627053969339134 -0.023347193111471758 0.00024812558937012066 0.020905666639089548 0.0024576009210688561 -0.0091044446784615072 0.01108273558788837 0.0020128967321992246 0.0090093343717840366 0.0045667941349604368 0.0061821427594857007 0.0074298606625110789 -0.011211013572508005 -0.0013458425889627795 -0.0045489746230829853 0.0045506384376689064 0.0062580387660238134 -0.008426762361220981 0.0018389564018788857 0.014271731274971198 0.0044496833809209669 0.0049487988748477159 -0.012904321572101377 -0.016807464903597864 -0.012661508025311421 -0.002718826421581228 -0.0067569431910037836 -0.0081377324534921362 -0.0023946032269120234 0.0064063643274273989 -0.0058192493527231947 -0.019962739101848741 -0.019507365745799327 -0.0099165251664129293 -0.0054197492897268672 0.0029669988041157655 -0.01210495570713619 -0.020033289091899768 -0.014965550574838993 -0.021013483075131612 -0.018524361979304592 -0.013809559824642777 -0.015579902852645384 -0.00056390065013602649 -0.0011944315042731889 -0.0099227132587282572 -0.02088766327429175 0.00478034915572631 -0.00013178076655062532 -0.0010427327593056064 -0.017722426623187841 -0.015140257184539117 -0.015295320255780962 -0.019265741016498215 0.0015998805963264601 -0.02177205991524785 -0.013595992753344742 -0.0096258110625834347 -0.022824431951020911 -0.019841464841333797 -0.020087433482217004 -0.018203323530070894 -0.016726799605900938 -0.024825020768832744 -0.024782978651358943 -0.022875199458159901 -0.024790318559251918 -0.024829265308418891 -0.012056357188278216 -0.024821834146712702
leaf_weight=104.67447289824486 23.845941379666328 50.383340835571289 20.131598919630051 22.792321443557739 12.095336303114896 3.8135521113872546 4.9262258931994456 12.746146678924559 11.310315683484076 14.14453189074993 10.567376852035528 7.3429031670093536 6.3091076016426078 43.93270942568779 10.820674449205397 13.084228798747061 23.508444800972939 27.43207722902298 7.1093031018972423 7.7533749192953101 13.714834228157995 74.26248873770237 11.675110146403318 3.3002404272556296 17.720698922872543 8.8889393806457502 4.0087186768651 24.203290805220604 31.02537328004837 26.396611511707306 15.772305488586424 201.33212912082672 68.639248579740524 39.753490805625916 14.703453212976454 83.996733486652374 4.2901229783892632 9.585848927497862 12.465281277894972 5.4603514745831516 52.68070250749588 32.662871420383453 46.821508824825287 35.538820669054985 39.628823578357697 13.3887015581131 62.138443470001221 17.850268632173538 5.9786649942398062 17.546389132738113 25.084876626729965 10.60176110267639 3.1558198928832999 131.04870241880417 104.53988605737686 12.987976312637327 9.4073786735534686 34.269310534000397 247.44207626581192 172.81526786088943 10.703571140766149 8.7149591818451899 3.7077315524220458 22.669743731617928 82.700454354286194 14.222457095980642 19.318646252155304 15.034094631671904 22.242828920483589 11.847237549722193 8.9669643491506559 7.0009578093886367 62.069821506738663 15.716245651245115 2.0604595094919205 11.772637560963632 23.516982868313789 6.5181657001376152 3.4817051142454138 6.2397784516215351 5.3036816567182523 5.9076967984437925 13.41122594475746 7.4119414091110221 7.6108347475528708 27.175340235233307 5.999838411808013 10.117459654808043 6.1090604439377776 4.0780649334192276 2.3472054079174995 5.3610903918743134 5.7443121671676636 3.096578061580658 4.949608750641346 2.3204356357455254 7.5070246458053589 7.5419781282544136 2.2557967007160187 3.9928218722343445 3.4598302841186523 63.250078685581684 81.880196079611778 9.5312635153532081 6.6003724932670575 3.7590000182390213 2.1652311757206917 18.671495132148266
leaf_count=1572 104 188 34 120 96 26 71 20 21 34 45 18 24 179 14 16 65 96 25 21 33 279 37 7 54 58 42 67 104 26 22 435 143 89 34 158 59 103 22 79 68 30 56 179 27 57 36 32 17 31 79 34 8 272 79 19 24 36 273 173 103 66 14 98 284 39 27 28 94 36 18 60 159 28 19 38 244 83 37 39 25 21 37 67 76 46 23 35 32 41 25 62 19 42 21 21 53 95 22 46 36 959 1239 104 100 57 21 283
internal_value=0 -0.0155088 0.00328789 -0.0196004 -0.00495283 -0.000593086 0.00347509 0.00780612 0.0113027 0.00603868 -0.00141742 0.0010891 0.0233206 -0.000454737 -0.00474571 0.0103649 0.0206711 0.00382479 0.010777 -0.000547341 0.0237684 0.00533105 0.033401 -0.0154202 -0.0123589 -0.00929973 0.00382626 -0.0100645 -0.00527533 0.00535842 0.00413831 0.00514078 0.00114954 0.00441222 0.00535071 0.0131039 -0.0167019 -0.011479 0.0163535 -0.00746177 0.00642082 0.00619114 0.00845648 -0.0133928 0.00632744 0.00887269 0.00530125 -0.0013188 -0.004854 0.00237204 -0.00509091 -0.00569099 -0.0174842 0.00304839 0.00508243 -0.00331077 -0.00365891 0.00484697 0.0056445 0.00385062 -0.0157375 -0.018333 -0.0209676 -0.00703221 -0.00779354 -0.00480789 0.000784113 0.00151802 -0.00743487 -0.0167964 -0.0158338 -0.0137378 -0.00482542 0.00507801 -0.0141983 -0.017425 -0.0164214 -0.0211188 -0.0203437 -0.0165723 -0.0127462 -0.00133158 5.6137e-05 -0.0116844 -0.0225304 0.00411591 -0.00213258 -0.00271294 -0.0192438 -0.016677 -0.0172241 -0.0197566 0.00050282 -0.0221128 -0.0146222 -0.0112101 -0.0226142 -0.0203848 -0.0210621 -0.0188122 -0.0171941 -0.0247897 -0.0247736 -0.0228528 -0.0248221 -0.0248045 -0.0120801 -0.0248243
internal_weight=0 664.181 2207.39 478.651 185.53 130.977 104.692 88.5843 75.8382 64.5279 674.524 390.041 25.3271 364.714 182.114 47.4133 34.3291 182.601 70.499 112.102 41.1469 82.0159 19.018 54.5528 199.815 117.234 38.5779 134.7 55.2287 1532.87 713.472 534.27 179.202 501.673 431.081 98.7002 82.581 37.8385 32.5969 28.2527 819.396 792.999 223.653 79.4715 190.99 31.1094 569.346 70.5917 284.483 163.43 278.504 240.168 51.2526 332.381 151.361 52.7415 95.4902 507.207 281.711 225.496 78.6564 48.0968 23.4139 144.678 107.785 36.8922 102.992 83.6733 29.3521 26.285 24.6829 15.7159 72.6716 60.438 14.4377 50.2876 32.4059 44.7425 16.1075 30.0857 28.3688 38.3367 22.8186 18.1155 19.7062 42.8916 26.6847 20.6848 17.8817 7.89162 5.82891 23.4141 11.652 10.2786 10.2533 6.54613 21.3284 14.0601 5.35237 9.35391 7.46855 278.836 186.555 17.0383 92.2809 10.3594 4.22569 81.9216
internal_count=11292 6760 4532 5791 969 624 460 263 243 222 2308 1394 79 1315 624 95 79 691 248 443 129 300 55 345 1581 777 189 529 171 2224 1420 1095 325 1039 899 192 804 302 56 199 804 778 192 358 162 111 586 140 914 303 897 754 338 707 135 108 254 550 309 241 588 330 186 500 363 137 198 171 119 164 144 126 193 105 128 372 302 502 197 143 216 143 61 170 172 74 103 80 70 67 62 286 40 135 46 61 216 178 64 108 78 4210 2811 157 1399 157 40 1242
cat_boundaries=0 1 2 3 4 5 6 7 8 9 10 11 12 13 14 15 16 17 18 19 20 21 22
cat_threshold=1 2 1 2 1 1 1 2 1 1 1 2 1 1 1 2 1 2 1 1 1 1
is_linear=0
shrinkage=0.05


Tree=55
num_leaves=108
num_cat=23
split_feature=2 3 2 2 1 2 0 3 3 2 2 3 3 3 3 2 3 1 2 2 2 2 3 1 2 2 1 2 1 3 2 2 3 2 2 3 3 2 1 0 2 2 3 3 2 3 2 2 2 3 2 0 1 3 3 2 3 2 1 3 3 1 2 3 2 2 2 2 2 2 2 2 2 2 2 2 2 2 2 0 2 2 1 3 2 3 2 2 2 2 2 1 3 2 2 0 2 3 2 2 0 1 1 0 1 0 1
split_gain=69.5599 11.3604 8.12628 7.24511 3.28866 3.3299 4.14605 2.43582 4.30604 2.21869 4.96674 2.80561 2.55102 5.58761 4.95201 6.60424 2.15976 2.0797 6.17098 4.06546 3.24662 2.18678 1.39579 1.23936 1.04964 3.84975 1.56407 0.994835 0.840767 1.20841 0.761624 0.743886 0.804429 1.61663 1.06432 1.01756 2.86286 2.20493 0.714527 0.672859 0.625656 0.48107 0.595675 2.17401 0.467985 0.420355 0.410169 0.35777 0.314831 0.284006 0.264895 0.241945 0.25316 0.223241 0.1839 0.175188 0.173905 0.158761 0.158209 0.151069 1.07741 0.351359 0.137842 0.101635 0.0957361 0.128725 0.0935942 0.0914015 0.165167 0.0866006 0.0759719 0.0730552 0.0578419 0.0511453 0.0424475 0.0369653 0.0368411 0.0728289 0.0359155 0.0239853 0.022362 0.0216662 0.0211195 0.0193381 0.0153361 0.0136182 0.0123053 0.0106819 0.00865407 0.00797474 0.00585515 0.00560801 0.00501516 0.00400681 0.00354831 0.00196319 0.00194344 0.00150126 0.00104004 0.000564071 5.93819e-05 5.2236e-06 4.41235e-06 1.48488e-06 1.48958e-06 9.8398e-07 6.00601e-08
threshold=15.500000000000002 1.0000000180025095e-35 78.500000000000014 1.0000000180025095e-35 0 7.5000000000000009 1 29.500000000000004 2.5000000000000004 43.500000000000007 41.500000000000007 1.5000000000000002 1.0000000180025095e-35 6.5000000000000009 23.500000000000004 19.500000000000004 6.5000000000000009 2 26.500000000000004 21.500000000000004 22.500000000000004 22.500000000000004 86.500000000000014 3 4.5000000000000009 6.5000000000000009 4 1.0000000180025095e-35 5 1.5000000000000002 1.5000000000000002 204.50000000000003 9.5000000000000018 81.500000000000014 87.500000000000014 5.5000000000000009 2.5000000000000004 92.500000000000014 6 7 80.500000000000014 208.50000000000003 31.500000000000004 35.500000000000007 27.500000000000004 151.50000000000003 5.5000000000000009 736.00000000000011 155.50000000000003 26.500000000000004 160.50000000000003 8 9 31.500000000000004 1.0000000180025095e-35 316.50000000000006 8.5000000000000018 68.500000000000014 10 1.5000000000000002 2.5000000000000004 11 2.5000000000000004 8.5000000000000018 75.500000000000014 64.500000000000014 29.500000000000004 150.50000000000003 138.50000000000003 13.500000000000002 13.500000000000002 8.5000000000000018 46.500000000000007 170.50000000000003 10.500000000000002 2.5000000000000004 13.500000000000002 7.5000000000000009 2.5000000000000004 12 13.500000000000002 49.500000000000007 13 1.0000000180025095e-35 10.500000000000002 1.5000000000000002 182.50000000000003 66.500000000000014 14.500000000000002 8.5000000000000018 5.5000000000000009 14 1.5000000000000002 14.500000000000002 12.500000000000002 15 3.5000000000000004 2.5000000000000004 3.5000000000000004 5.5000000000000009 16 17 18 19 20 21 22
decision_type=2 2 2 2 1 2 9 2 2 2 2 2 2 2 2 2 2 1 2 2 2 2 2 1 2 2 1 2 1 2 2 2 2 2 2 2 2 2 1 9 2 2 2 2 2 2 2 2 2 2 2 9 1 2 2 2 2 2 1 2 2 1 2 2 2 2 2 2 2 2 2 2 2 2 2 2 2 2 2 9 2 2 1 2 2 2 2 2 2 2 2 1 2 2 2 9 2 2 2 2 9 1 1 9 1 9 1
left_child=1 3 9 100 5 6 7 8 27 10 12 23 17 28 15 -15 -10 19 20 79 -19 -21 53 -12 30 26 46 -3 44 -30 38 32 33 40 -34 36 54 -38 39 -5 -4 -33 47 -44 -14 55 -26 59 56 51 67 81 64 62 -35 -45 -37 72 76 61 -61 -43 63 85 65 -53 -20 68 -36 74 71 -64 -54 -52 89 95 77 -27 92 -2 84 -11 87 -59 -60 -6 -75 -83 -78 -7 -80 96 -8 -82 105 -32 -77 -94 -93 -28 101 -1 -97 106 -105 -76 -102
right_child=2 4 31 24 22 69 78 -9 16 49 11 -13 13 14 -16 -17 -18 18 66 21 -22 -23 -24 -25 25 58 99 -29 29 -31 75 41 34 35 50 48 37 -39 -40 -41 -42 42 43 45 -46 -47 -48 -49 -50 -51 73 52 57 -55 -56 -57 -58 83 80 60 -62 -63 70 -65 -66 -67 -68 -69 -70 -71 -72 -73 -74 86 94 91 88 -79 90 -81 93 82 -84 -85 -86 -87 -88 -89 -90 -91 -92 98 97 -95 -96 102 -98 -99 -100 -101 103 -103 -104 104 -106 -107 -108
leaf_value=-0.024764747998982841 -0.017163742056643439 0.0084976683682965477 0.010237302662678279 -0.0035785469895381369 -0.023533865512214685 -0.018199929295730926 -0.023217355891429849 -0.012843583123565342 0.048282133422512516 -0.0037849671424655842 0.047086956315928928 -0.0069395162411667495 -0.01672628298229371 0.050919001760913442 -0.016538353659602736 0.0046280738968257238 0.015353717383501393 0.012651068651506781 -0.012334553849229747 0.030004092153299161 0.041938846272325692 0.0024999011856523226 0.015949605312408674 0.02138599819863745 0.013512823110877826 -0.020179790945529689 -0.017469042361017414 -0.0055946139459359051 0.0031597432497237408 -0.011771920386357085 -0.021597271021002985 0.012816001285931737 -0.011363580996414812 0.0020149260254811812 0.00043601997081771468 -0.0016012670216861329 -0.0053304468673700247 0.015681584704108169 -0.023283527667222387 -0.023312183764461633 0.024350436620394864 0.0022135067158016663 0.019959472436839275 0.00239062302787489 -0.0089606252094547884 0.010686929743659312 0.0019589203136256722 0.008705840389357641 0.0044328545388625821 0.0059910174264935986 0.0071910679785080166 -0.0061266953727149853 -0.0013142165192858496 -0.0055915117714778213 0.0044172447785102266 0.0060641007364629247 -0.0082879584961885397 0.0017899598215144431 -0.012749441339784798 0.013717654756340548 0.0043196907626504889 0.0062818263717815074 -0.016671499273137096 -0.012680212012930901 -0.0017931411345936251 -0.0093872991458992146 -0.0057083028577945482 -0.0023408169244473948 0.0062068972114398095 -0.019864613815802276 -0.019402530230929905 -0.009767906876708041 -0.0053142689813148493 0.0028846496334294716 -0.011949992631561417 -0.020932451910213645 -0.019936240664244213 -0.01481682487803606 -0.018406479229905345 -0.013656326816379273 -0.015434671104703611 -0.00062233878705726653 0.0012474421363465307 -0.0011661844632081147 -0.0097740638186582709 -0.020804467202529656 0.0046391426203843808 -0.0028604553540179092 -0.017595353111428548 -0.014992447164582931 -0.015148374549620373 -0.019157517182494394 -0.021704768642687618 -0.013442222929920967 -0.0094787589065899406 -0.022778144406230279 -0.019741510295765277 -0.019991218800472218 -0.018081604749509952 -0.016590132288267685 -0.024824916012125168 -0.024781817786827611 -0.022829985012523622 -0.02478934274709832 -0.02482926696501371 -0.01190143011160847 -0.024821648386810936
leaf_weight=102.11390367150307 23.437066987156868 38.054751336574554 20.346360445022583 22.709142565727234 11.813653647899633 3.7443229556083697 4.8129914999008161 12.581539392471312 9.4054277837276477 7.1380731910467139 7.7258496284484863 6.2646880894899359 43.198136731982231 11.434990555047987 12.867852583527563 23.620821446180344 10.582750514149664 27.795110449194908 7.0210628360509899 8.003689378499983 14.346284627914427 74.453605592250824 3.355594426393508 11.939996033906942 17.9715316593647 8.7105471491813677 3.9387925490736952 18.666669338941574 24.282100737094879 30.657539755105972 4.1981707438826561 26.750588893890381 15.591685295104979 201.74943292140961 68.669959753751755 39.68837583065033 14.623739600181578 85.381313264369965 9.3649012669920904 5.3343442827463177 12.78885832428932 141.41141551733017 33.352897882461548 46.936718940734863 35.216727867722511 40.070462346076965 13.415678240358831 62.700798273086548 17.931973457336426 6.0157403200864783 17.677241921424866 89.256381884217262 10.587502032518385 3.7342292964458457 131.64641752839088 105.19615137577057 12.878989338874815 9.4246943891048449 10.566336154937749 34.761899352073669 248.54556834697723 84.954975962638855 8.5697069391608256 3.0683495774865142 8.604978144168852 45.802775859832764 22.113768070936203 19.272441118955612 15.130717664957045 11.613079085946081 8.79373751580715 6.9318757578730574 61.734328418970108 15.762945055961607 2.0356680676341057 6.3826253935694695 11.539139658212664 23.167658314108849 3.4178024977445594 6.154202193021777 5.221690967679022 12.359385222196581 9.413192957639696 13.395216673612593 7.338758558034896 7.4535107761621466 27.305558741092682 9.3750959336757642 6.0017469152808181 4.0167869701981544 2.3115773275494576 5.2587934285402298 3.0298877358436584 4.8827691525220871 2.2982067316770554 7.3376223742961884 7.3938093110918999 2.2109356448054314 3.9207967966794968 3.4024395644664764 61.699218966066837 79.875902876257896 9.3157086372375542 6.4387582242488843 3.6668157577514648 2.1392831429839134 18.213738784193993
leaf_count=1572 104 128 34 120 96 26 71 20 30 30 18 24 179 14 16 65 19 96 25 21 33 279 7 37 54 58 42 66 67 104 59 26 22 435 143 89 34 158 103 79 22 159 30 56 179 27 57 36 32 17 31 353 34 9 272 79 19 24 103 36 273 82 66 13 29 118 94 27 28 36 18 60 159 28 19 83 38 244 37 39 25 51 32 37 67 76 46 30 32 41 25 62 42 21 21 53 95 22 46 36 959 1239 104 100 57 21 283
internal_value=0 -0.0153641 0.00319425 -0.0194971 -0.00485731 -0.000582877 0.00337206 0.00754779 0.0108923 -0.00138672 0.00105644 0.0222001 -0.000447302 -0.00465316 0.00999014 0.0197279 0.0308482 0.00371161 0.0103887 -0.000535852 0.0226216 0.00516959 -0.0152745 0.0314828 -0.0122046 -0.00915571 0.00371491 0.00385999 -0.00991553 -0.00517246 -0.0165652 0.00519663 0.00401806 0.00498643 0.00111938 0.00428296 0.00518916 0.012609 -0.0113255 -0.00733222 0.0156844 0.00622051 0.0059994 0.00817563 -0.0132387 0.00613079 0.0085744 0.00514181 -0.00128799 -0.00475693 0.00230746 -0.00499027 -0.00558185 -0.0173548 0.00296352 0.00493074 -0.0032395 -0.00358138 -0.0155934 0.00470336 0.00547282 0.00374034 -0.0182968 -0.021132 -0.00690667 -0.00723247 -0.00730513 0.000763953 0.00147799 -0.0166604 -0.0156903 -0.0135844 -0.00472868 0.00492649 -0.0140463 -0.0210396 -0.0172949 -0.0162822 -0.0202515 -0.0164343 -0.0125912 -0.00130032 -0.000730917 5.47123e-05 -0.0115299 -0.022478 0.003997 -0.00158774 -0.0191353 -0.0165399 -0.017092 -0.0196553 -0.0220521 -0.0144719 -0.0110566 -0.0225636 -0.0202933 -0.0209819 -0.018698 -0.0170617 -0.0247887 -0.0247722 -0.0228071 -0.0248219 -0.0248038 -0.0119251 -0.0248242
internal_weight=0 654.024 2214.77 469.381 184.642 130.922 105.074 89.2911 76.7096 673.641 390.533 25.9305 364.603 181.278 47.9237 35.0558 19.9882 183.325 71.2762 112.049 42.1414 82.4573 53.7207 19.6658 197.373 116.157 38.7284 56.7214 133.355 54.9396 81.2159 1541.13 716.446 537.035 179.411 503.9 433.401 100.005 37.4084 28.0435 33.1352 824.681 797.931 225.556 78.4149 192.203 31.3872 572.375 70.4993 283.107 163.819 277.092 238.806 50.3651 333.396 152.133 52.5674 95.1417 77.4286 509.674 283.307 226.366 46.6308 22.3355 143.664 135.059 29.1348 103.073 83.8007 25.8473 24.2953 15.5016 72.3218 60.7457 14.2343 43.8075 49.4191 31.8782 15.7832 29.5913 28.0096 38.2857 31.1477 22.8199 17.9051 19.2672 43.0685 21.7345 17.5409 7.76111 5.72938 22.956 10.0538 10.1045 6.47316 20.8515 13.7764 5.24082 9.17959 7.34123 272.008 181.99 16.6533 90.0185 10.1056 4.17495 79.913
internal_count=11292 6760 4532 5791 969 624 460 263 243 2308 1394 79 1315 624 95 79 49 691 248 443 129 300 345 55 1581 777 189 194 529 171 804 2224 1420 1095 325 1039 899 192 302 199 56 804 778 192 358 162 111 586 140 914 303 897 754 338 707 135 108 254 588 550 309 241 329 185 500 471 119 198 171 164 144 126 193 105 128 502 372 302 197 143 216 143 113 61 170 172 74 81 70 67 62 286 135 46 61 216 178 64 108 78 4210 2811 157 1399 157 40 1242
cat_boundaries=0 1 2 3 4 5 6 7 8 9 10 11 12 13 14 15 16 17 18 19 20 21 22 23
cat_threshold=1 2 1 2 1 1 1 2 1 1 1 1 2 1 1 1 2 1 2 1 1 1 1
is_linear=0
shrinkage=0.05


Tree=56
num_leaves=110
num_cat=24
split_feature=2 3 2 2 1 2 0 3 3 2 2 2 3 3 3 2 0 2 1 2 2 2 2 3 2 2 1 1 3 2 1 2 3 2 2 3 3 2 0 2 2 2 3 3 3 2 2 2 3 2 0 1 3 1 2 3 3 2 1 2 2 3 2 2 1 3 3 2 2 2 2 2 2 2 2 2 2 2 2 2 2 0 2 2 1 3 2 3 2 2 2 2 2 1 3 2 2 0 2 3 2 2 0 1 1 0 1 0 1
split_gain=67.0535 11.2436 7.67815 7.29402 3.19269 3.21059 3.98019 2.30298 4.13641 2.36821 2.11803 4.61255 2.42927 5.33395 4.64562 6.02514 2.19719 5.75285 1.94928 5.71601 3.91293 2.8521 2.13402 1.35006 1.03709 3.73943 1.49489 0.822748 1.16536 0.760944 0.708957 0.696578 0.757028 1.49849 1.02075 0.959608 2.66481 2.04878 0.662511 0.565139 0.462926 0.44595 0.555274 1.99617 0.390968 0.380618 0.338549 0.29942 0.2711 0.240512 0.232871 0.244699 0.221344 0.218951 0.211496 0.173216 0.167601 0.164343 0.157535 0.152245 0.13859 0.135186 0.124733 0.105253 0.138438 0.102308 0.0959023 0.151165 0.0982061 0.0913239 0.0866733 0.0758909 0.0723453 0.0556424 0.0528133 0.0478447 0.0421037 0.037471 0.0369515 0.0729434 0.036266 0.0239256 0.0221127 0.0207257 0.0201057 0.018535 0.0150958 0.0138539 0.0115654 0.0102106 0.00871462 0.0079748 0.00586056 0.00565848 0.00509904 0.00398117 0.00348711 0.00199745 0.00196551 0.00152091 0.00104655 0.000564862 6.08662e-05 5.35312e-06 4.49545e-06 1.52229e-06 1.52681e-06 9.70256e-07 6.15493e-08
threshold=15.500000000000002 1.0000000180025095e-35 78.500000000000014 1.0000000180025095e-35 0 7.5000000000000009 1 29.500000000000004 5.5000000000000009 4.5000000000000009 43.500000000000007 41.500000000000007 1.0000000180025095e-35 6.5000000000000009 23.500000000000004 23.500000000000004 2 42.500000000000007 3 26.500000000000004 21.500000000000004 22.500000000000004 37.500000000000007 86.500000000000014 4.5000000000000009 6.5000000000000009 4 5 1.5000000000000002 1.5000000000000002 6 204.50000000000003 9.5000000000000018 81.500000000000014 93.500000000000014 5.5000000000000009 2.5000000000000004 92.500000000000014 7 80.500000000000014 27.500000000000004 208.50000000000003 31.500000000000004 35.500000000000007 151.50000000000003 5.5000000000000009 574.00000000000011 155.50000000000003 26.500000000000004 456.50000000000006 8 9 31.500000000000004 10 160.50000000000003 1.0000000180025095e-35 8.5000000000000018 316.50000000000006 11 68.500000000000014 2.5000000000000004 3.5000000000000004 479.50000000000006 150.50000000000003 12 8.5000000000000018 3.5000000000000004 48.500000000000007 64.500000000000014 29.500000000000004 13.500000000000002 13.500000000000002 8.5000000000000018 46.500000000000007 736.00000000000011 170.50000000000003 10.500000000000002 2.5000000000000004 13.500000000000002 7.5000000000000009 2.5000000000000004 13 13.500000000000002 49.500000000000007 14 1.5000000000000002 10.500000000000002 1.5000000000000002 182.50000000000003 66.500000000000014 14.500000000000002 8.5000000000000018 5.5000000000000009 15 1.5000000000000002 14.500000000000002 12.500000000000002 16 3.5000000000000004 2.5000000000000004 3.5000000000000004 5.5000000000000009 17 18 19 20 21 22 23
decision_type=2 2 2 2 1 2 9 2 2 2 2 2 2 2 2 2 9 2 1 2 2 2 2 2 2 2 1 1 2 2 1 2 2 2 2 2 2 2 9 2 2 2 2 2 2 2 2 2 2 2 9 1 2 1 2 2 2 2 1 2 2 2 2 2 1 2 2 2 2 2 2 2 2 2 2 2 2 2 2 2 2 9 2 2 1 2 2 2 2 2 2 2 2 1 2 2 2 9 2 2 2 2 9 1 1 9 1 9 1
left_child=1 3 10 102 5 6 7 8 9 -3 11 12 18 27 15 -15 17 -13 20 21 81 -20 -22 52 29 26 45 40 -29 30 38 32 33 39 -34 36 55 -38 -5 -4 -14 -33 46 -44 57 -26 49 56 50 61 83 66 60 74 63 -35 -37 -45 78 73 65 -43 -51 64 -36 87 67 -52 -68 -21 76 72 -62 -53 -48 -56 91 97 79 -27 94 -2 86 -12 89 -61 -60 -6 -77 -85 -80 -7 -82 98 -8 -84 107 -31 -79 -96 -95 -28 103 -1 -99 108 -107 -78 -104
right_child=2 4 31 24 23 70 80 -9 -10 -11 48 16 13 14 -16 -17 -18 -19 19 69 22 -23 -24 -25 25 58 101 28 -30 77 -32 41 34 35 54 47 37 -39 -40 -41 -42 42 43 44 -46 -47 53 -49 -50 62 51 59 -54 -55 75 -57 -58 -59 82 85 71 -63 -64 -65 -66 -67 68 -69 -70 -71 -72 -73 -74 -75 -76 88 96 93 90 -81 92 -83 95 84 -86 -87 -88 -89 -90 -91 -92 -93 -94 100 99 -97 -98 104 -100 -101 -102 -103 105 -105 -106 106 -108 -109 -110
leaf_value=-0.024763131952525014 -0.017031036855386789 0.00046759289803901855 0.0098801485536685572 -0.0035023640523227546 -0.023503019532583803 -0.018078171405881052 -0.023179494908905328 -0.012688650811601671 0.037475677583850939 0.023301401049645357 -0.0037051642765491598 0.041686805119786251 -0.016589610294225857 0.034652369565662422 -0.016400095621024176 -0.0078015591746011213 0.044922051901674184 -0.012906306475354127 0.012179889475343349 -0.012179482771570256 0.001549963429106618 0.039196574284974278 0.023595309158347677 0.015304357764436671 0.012998197501099547 -0.020085011918894325 -0.017339336642427528 0.0030714448543374966 -0.011617302168529738 -0.021526711004649399 -0.023247116044822394 0.012336617644522235 -0.0091798655969174379 0.0019608914508411506 0.00034321584875192097 -0.0015640430160738226 -0.0052262319767351316 0.015051265929494663 -0.023276399782119487 0.023167351658691444 -0.0088177932719340664 0.0057597317907660739 0.019074375423094366 0.0023256282640945996 0.010309391590671853 0.0019064951421457262 0.0042920996511229036 0.0043034269226422802 0.0058069245514341949 -0.00055648231272926931 -0.010972845516842758 -0.0012832921590075295 -0.0054836423908910473 0.010726426100831042 0.00696163347715741 0.0042883407271759461 -0.0081502950559100753 0.0058773271383726414 -0.012594444429956667 0.0012786867405260543 -0.016534357311899617 0.0038751414417175301 0.0034813082211487389 -0.0022881138895489159 0.0048017754691836506 -0.012525178840164115 -0.0025223804685445481 -0.0065049327656714539 -0.0078587934203646799 -0.0055988424039372098 -0.019765006758475305 -0.019296210097723709 -0.0096200680211570109 -0.0052102850343893796 0.0070201809390736921 0.0028048198437987007 -0.011795162371353375 -0.020850022244305377 -0.01983771402434284 -0.014667367520325906 -0.018287163670906496 -0.013502699110760897 -0.015288543597094671 -0.000607269120005823 0.0012149332362898474 -0.0016037070826902021 -0.0096261918674872167 -0.020719856128774691 0.0045027511179184191 -0.0027975245760338387 -0.017466944229684863 -0.014843858237604255 -0.015000608151002943 -0.019047812966945993 -0.021636210356636945 -0.013288122407518558 -0.0093325633909500921 -0.022730889437801004 -0.019640072229881039 -0.019893526772700051 -0.017958487180858556 -0.016452303117433828 -0.024824806768357081 -0.024780627446829202 -0.022783815900349925 -0.024788340533500354 -0.024829265320098617 -0.011746651280648911 -0.024821457568574901
leaf_weight=99.616135865449905 23.038232281804085 50.93489483743906 20.555721968412399 22.628021836280823 11.538877978920942 3.6767929196357745 4.7025335952639562 12.420980930328367 12.010968536138533 14.613344505429266 7.1111069172620764 9.0080971568822861 42.481601759791374 22.448573112487793 12.656789511442183 13.3141483515501 7.1166993826627758 10.393000036478043 28.14898157119751 6.934992894530299 69.863486558198929 14.960745945572851 13.023951798677443 3.4095439910888663 18.2160255163908 8.5365319848060626 3.8705831468105307 24.358947187662125 30.298757702112198 4.10847357660532 9.1493718549609167 27.095630288124084 21.32274055480957 202.15635228157043 51.790854096412659 39.624874889850616 14.545995861291884 86.730781078338623 5.211427807807925 13.10409504175186 34.902573734521866 213.30679094791412 34.025292158126831 47.049061417579651 40.500989139080048 13.441984482109548 29.254868745803833 18.011639624834061 6.0518889725208274 31.252532124519348 24.653711080551147 10.573597162961958 3.7134074568748465 35.351274371147156 17.804818511009216 132.22921779751778 12.77269011735916 105.8360099196434 10.432476490736013 13.11945101618767 8.4280213117599505 171.7935426235199 49.294129610061646 19.227380394935608 26.226748734712601 3.0296878740191451 22.470102176070213 81.563093334436417 13.988686263561247 21.987895682454109 11.384666003286837 8.6247612833976728 6.8644955083727828 61.407125383615494 45.074578166007996 15.808481276035307 2.0114866197109222 6.2504100352525711 11.311370253562929 22.826918259263039 3.3554682210087767 6.0707295909523991 5.1417147070169431 12.35169602930546 9.4249427914619464 9.7017328441143018 7.2673783600330344 7.3000464215874663 27.432527124881744 9.3483171910047513 5.8970675542950621 3.957014687359333 2.2768245786428452 5.1590068936347961 2.9648333191871643 4.8175730779767036 2.2765255123376846 7.1723734587430954 7.2492757439613342 2.1671752110123634 3.85053950548172 3.346458375453949 60.186399795114994 77.920756950974464 9.1054407358169609 6.2811076641082746 3.5768925100564957 2.1139734983444214 17.76720816642046
leaf_count=1572 104 188 34 120 96 26 71 20 21 34 30 33 179 25 16 54 17 29 96 25 247 33 53 7 54 58 42 67 104 59 103 26 35 435 109 89 34 158 79 22 179 251 30 56 27 57 23 32 17 22 79 34 9 20 31 272 19 79 103 35 66 204 39 27 49 13 98 284 39 94 36 18 60 159 27 28 19 83 38 244 37 39 25 51 32 26 67 76 46 30 32 41 25 62 42 21 21 53 95 22 46 36 959 1239 104 100 57 21 283
internal_value=0 -0.0152184 0.00310363 -0.0193924 -0.0047632 -0.000572835 0.00327239 0.00729985 0.010501 0.00555817 -0.0013565 0.00102501 -0.000439773 -0.00456185 0.00963357 0.0188471 0.0211586 0.0124417 0.00360239 0.0100189 -0.000524536 0.0215557 0.00501391 -0.0151279 -0.0120504 -0.0090126 0.00360726 -0.00976728 -0.00507106 -0.0164275 -0.0111723 0.00504056 0.0039018 0.00483751 0.00109005 0.00415806 0.00503334 0.0121389 -0.00720398 0.015053 -0.0130843 0.0060277 0.00581475 0.00790639 0.00594144 0.00828866 0.00498797 -0.00125785 -0.00466134 0.00439932 -0.00489112 -0.00547419 -0.0172241 0.00748709 0.00247348 0.00288126 -0.00316954 0.00478432 -0.0154483 -0.00350521 -0.0181763 0.00491901 0.00191462 0.00102541 0.00184203 -0.0210531 -0.00678249 -0.00754197 -0.00456988 -0.00717672 -0.0165233 -0.0155458 -0.0134307 -0.00463343 0.00594645 0.00478022 -0.0138938 -0.020959 -0.0171635 -0.0161419 -0.0201579 -0.0162952 -0.0124362 -0.00126975 -0.000713327 5.33246e-05 -0.0113757 -0.0224245 0.003882 -0.00155083 -0.0190253 -0.0164017 -0.0169586 -0.0195527 -0.0219901 -0.0143209 -0.0109035 -0.0225118 -0.0202003 -0.0209003 -0.0185823 -0.016928 -0.0247877 -0.0247708 -0.0227605 -0.0248217 -0.0248032 -0.0117703 -0.024824
internal_weight=0 644.115 2221.95 460.339 183.776 130.867 105.447 89.9802 77.5592 65.5482 672.774 391.008 364.49 180.461 48.4195 35.7627 26.5178 19.4011 184.029 72.0326 111.996 43.1097 82.8874 52.9088 194.99 115.106 38.8751 132.042 54.6577 79.8843 36.9888 1549.18 719.345 539.731 179.614 506.072 435.662 101.277 27.8394 33.6598 77.3842 829.835 802.739 227.411 193.386 31.658 575.328 70.4092 281.765 465.647 275.714 237.477 49.4993 109.681 158.291 334.386 52.3976 152.885 76.231 94.8019 45.7859 385.1 80.5467 97.245 78.0176 21.8686 142.676 106.217 36.4588 28.9229 25.4205 23.9173 15.2925 71.9807 74.3294 61.0458 14.0358 42.8955 48.5719 31.3635 15.4668 29.109 27.6591 38.2361 31.125 22.8212 17.6999 18.8389 43.241 21.7 17.2084 7.63381 5.63229 22.5092 9.83454 9.95929 6.40199 20.3863 13.4997 5.13201 9.00955 7.21704 265.349 177.537 16.2778 87.8116 9.858 4.12546 77.9536
internal_count=11292 6760 4532 5791 969 624 460 263 243 222 2308 1394 1315 624 95 79 79 62 691 248 443 129 300 345 1581 777 189 529 171 804 302 2224 1420 1095 325 1039 899 192 199 56 358 804 778 192 162 111 586 140 914 516 897 754 338 70 290 707 108 135 588 254 329 455 61 185 158 185 500 363 137 119 164 144 126 193 50 105 128 502 372 302 197 143 216 143 113 61 170 172 74 81 70 67 62 286 135 46 61 216 178 64 108 78 4210 2811 157 1399 157 40 1242
cat_boundaries=0 1 2 3 4 5 6 7 8 9 10 11 12 13 14 15 16 17 18 19 20 21 22 23 24
cat_threshold=1 2 2 1 1 1 1 2 1 1 1 1 1 2 1 1 1 2 1 2 1 1 1 1
is_linear=0
shrinkage=0.05


Tree=57
num_leaves=109
num_cat=24
split_feature=2 3 2 2 1 2 0 3 3 2 2 2 3 3 3 2 0 1 1 2 2 2 2 3 2 2 1 1 3 2 1 2 2 3 2 2 3 3 2 0 3 3 2 2 2 3 2 2 3 2 0 1 2 3 1 1 3 3 2 2 2 3 2 2 2 2 2 2 2 2 2 2 2 2 2 2 2 0 2 2 1 3 2 3 2 2 2 2 2 1 3 2 3 2 0 2 3 3 2 2 2 0 1 1 0 1 0 1
split_gain=64.6322 11.1242 7.34134 7.25669 3.09884 3.09552 3.82206 2.17854 3.72368 2.18553 2.02163 4.28555 2.31338 5.09273 4.36327 5.47031 1.92941 5.51845 1.82805 5.3018 3.76614 2.51665 2.01472 1.30902 1.02425 3.63164 1.42914 0.804788 1.12366 0.759979 0.703206 0.652601 0.890948 0.71264 1.39029 0.984975 0.905195 2.4823 1.90561 0.652166 0.542465 2.38508 0.511618 0.457721 0.38857 0.362939 0.353505 0.284773 0.258778 0.234792 0.224084 0.23645 0.167259 0.161485 0.156795 0.153449 0.148108 0.996813 0.368961 0.14597 0.124495 0.146335 0.0931551 0.125939 0.0890732 0.0867122 0.0831066 0.15349 0.0787504 0.0741382 0.053514 0.0447796 0.041744 0.0379746 0.0370479 0.0730298 0.0366093 0.0238559 0.021856 0.0198234 0.0191401 0.0177123 0.0148525 0.0140911 0.0108737 0.00975887 0.00877263 0.00797158 0.00586362 0.00570763 0.00518337 0.00395391 0.00390044 0.00342539 0.00203198 0.00198727 0.00154043 0.00147058 0.00105273 0.000726593 0.000565427 6.23966e-05 5.48721e-06 4.58031e-06 1.56074e-06 1.5651e-06 9.56267e-07 6.31302e-08
threshold=15.500000000000002 1.0000000180025095e-35 1.0000000180025095e-35 78.500000000000014 0 7.5000000000000009 1 29.500000000000004 5.5000000000000009 4.5000000000000009 43.500000000000007 41.500000000000007 1.0000000180025095e-35 6.5000000000000009 23.500000000000004 23.500000000000004 2 3 4 26.500000000000004 21.500000000000004 22.500000000000004 22.500000000000004 52.500000000000007 4.5000000000000009 6.5000000000000009 5 6 1.5000000000000002 1.5000000000000002 7 204.50000000000003 207.50000000000003 9.5000000000000018 81.500000000000014 87.500000000000014 5.5000000000000009 2.5000000000000004 92.500000000000014 8 34.500000000000007 38.500000000000007 80.500000000000014 27.500000000000004 736.00000000000011 151.50000000000003 5.5000000000000009 155.50000000000003 26.500000000000004 160.50000000000003 9 10 120.50000000000001 8.5000000000000018 11 12 1.5000000000000002 2.5000000000000004 248.50000000000003 68.500000000000014 2.5000000000000004 8.5000000000000018 75.500000000000014 64.500000000000014 29.500000000000004 13.500000000000002 150.50000000000003 138.50000000000003 13.500000000000002 8.5000000000000018 46.500000000000007 170.50000000000003 10.500000000000002 2.5000000000000004 13.500000000000002 7.5000000000000009 2.5000000000000004 13 13.500000000000002 49.500000000000007 14 1.0000000180025095e-35 10.500000000000002 1.5000000000000002 182.50000000000003 66.500000000000014 14.500000000000002 8.5000000000000018 5.5000000000000009 15 1.5000000000000002 14.500000000000002 2.5000000000000004 12.500000000000002 16 3.5000000000000004 2.5000000000000004 2.5000000000000004 3.5000000000000004 6.5000000000000009 5.5000000000000009 17 18 19 20 21 22 23
decision_type=2 2 2 2 1 2 9 2 2 2 2 2 2 2 2 2 9 1 1 2 2 2 2 2 2 2 1 1 2 2 1 2 2 2 2 2 2 2 2 9 2 2 2 2 2 2 2 2 2 2 9 1 2 2 1 1 2 2 2 2 2 2 2 2 2 2 2 2 2 2 2 2 2 2 2 2 2 9 2 2 1 2 2 2 2 2 2 2 2 1 2 2 2 2 9 2 2 2 2 2 2 9 1 1 9 1 9 1
left_child=1 2 101 10 5 6 7 8 9 -3 11 12 18 27 15 -15 17 -13 20 21 77 -20 -22 60 29 26 46 43 -29 30 39 33 -33 34 42 -35 37 52 -39 -4 44 -42 -5 -14 56 55 -26 53 50 66 79 62 -36 -38 74 -43 58 -58 -34 70 61 83 63 -52 -21 72 67 -37 69 99 -53 -51 87 94 75 -27 90 -2 82 -12 85 -61 -56 -6 -73 -81 -76 -7 -78 95 -8 -80 -71 106 -31 -75 -92 -85 -91 -62 -28 102 -1 -96 107 -106 -74 -103
right_child=3 4 24 31 23 65 76 -9 -10 -11 48 16 13 14 -16 -17 -18 -19 19 64 22 -23 -24 -25 25 54 100 28 -30 73 -32 32 40 35 36 49 47 38 -40 -41 41 45 -44 -45 -46 -47 -48 -49 -50 71 51 59 -54 -55 78 -57 57 -59 -60 81 68 -63 -64 -65 -66 -67 -68 -69 -70 92 -72 84 93 89 86 -77 88 -79 91 80 -82 -83 -84 97 -86 -87 -88 -89 -90 98 96 -93 -94 -95 103 -97 -98 -99 -100 -101 -102 104 -104 -105 105 -107 -108 -109
leaf_value=-0.024761471681045949 -0.01689708725696229 0.00045576708079529807 -0.0034275396778634722 0.0095389027682422772 -0.023471478143569428 -0.017955014059561517 -0.023140806897281999 -0.012533621123907282 0.035183967792542584 0.022192854719227981 -0.0036267508366283133 0.041120322059855718 -0.016451777693040338 0.032626493275820657 -0.016260716425165477 -0.0076681970863413142 0.041858015266852358 -0.012114150274685483 0.011731855642938601 -0.012024472641130877 0.028300890355421993 0.036735528606613561 0.0022839914041393387 0.0071022340213057721 0.012509691235245993 -0.019988760869443793 -0.017208334099795882 0.0029858796562077989 -0.011462919815715364 -0.021454845930310492 -0.023209904639366924 0.015907903978229089 -0.0001099633817726447 -0.011084088055152052 0.0040640983254795681 0.00040415828549796419 -0.0015276267089401076 -0.0051235137242532855 0.014455508006095935 -0.023239832773002359 0.022192225017044508 0.0032288758971027324 0.022068178918536588 -0.0086759830422317146 0.0083922295091412111 0.009948994395843784 0.0018555721975892045 0.0041783258122667566 0.0056295380435747167 0.0067410854184000394 -0.005884631131108483 -0.0012530564701980862 0.0018139400364435791 -0.0080138010882229421 -0.012439379184515688 0.0065478401381668036 0.012972936778482656 0.004053991873268506 0.0045442697212611776 0.0017084000819711156 -0.015966607227256915 -0.011701455881703522 -0.0015947532175347374 -0.0091342081287636573 -0.0054908725844509676 -0.019663915939916427 -0.0022364779899165278 0.0059475869809498668 -0.019188406637548155 -0.010401019237665272 -0.0051077977032124083 0.0027274197991241328 -0.011640512604382321 -0.020766184328202205 -0.019737703912765896 -0.014517221032758015 -0.018166426773820462 -0.013348722418637247 -0.015141559281406834 -0.00059255541846270766 0.0011833104726255992 -0.001119362643931426 -0.0094791373115361011 -0.021465284098872925 0.0043709732699390262 -0.0027358039809189179 -0.017337216887898715 -0.014694530462600573 -0.014852061545628473 -0.018936633085521015 -0.021566371004125201 -0.01313373888594252 -0.0080140532225713105 -0.0091872625383517832 -0.022682644125689086 -0.019537148572262093 -0.019794354895288326 -0.020015438126176868 -0.017833982987660979 -0.016906294790545322 -0.016313343004254018 -0.024824696167501735 -0.024779405712192878 -0.022736679052383191 -0.024787313025625327 -0.024829264996001368 -0.011592068193577191 -0.02482126187017665
leaf_weight=97.179623454809189 22.649189904332161 50.958717219531536 22.548909187316895 20.759822249412537 11.270842336118227 3.6109204441308993 4.5947849303483945 12.264371454715727 12.469628334045408 14.957853510975836 7.0848078429698935 8.889544814825058 41.782661616802216 23.240104511380196 12.450909897685049 13.210681214928625 7.4436856210231808 10.761734843254089 28.493929952383041 6.8510408401489284 8.2602649331092817 15.558800399303435 75.046501249074936 5.9453712105751029 18.454346477985382 8.3667858242988604 3.8040482699871054 24.433879479765892 29.948804557323456 4.0209769681096077 8.9391286596655828 21.4191774725914 56.254801094532013 15.27464637160301 147.18210157752037 68.75666743516922 39.562948226928711 14.470173597335814 88.046062290668488 5.0915249437093761 25.214335381984711 83.682719767093658 13.411225974559782 34.596163034439087 67.490134477615356 40.920689284801483 13.467636644840242 18.089318454265594 6.0871340334415427 17.929201543331146 88.115912541747093 10.56003701686859 188.16852554678917 12.669011831283568 10.30190914869309 59.649622976779938 35.446722984313965 269.5842102766037 175.19526153802872 9.4536600410938281 4.501178093254568 3.8936162143945685 8.5315046310424787 45.0641820281744 21.86513252556324 11.161857120692728 19.183436453342438 15.25820145010948 8.459931403398512 4.2347876504063597 61.088009476661682 15.8528835773468 1.9879001975059509 6.1214379668235779 11.089189827442171 22.494550295174122 3.2946638241410247 5.9893093481659916 5.0637032538652402 12.344197437167169 9.436400383710863 13.368764013051985 7.1977568715810767 3.0497412607073775 27.55632758140564 9.3222015351057035 5.7949581667780867 3.8987111672759056 2.242925688624382 5.0616692304611206 2.9013746827840805 4.7539799585938454 2.8722035810351372 2.2553784921765327 7.0111783891916275 7.1082885190844536 2.1244884356856346 4.1006054803729057 3.7820069938898087 3.7886371091008186 3.2918518483638763 58.710674446076155 76.013562854379416 8.9003290534019488 6.1273235827684385 3.4891744293272495 2.0892866849899292 17.331628117710352
leaf_count=1572 104 188 120 34 96 26 71 20 21 34 30 24 179 25 16 54 17 38 96 25 21 33 279 13 54 58 42 67 104 59 103 20 71 22 362 143 89 34 158 79 21 80 22 179 38 27 57 32 17 31 353 34 345 19 103 45 36 293 173 24 46 15 29 118 94 36 27 28 18 38 159 28 19 83 38 244 37 39 25 51 32 37 67 35 46 30 32 41 25 62 42 21 23 21 53 95 22 41 46 20 36 959 1239 104 100 57 21 283
internal_value=0 -0.015072 -0.0192862 0.00301585 -0.00467034 -0.000562707 0.0031763 0.00706225 0.0101282 0.00538837 -0.001327 0.000994356 -0.000432207 -0.0044718 0.00929375 0.0180227 0.020179 0.0119672 0.00349693 0.00966634 -0.000513434 0.0205628 0.00486369 -0.0149805 -0.0118962 -0.00887043 0.00350316 -0.00961979 -0.00497114 -0.0162886 -0.0110195 0.00488999 0.00584204 0.00378939 0.00469377 0.00106154 0.00403732 0.00488299 0.0116919 -0.00707708 0.00557699 0.00776951 0.0144563 -0.0129297 0.00481659 0.00579582 0.0080148 -0.00122838 -0.00456723 0.00218907 -0.00479346 -0.00536803 0.00280151 -0.00310087 -0.0153023 0.00461011 0.00436677 0.00509044 0.00341304 -0.0034304 -0.017824 -0.0205085 -0.00665973 -0.00698419 -0.00704964 -0.0163849 0.000732907 0.00141092 -0.015313 -0.0131835 -0.00453966 0.00463898 -0.0137409 -0.0208771 -0.0170308 -0.0160006 -0.0200628 -0.016155 -0.0122811 -0.00123985 -0.000696148 5.19725e-05 -0.0112218 -0.02237 0.00377075 -0.00151471 -0.0189138 -0.0162623 -0.016824 -0.0194485 -0.021927 -0.0141693 -0.00943636 -0.0107508 -0.0224591 -0.0201058 -0.0208173 -0.0206338 -0.0184651 -0.0163961 -0.0167931 -0.0247866 -0.0247693 -0.0227129 -0.0248215 -0.0248025 -0.0116157 -0.0248239
internal_weight=0 634.448 451.518 2228.96 182.93 130.813 105.809 90.6506 78.3862 65.9166 671.929 391.472 364.377 179.663 48.9017 36.4508 27.095 19.6513 184.714 72.7689 111.945 44.0527 83.3068 52.1169 192.666 114.081 39.0179 130.762 54.3827 78.5854 36.5796 1557.03 834.858 722.171 542.359 179.811 508.188 437.867 102.516 27.6404 813.438 209.467 34.171 76.3788 603.971 184.253 31.922 70.3213 280.457 164.537 274.37 236.182 335.351 52.232 75.0628 143.332 536.481 305.031 231.45 94.4705 46.1715 22.3148 141.712 133.18 28.7162 25.0041 103.198 84.0149 23.8567 15.3968 71.648 61.3384 13.8422 42.0059 47.7455 30.8613 15.1582 28.6385 27.3173 38.1876 31.1028 22.8224 17.4997 18.4212 43.4092 21.6664 16.8841 7.50963 5.53759 22.0734 9.62065 9.81768 7.10699 6.33257 19.9325 13.2297 5.02586 7.15035 8.84368 8.28982 7.0959 258.852 173.193 15.9115 85.6588 9.6165 4.07719 76.0423
internal_count=11292 6760 5791 4532 969 624 460 263 243 222 2308 1394 1315 624 95 79 79 62 691 248 443 129 300 345 1581 777 189 529 171 804 302 2224 804 1420 1095 325 1039 899 192 199 784 173 56 358 611 152 111 140 914 303 897 754 707 108 588 125 573 329 244 254 332 187 500 471 119 164 198 171 145 127 193 105 128 502 372 302 197 143 216 143 113 61 170 172 74 81 70 67 62 286 135 46 61 61 216 178 64 76 108 66 78 4210 2811 157 1399 157 40 1242
cat_boundaries=0 1 2 3 4 5 6 7 8 9 10 11 12 13 14 15 16 17 18 19 20 21 22 23 24
cat_threshold=1 2 2 2 1 1 1 1 2 1 1 1 1 2 1 1 1 2 1 2 1 1 1 1
is_linear=0
shrinkage=0.05


Tree=58
num_leaves=83
num_cat=20
split_feature=2 3 2 2 1 2 0 3 3 2 2 2 2 3 2 2 3 3 2 2 3 3 1 2 2 1 3 2 1 2 2 2 2 2 2 1 0 2 2 2 2 3 1 1 2 3 3 3 2 2 2 2 0 2 2 3 2 2 2 0 2 3 2 1 2 1 3 2 3 2 3 0 2 3 2 2 0 1 1 0 1 1
split_gain=62.2935 11.0025 7.38704 6.87074 3.00704 3.00651 2.96297 2.32075 5.99869 2.05537 1.77303 2.09262 3.00534 1.97671 2.08611 3.71408 1.63119 1.75945 1.38792 3.01637 1.27998 1.12585 4.2829 1.01113 3.52631 1.36662 0.939621 2.99787 0.897167 0.758731 0.745625 0.735249 1.02166 0.776034 0.933924 0.69728 0.641829 0.501195 0.454985 2.51388 0.328595 0.214247 0.176917 0.155991 0.139981 0.103463 0.097857 0.0955998 0.0867168 0.0756398 0.0708597 0.0656845 0.0451792 0.0413688 0.0384757 0.0374074 0.0371303 0.0730879 0.0215923 0.01837 0.0146064 0.01433 0.008828 0.00646772 0.00593998 0.00575538 0.00424516 0.00392503 0.00317008 0.00225064 0.00222489 0.00206674 0.00200871 0.00116727 0.00105858 0.000565762 6.39538e-05 5.62513e-06 4.66524e-06 1.59981e-06 1.60434e-06 6.46363e-08
threshold=15.500000000000002 1.0000000180025095e-35 1.0000000180025095e-35 92.500000000000014 0 1.0000000180025095e-35 1 29.500000000000004 5.5000000000000009 94.500000000000014 16.500000000000004 18.500000000000004 19.500000000000004 1.5000000000000002 21.500000000000004 23.500000000000004 8.5000000000000018 10.500000000000002 4.5000000000000009 7.5000000000000009 86.500000000000014 1.5000000000000002 2 4.5000000000000009 6.5000000000000009 3 2.5000000000000004 5.5000000000000009 4 1.5000000000000002 27.500000000000004 122.50000000000001 125.50000000000001 120.50000000000001 119.50000000000001 5 6 1279.5000000000002 150.50000000000003 151.50000000000003 5.5000000000000009 31.500000000000004 7 8 2.5000000000000004 8.5000000000000018 1.0000000180025095e-35 4.5000000000000009 13.500000000000002 13.500000000000002 8.5000000000000018 98.500000000000014 9 10.500000000000002 2.5000000000000004 1.5000000000000002 13.500000000000002 7.5000000000000009 13.500000000000002 10 10.500000000000002 1.5000000000000002 14.500000000000002 11 20.500000000000004 12 2.5000000000000004 14.500000000000002 2.5000000000000004 2.5000000000000004 1.0000000180025095e-35 13 3.5000000000000004 1.5000000000000002 3.5000000000000004 5.5000000000000009 14 15 16 17 18 19
decision_type=2 2 2 2 1 2 9 2 2 2 2 2 2 2 2 2 2 2 2 2 2 2 1 2 2 1 2 2 1 2 2 2 2 2 2 1 9 2 2 2 2 2 1 1 2 2 2 2 2 2 2 2 9 2 2 2 2 2 2 9 2 2 2 1 2 1 2 2 2 2 2 9 2 2 2 2 9 1 1 9 1 1
left_child=1 2 76 10 5 6 7 8 55 -5 21 47 28 14 64 -16 30 -18 59 26 41 22 -2 29 25 40 27 -20 -13 35 -15 33 -33 34 42 36 -4 38 46 -40 -25 44 52 56 45 61 -34 63 53 50 -46 -44 -11 -21 71 -3 57 -26 60 68 -45 -6 -58 70 -14 72 73 -60 -7 -61 -12 -31 -56 -8 -67 -27 77 -1 -73 81 -81 -78
right_child=3 4 23 9 20 18 66 -9 -10 31 11 12 13 16 15 -17 17 -19 19 48 -22 -23 -24 24 43 75 -28 -29 -30 54 -32 32 37 -35 -36 -37 -38 -39 39 -41 -42 -43 51 58 49 -47 -48 -49 -50 -51 -52 -53 -54 -55 65 -57 62 -59 67 69 -62 -63 -64 -65 -66 74 -68 -69 -70 -71 -72 78 -74 -75 -76 -77 79 -79 -80 80 -82 -83
leaf_value=-0.024759772433666019 0.03209743598439279 0.0050110820725079892 -0.0033540575425844189 0.02129066696600845 -0.023439231864855269 -0.023083763585551222 -0.023376389761045592 -0.011291289389135272 0.049836187518149604 -0.00038404663151716433 -0.013484660034407401 0.0093368146973982526 -0.014969055683855488 -0.014159492639973334 0.014948068087135398 -6.370266168749422e-05 0.015792166489294678 -0.002233828312449533 0.024958437666579226 -0.016121850408576294 0.014415099796552375 0.027139916246111302 -0.019112077059381831 0.012045500639380216 -0.019891031483829147 -0.017076056158880439 0.022844401968760742 -0.02148297957165278 0.029764041329170567 -0.021381665910321191 -0.0056406391372822483 0.016008265904155966 0.0042408911773720078 -0.0075434877915547538 0.01426727712102821 -0.023171878999141707 -0.023202461228032087 0.01324863712444619 0.026416203365740795 0.0049548334748313189 0.0018061035892771771 -0.0054022538442380121 0.0073135148500076174 -0.012284294031666206 -0.016256655651464627 -0.012223452178739106 0.0011559172005346932 -0.020066384158812338 -0.019561340308240863 -0.019079122234097953 -0.0093264669577801402 0.0030098342000894349 0.0022293175769159917 -0.010598629057491227 -0.020680928500578087 0.0080707507654864796 -0.019636211274130875 -0.014366426785638568 -0.01499375540665096 -0.019925211605307774 -0.0093329397126979772 -0.020546355552363192 -0.017206193714901029 -0.012228596907656925 -0.013302923842287734 -0.018823983880269093 -0.020071667947207841 -0.012979120011618835 -0.021356365857223687 -0.017441996306068252 -0.014950459095029192 -0.022633397910996861 -0.019432739868080022 -0.021929451373533693 -0.017708110800904824 -0.016173280231493583 -0.024824579999336294 -0.024778156762393158 -0.022688554155172104 -0.024786259971115391 -0.024829264949641983 -0.024821061578244902
leaf_weight=94.802861407399178 7.6287122964859009 23.271321415901184 22.471754550933838 19.071043998003006 11.009379550814634 7.6385561823844892 3.9607200846076003 10.270186901092528 9.8308787345886213 65.402058184146881 5.66768479347229 14.094417080283165 12.221009083092213 30.032006412744522 46.549378037452698 358.73395000398159 16.898000463843346 68.056877121329308 6.844173341989519 7.3885052502155322 3.4868025481700888 8.4641035199165326 8.7845813184976631 18.686655357480049 8.2012045979499835 3.7391468212008467 8.0505991503596288 7.0587285086512566 8.6888903975486755 3.9356264099478722 177.50234445929527 21.547309547662735 36.13978323340416 19.560234248638153 16.527930378913879 8.734041862189768 4.9745632931590107 18.244819641113281 13.824156403541563 1052.2616675794125 13.492649681866167 3.6978504359722129 10.434166014194487 10.174553662538534 8.155004099011423 2.9571706578135482 89.034668982028961 7.5191138088703147 10.944514967501162 8.2991463989019376 6.7344914600253096 58.987572580575943 22.134997814893723 6.2648542076349258 5.995629571378231 17.503148853778839 10.872459918260576 22.170351102948189 4.9876086115837079 1.5545822158455842 7.1298507228493682 7.0043212324380866 5.6953555643558493 7.4923076108098074 9.5138375908136368 4.9667198956012726 1.7460057809948919 4.691950611770153 4.0717605277895927 2.2091077119112015 4.7655636891722679 6.8539360761642456 6.970760390162468 2.1506919860839844 3.7151565551757812 3.23858642578125 57.271142635494471 74.153134368360043 8.7002488523721713 5.9773106127977353 3.4036075808107853 16.906729802489281
leaf_count=1572 22 87 120 37 96 40 63 17 12 174 39 35 52 121 93 1199 40 149 19 67 7 17 37 54 58 42 23 32 25 59 612 32 81 28 16 103 79 9 14 1189 57 9 22 103 66 13 178 12 36 18 60 122 61 61 83 49 38 244 25 22 67 76 32 40 46 62 18 21 17 29 30 53 95 32 46 36 959 1239 104 100 57 283
internal_value=0 -0.0149248 -0.0191785 0.00293084 -0.00457876 -0.000552589 0.00664968 0.0103793 0.0147773 0.00498498 -0.000809274 -0.00123497 -0.00075166 -0.0013178 0.000851187 0.0016605 -0.00448439 0.00135164 -0.00853372 -0.00422149 -0.0148322 0.0123279 0.00468952 -0.0117422 -0.00872926 0.00340247 0.00925085 0.00137938 0.0171272 -0.0161487 -0.00687339 0.00476662 0.00521651 0.00189766 0.00296213 -0.0108672 -0.00695152 0.00502426 0.0048983 0.00523313 0.00775216 -0.0169631 0.00177169 -0.0151554 -0.0179312 -0.0208914 0.0020466 -0.0153343 -0.0162455 -0.0152541 -0.0131221 0.00365668 0.00027678 -0.0135875 -0.0207937 0.0063245 -0.0168969 -0.0158582 -0.0121261 -0.0215065 -0.0110683 -0.0223144 -0.0188009 -0.0133494 -0.0142398 -0.0193428 -0.022246 -0.0140172 -0.0224831 -0.0184677 -0.0141542 -0.0224053 -0.0200099 -0.0228672 -0.0183465 -0.016657 -0.0247855 -0.0247678 -0.0226642 -0.0248213 -0.0248019 -0.0248238
internal_weight=0 625.016 442.914 2235.78 182.103 130.758 68.733 60.8755 50.6053 1443.17 792.613 767.735 742.291 719.507 427.018 405.283 292.489 84.9549 62.0254 46.5514 51.3442 24.8774 16.4133 190.399 113.08 39.157 21.9535 13.9029 22.7833 77.3184 207.534 1424.1 1231.05 193.047 173.487 36.1804 27.4463 1209.51 1191.26 1066.09 32.1793 47.8574 156.959 73.9233 44.1595 20.9709 125.174 25.4447 24.5979 23.1886 14.8895 69.4217 87.5371 13.6534 41.1381 40.7745 46.9394 30.3716 26.984 15.474 17.3044 18.0137 16.5678 17.9256 21.7348 21.6483 7.85742 9.67956 11.7103 3.76369 10.4332 19.4898 12.9664 6.11141 8.68188 6.97773 252.515 168.956 15.5542 83.5588 9.38092 74.1779
internal_count=11292 6760 5791 4532 969 624 278 165 148 1963 2569 2493 2372 2312 1390 1292 922 189 346 238 345 76 59 1581 777 189 74 51 60 804 733 1926 1503 423 395 302 199 1471 1462 1203 111 338 379 588 329 185 259 121 164 144 126 144 235 128 502 136 372 302 216 108 170 172 70 109 98 286 113 46 57 51 69 216 178 95 108 78 4210 2811 157 1399 157 1242
cat_boundaries=0 1 2 3 4 5 6 7 8 9 10 11 12 13 14 15 16 17 18 19 20
cat_threshold=1 2 2 1 1 1 2 1 1 2 2 1 1 1 2 1 2 1 1 1
is_linear=0
shrinkage=0.05


Tree=59
num_leaves=101
num_cat=22
split_feature=2 3 2 2 1 0 2 3 3 3 2 2 3 3 0 2 1 2 2 3 2 3 2 2 1 2 1 2 1 0 2 2 2 3 2 3 3 2 2 3 3 2 3 2 1 2 3 0 1 1 1 2 3 3 2 2 2 3 3 2 2 2 2 2 2 2 2 2 2 2 2 2 1 2 2 3 3 2 2 2 1 2 3 2 3 0 2 3 2 3 2 2 2 2 0 1 1 0 1 1
split_gain=60.0395 10.8771 7.43108 6.52875 2.91655 2.88253 3.49319 1.97947 3.02429 2.23086 1.9 4.00632 2.25084 3.82864 1.69642 5.21056 1.65097 4.77316 3.53288 1.39675 5.08101 1.24867 0.997741 3.42341 1.30714 0.974253 0.774834 0.757199 0.691185 0.631505 0.585022 0.820792 0.707116 0.593318 1.14261 1.9701 1.19366 0.725898 0.53213 0.501727 2.17894 0.353919 0.333456 0.305683 0.255831 0.301659 0.247988 0.218144 0.229837 0.155123 0.144011 0.141085 0.138312 0.922153 0.346364 0.136145 0.125462 0.147505 0.0948384 0.149989 0.0950155 0.0880281 0.0861322 0.0783758 0.0724859 0.0517774 0.038974 0.0388731 0.0371982 0.0731173 0.0213219 0.0193591 0.018212 0.0169664 0.0151188 0.0147904 0.0145704 0.0143577 0.00927115 0.00888063 0.00580166 0.0056575 0.00431154 0.00389459 0.00382889 0.00210172 0.00202979 0.0015199 0.0014426 0.00118907 0.00108471 0.00106407 0.000738162 0.000565862 6.55564e-05 5.76508e-06 4.75171e-06 1.63976e-06 1.64458e-06 6.62943e-08
threshold=15.500000000000002 1.0000000180025095e-35 1.0000000180025095e-35 78.500000000000014 0 1 7.5000000000000009 29.500000000000004 2.5000000000000004 6.5000000000000009 43.500000000000007 41.500000000000007 17.500000000000004 1.0000000180025095e-35 2 42.500000000000007 3 26.500000000000004 21.500000000000004 6.5000000000000009 17.500000000000004 52.500000000000007 4.5000000000000009 6.5000000000000009 4 1.0000000180025095e-35 5 1.5000000000000002 6 7 204.50000000000003 207.50000000000003 79.500000000000014 1.0000000180025095e-35 81.500000000000014 5.5000000000000009 2.5000000000000004 94.500000000000014 81.500000000000014 34.500000000000007 38.500000000000007 736.00000000000011 151.50000000000003 5.5000000000000009 8 127.50000000000001 26.500000000000004 9 10 11 12 68.500000000000014 1.5000000000000002 2.5000000000000004 248.50000000000003 5.5000000000000009 2.5000000000000004 8.5000000000000018 3.5000000000000004 48.500000000000007 64.500000000000014 95.500000000000014 13.500000000000002 13.500000000000002 8.5000000000000018 54.500000000000007 2.5000000000000004 9.5000000000000018 13.500000000000002 7.5000000000000009 13.500000000000002 49.500000000000007 13 73.500000000000014 1.0000000180025095e-35 2.5000000000000004 1.5000000000000002 10.500000000000002 66.500000000000014 14.500000000000002 14 11.500000000000002 2.5000000000000004 14.500000000000002 2.5000000000000004 15 3.5000000000000004 2.5000000000000004 9.5000000000000018 1.5000000000000002 3.5000000000000004 3.5000000000000004 6.5000000000000009 5.5000000000000009 16 17 18 19 20 21
decision_type=2 2 2 2 1 9 2 2 2 2 2 2 2 2 9 2 1 2 2 2 2 2 2 2 1 2 1 2 1 9 2 2 2 2 2 2 2 2 2 2 2 2 2 2 1 2 2 9 1 1 1 2 2 2 2 2 2 2 2 2 2 2 2 2 2 2 2 2 2 2 2 2 1 2 2 2 2 2 2 2 1 2 2 2 2 9 2 2 2 2 2 2 2 2 9 1 1 9 1 1
left_child=1 2 94 10 5 6 7 8 25 -10 11 12 13 16 15 -13 18 -18 -2 26 -21 56 27 24 43 -3 -15 28 29 -4 32 -32 -5 38 -35 36 -36 -37 -34 41 -41 52 50 -24 45 -40 47 71 58 68 -42 65 54 -54 -33 74 57 76 59 -49 -60 -46 67 64 92 -50 85 -8 69 -25 77 -12 78 -53 82 88 -6 -51 -73 -70 86 -69 89 -72 -66 -29 -68 -78 -57 -7 -76 -82 -58 -26 95 -1 -87 99 -99 -96
right_child=3 4 22 30 21 55 62 -9 9 -11 46 14 -14 19 -16 -17 17 -19 -20 20 -22 -23 23 49 93 -27 -28 66 -30 -31 31 39 33 34 35 37 -38 -39 44 40 42 -43 -44 -45 61 -47 -48 48 51 70 -52 73 53 -55 -56 75 63 -59 60 -61 -62 -63 -64 -65 84 -67 80 81 79 -71 83 72 -74 -75 90 -77 87 -79 -80 -81 91 -83 -84 -85 -86 96 -88 -89 -90 -91 -92 -93 -94 -95 97 -97 -98 98 -100 -101
leaf_value=-0.024758029092080108 -0.015927668063456104 0.0079805085637328424 -0.0032819077618013309 0.013672704593120703 -0.023406265911725607 -0.02334202621293947 -0.017781137643032619 -0.012283203515513571 0.042265743859424672 0.010520074498448294 -0.0035141449687935799 0.038378183958011083 0.013922281355830974 -0.012710122561738752 0.039147478654096977 -0.012893919422338754 0.019175258417565164 -0.0069227900700044561 0.0046047806879730459 0.041887769662804462 -0.010173764631557234 0.0066807414178748281 0.011603990459320583 -0.019791821503164733 -0.016942524076532389 -0.0058637882721659547 -0.0048582778469806066 -0.021307156112096371 -0.023133027102460884 -0.023164274472825295 0.015066819820584321 -0.00022943553355270321 -0.0095757098776051916 0.018412793717231382 0.0039874688306240514 -0.0066202016383422324 0.011128521142749308 0.0017330358473430598 -0.0025223989760160786 0.020932900560372853 0.0029901788046080013 0.0079107467628197654 0.0094043112702185128 0.0017580401213201963 0.0067549917409133386 0.0026862449921443536 0.0055262842819953735 -0.010721731152313117 -0.0058154543372064844 -0.012129237693116817 0.0061889873715671017 -0.0010723664412040416 0.012301265468494504 0.0037949562378238378 0.0042665684819002741 -0.015207509495804704 -0.015676372215142276 -0.011404864459041488 -0.0022746386948133872 -0.0062327710498044538 -0.0075628898457323528 0.0028891591838783063 -0.021177004989584549 -0.018968361284961786 -0.01011356038715005 -0.0031165877677669391 -0.020594243866133236 -0.013220075711460402 -0.019533230181530595 -0.014215027880432546 -0.014845173629605746 -0.00051223904843024717 0.0012230602538002532 0.0016856177616558 -0.019499745777171319 -0.0098261920469828474 -0.021320947555717507 -0.0091876366052814819 -0.0026062182355732493 -0.017073893901042459 -0.018709869451329124 -0.0097797041982792387 -0.019975211038233971 -0.012824313012053333 -0.0077271418350192455 -0.022639429035860616 -0.019326844920489222 -0.019816166119359352 -0.01355331362517309 -0.021865158231818588 -0.017964763016344677 -0.01758088546731093 -0.016639140180524578 -0.016032146771916861 -0.024824461658894598 -0.024776872636158138 -0.022583129789274448 -0.024785181232178467 -0.024829265670502421 -0.024820853898367742
leaf_weight=92.484385684132576 27.90711684525013 38.65458482503891 22.396507859230042 16.92522457242012 10.75432881340385 3.8692065998911875 4.1294238418340701 12.019576102495192 10.248809486627581 12.029827982187269 7.0473793447017661 9.4796292781829834 25.415011808276176 74.995017111301422 7.75905613601208 10.382214024662971 45.441790714859962 28.512740671634674 84.039558202028275 6.3939178287982967 17.551035776734352 6.0248993933200827 18.913106188178062 8.0396858155727404 3.6758391708135596 18.931602880358696 54.075342953205109 3.8523695915937424 8.5339840315282327 4.8604698702693012 21.870733797550201 56.528009355068207 10.996532231569288 13.906673252582548 133.60980704426765 29.596327066421509 104.12251830101013 214.50962772965431 55.253515392541885 25.908206105232239 84.400737106800079 68.482660293579102 41.571769654750824 13.517041072249411 18.355019509792328 55.941010802984238 6.1078393161296836 24.214874401688576 34.171001702547073 10.050330802798277 60.339714407920837 13.010817170143129 36.08793443441391 272.02382051944733 176.86738902330399 2.0850403159856779 4.3584474846720713 3.8075927272438994 22.223288476467133 80.369408056139946 13.748954400420187 74.473659247159958 8.663270950317381 8.1423069015145284 4.1520645543932906 37.028591513633728 5.8729077354073524 2.0388276502490044 10.661049172282221 21.854119904339314 4.9133832752704603 12.303425982594492 9.4220027327537554 9.7588018774986249 1.9610968977212904 3.0125382915139198 2.9242706447839728 7.0636177211999884 9.2678424119949323 5.5981986597180358 4.8741010278463364 2.8870907425880432 1.711309842765331 4.6314467489719391 2.8240184709429741 8.5050754398107529 6.8366071581840515 3.9376057684421539 3.5826473981142044 2.1040418148040771 2.785907156765461 3.6499471664428711 3.6650552377104759 3.1866291165351868 55.866914797574282 72.338336046785116 6.7005509585142145 5.8309763669967634 3.3201388791203499 16.492252819240093
leaf_count=1572 143 128 120 24 96 63 32 20 30 19 30 33 22 358 17 29 129 119 300 8 65 13 54 58 42 66 171 59 103 79 20 71 23 18 272 56 192 400 143 21 80 38 27 57 43 119 17 79 97 103 45 34 36 293 173 25 46 15 98 284 39 130 22 18 38 96 83 22 38 244 25 51 32 27 28 28 35 67 30 32 62 28 18 21 23 104 95 41 32 32 31 46 20 36 959 1239 53 100 57 283
internal_value=0 -0.0147769 -0.0190693 0.00284896 -0.00448973 -0.000544503 0.00271421 0.00663401 0.00948103 0.025124 -0.00128135 0.000962726 -0.000429137 -0.00150534 0.019322 0.0115771 0.00331606 0.00911331 -0.000513741 -0.00736294 0.003728 -0.0146833 -0.0115884 -0.0085891 0.00330506 0.00342916 -0.00942051 -0.0160077 -0.0107153 -0.00682734 0.00461124 0.0055069 0.00357232 0.0033318 0.0042832 0.0038754 0.00711512 0.000720258 0.00113829 0.0052526 0.00734662 0.00452408 0.00545734 0.00750015 0.00171576 9.80251e-05 -0.00443762 -0.0046609 -0.00523058 -0.0150077 0.00432371 -0.00331625 0.00409578 0.00479127 0.00317764 -0.0174623 -0.0175715 -0.0203288 -0.00651041 -0.00727212 -0.00429586 0.00365355 -0.0176129 -0.015019 -0.0128751 -0.00441186 -0.0207089 -0.0142031 -0.0167617 -0.0157149 -0.0119711 -0.00114872 -0.000610863 0.000109674 -0.0208174 -0.0126571 -0.0222576 -0.0109151 -0.00141189 -0.0186865 -0.0192356 -0.0112037 -0.0221879 -0.0138646 -0.0091475 -0.0223503 -0.0199125 -0.0204574 -0.0141619 -0.0228218 -0.0185989 -0.0182264 -0.0161162 -0.0165198 -0.0247844 -0.0247663 -0.0226146 -0.0248211 -0.0248012 -0.0248236
internal_weight=0 615.825 434.52 2242.4 181.305 130.715 109.603 91.8844 79.8648 22.2786 670.627 391.952 364.332 338.917 27.6209 19.8618 185.901 73.9545 111.947 153.015 23.945 50.5906 188.187 112.104 39.2926 57.5862 129.07 76.0825 35.791 27.257 1571.77 844.081 727.69 710.765 495.745 481.838 237.732 244.106 215.02 822.21 212.22 609.99 186.312 32.4301 204.023 111.195 278.674 272.566 234.526 72.8118 144.74 93.9692 541.507 308.112 233.395 21.1118 44.5657 21.4238 140.557 104.584 35.9722 92.8287 17.7186 23.1419 14.9996 71.1996 40.2916 9.05534 46.1531 29.8938 26.6588 38.0407 30.9933 22.7696 12.4316 8.68023 17.6162 17.1139 21.5713 16.2592 21.2336 4.92592 7.68456 9.54483 6.97608 19.058 12.7095 6.86188 5.66769 5.97325 4.747 8.52405 8.0235 6.86247 246.333 164.823 15.2056 81.5103 9.15112 72.3592
internal_count=11292 6760 5791 4532 969 624 367 263 243 49 2308 1394 1315 1293 79 62 691 248 443 602 73 345 1581 777 189 194 529 804 302 199 2224 804 1420 1396 938 920 464 456 458 784 173 611 152 111 435 262 914 897 754 588 125 254 573 329 244 257 332 187 500 363 137 173 104 145 127 193 502 82 372 302 216 143 113 61 172 85 172 170 81 70 286 50 113 46 61 216 178 76 57 95 59 108 66 78 4210 2811 157 1399 157 1242
cat_boundaries=0 1 2 3 4 5 6 7 8 9 10 11 12 13 14 15 16 17 18 19 20 21 22
cat_threshold=1 2 2 1 1 1 1 2 1 1 1 1 1 1 1 1 2 1 1 1 1 1
is_linear=0
shrinkage=0.05


Tree=60
num_leaves=87
num_cat=18
split_feature=2 3 2 2 0 1 2 1 2 3 3 3 2 2 2 3 2 2 2 3 3 1 3 3 0 2 2 2 2 2 2 3 2 2 2 3 2 2 2 3 2 2 3 2 2 3 3 1 2 3 2 2 2 0 2 2 2 2 2 1 1 1 2 1 3 3 2 3 2 3 2 3 2 3 3 3 3 0 1 1 3 3 1 0 1 1
split_gain=52.2281 10.1779 7.40128 3.60227 5.29483 3.90806 3.39821 2.93731 3.68612 3.12619 10.2135 2.52422 2.61963 1.90504 5.28469 2.35789 1.89485 1.84988 2.38499 1.93323 1.8386 1.53528 2.19739 5.55192 1.64916 1.52421 7.54889 4.74521 1.96519 4.87796 1.4166 1.14549 0.830002 0.693397 1.17412 0.544365 0.514334 1.79297 0.412537 0.335508 1.66921 2.99195 0.309672 0.449671 0.72375 0.244386 0.219741 0.174687 0.167241 0.141431 0.129328 0.0896188 0.157346 0.0603086 0.0594032 0.0509101 0.0452877 0.10327 0.0341787 0.0307879 0.0304137 0.0171372 0.0165367 0.0163513 0.0137614 0.0133315 0.0119077 0.00824034 0.00663156 0.00659713 0.00562729 0.00535676 0.00325708 0.00310587 0.00275177 0.00247488 0.00167799 0.00167777 0.00233159 0.00111817 0.000636956 0.000448827 0.000220195 1.72704e-06 2.12181e-06 1.19346e-06
threshold=1.0000000180025095e-35 1.0000000180025095e-35 14.500000000000002 7.5000000000000009 0 1 242.50000000000003 2 23.500000000000004 26.500000000000004 17.500000000000004 1.5000000000000002 6.5000000000000009 3.5000000000000004 1.5000000000000002 1.0000000180025095e-35 26.500000000000004 25.500000000000004 22.500000000000004 1.5000000000000002 7.5000000000000009 3 6.5000000000000009 3.5000000000000004 4 56.500000000000007 54.500000000000007 26.500000000000004 82.500000000000014 85.500000000000014 15.500000000000002 86.500000000000014 245.50000000000003 126.50000000000001 119.50000000000001 1.5000000000000002 1.5000000000000002 2.5000000000000004 13.500000000000002 31.500000000000004 317.50000000000006 288.50000000000006 15.500000000000002 469.50000000000006 520.50000000000011 9.5000000000000018 14.500000000000002 5 78.500000000000014 9.5000000000000018 23.500000000000004 369.50000000000006 548.00000000000011 6 9.5000000000000018 2.5000000000000004 474.50000000000006 334.50000000000006 18.500000000000004 7 8 9 12.500000000000002 10 1.5000000000000002 1.5000000000000002 6.5000000000000009 1.5000000000000002 4.5000000000000009 1.0000000180025095e-35 5.5000000000000009 1.5000000000000002 1.5000000000000002 1.5000000000000002 1.5000000000000002 1.0000000180025095e-35 1.5000000000000002 11 12 13 2.5000000000000004 2.5000000000000004 14 15 16 17
decision_type=2 2 2 2 9 1 2 1 2 2 2 2 2 2 2 2 2 2 2 2 2 1 2 2 9 2 2 2 2 2 2 2 2 2 2 2 2 2 2 2 2 2 2 2 2 2 2 1 2 2 2 2 2 9 2 2 2 2 2 1 1 1 2 1 2 2 2 2 2 2 2 2 2 2 2 2 2 9 1 1 2 2 1 9 1 1
left_child=1 77 3 4 5 11 7 8 9 10 20 13 80 14 -2 -15 53 18 19 30 -4 22 23 24 35 26 27 -19 48 -30 -9 49 -8 34 -18 -3 -7 -38 46 42 41 -41 43 47 -45 -35 54 -34 -27 65 -20 -42 -53 67 63 69 57 -44 -21 62 75 64 -56 73 66 -23 -57 -10 -63 72 -39 -61 82 -5 -26 -40 -65 78 -1 -74 -13 -67 -6 85 -85 -79
right_child=2 21 6 38 55 36 32 17 16 -11 -12 12 -14 15 -16 -17 33 25 50 58 -22 31 -24 -25 74 28 -28 -29 29 -31 -32 -33 39 45 -36 -37 37 70 60 40 51 -43 56 44 -46 -47 -48 -49 -50 -51 -52 52 -54 -55 59 61 -58 -59 -60 71 -62 68 -64 76 -66 81 -68 -69 -70 -71 -72 -73 79 -75 -76 -77 -78 83 -80 -81 -82 -83 -84 84 -86 -87
leaf_value=-0.024359147414668419 0.017088951326164666 -0.0011897730977428079 0.0075203532727112143 -0.015208375538189387 -0.023114940243949791 -0.0225816499848152 0.016401056395432014 -0.013555026128012085 -0.017178320175886483 -0.021935300120865697 0.057871248706846727 -0.022313710075013014 0.01189061967672516 0.012035158491170116 -0.022148864741332888 0.038726638805650804 -0.0010261698534786202 0.047471654040663447 -0.020098286782819365 -0.016655880184833539 -0.020301084143636211 -0.023828018574249488 -0.01532831732695651 0.063993467961164008 -0.023391470234458017 -0.0017252202489555963 0.059608910899241696 0.0050676205215589368 0.037746425314381486 0.0048286525031700873 0.0103258521446483 0.012724962026487322 0.0033893758426625218 0.0002989696815449901 -0.010504134903197498 0.011189231283221669 0.010656559422255178 -0.01683597229637885 -0.020063011756884627 0.0026004714652945425 0.0029591988359913952 0.029414819952465612 0.00091319284371350451 0.01445384169414704 0.0059838745631109261 0.0033380974084974316 0.0038483972542041668 0.0061212969263346731 -0.0078602207878864065 -0.012558625288133811 -0.012247461406788968 0.0078622573920469254 0.0044012846805142067 -0.010350801415475357 -0.013068563514771342 -0.01972573793789241 0.000394273362417329 0.005772775554227263 -0.011608854368000431 -0.0097730849908458529 -0.01708199655298797 -0.017372031448645839 -0.0096784294311182406 -0.012167888634405877 -0.014989223165039797 -0.021246159009689403 -0.015493180529541002 -0.014913748642302951 -0.013671542331779233 -0.019263132265191898 -0.015155215401995834 -0.0074848116835196793 -0.021775091055751799 -0.017346033915949671 -0.021354159997529064 -0.02133915100141515 -0.013822704298561587 -0.024826486231092064 -0.024749199446472248 -0.020109392890283358 -0.021617087795698611 -0.020339241454913851 -0.022379647010887162 -0.024778488112900985 -0.024829264529979415 -0.024810425135359623
leaf_weight=85.401703476905823 23.535352736711502 20.052830994129181 93.135877273976803 10.651015393435953 5.0497553050518027 7.9560830965638152 19.595539808273315 7.2091805040836325 11.936055764555933 7.8784295320510855 10.378183364868162 6.2504849135875702 10.116916090250015 38.116708874702454 13.505464911460875 10.5680715739727 458.73789864778519 7.006518065929412 11.862735733389856 7.042609900236128 6.3427895456552497 9.3612900972366386 18.382637619972229 3.6837050616741172 3.9599345102906218 66.099278420209885 7.3903064727783194 113.02440854907036 11.67972895503044 308.94562873244286 44.801418349146843 3.0295767188072196 148.19544053077698 184.97826159000397 35.181469231843948 15.94073364138603 8.8171303272247332 13.027226492762567 10.751685574650766 19.973978519439697 31.34717208147049 21.710403978824615 24.665346324443817 33.336214661598206 103.60737359523773 102.9705423116684 2.1888199001550666 96.693688750267029 13.352375686168669 4.494666948914527 9.4041443616151792 58.842675149440765 74.31404185295105 5.3072961717844036 15.417213156819345 11.980810940265656 24.675337433815002 19.635481536388397 6.4054888337850571 10.42138287425041 10.552356444299223 2.0577546507120159 4.6918174400925627 5.5536246523261079 2.3332705646753302 2.4193256199359885 1.9293257966637618 6.0548926293849936 2.9411762058734894 2.2551002316176882 8.0618519783020002 3.3893598690628997 2.935564249753952 2.0217447131872186 2.8505367860198021 5.8754133880138388 2.1154159754514694 53.190097600221634 69.48587991297245 1.5340290069580076 6.9078087732195854 3.1281062811613083 1.275329042226075 5.0625256486237031 3.4659957736730576 14.780438542366026
leaf_count=1488 128 74 371 126 84 93 14 26 43 4 2 27 15 177 166 31 1536 21 18 22 10 79 31 18 66 178 20 371 21 488 133 6 176 344 47 41 76 151 39 23 27 20 29 22 63 179 8 94 25 15 32 46 47 31 169 136 18 19 27 101 37 28 47 59 26 29 25 23 35 33 72 30 46 16 44 16 16 936 1220 24 29 31 21 89 61 260
internal_value=0 -0.0191402 0.0023631 -0.00553719 -0.00157472 0.00255586 0.00330806 0.00200836 0.000225256 0.00848881 0.0106707 0.00736296 -0.00723954 0.0113277 0.00278244 0.0178291 -0.00098308 0.00468756 -0.00207974 0.00264642 0.00574645 -0.00459337 -0.000694232 0.00509252 2.35195e-05 0.00580016 0.0105626 0.00754285 0.00428335 0.00602778 0.00701573 -0.0158687 0.00626079 -0.000564373 -0.00170128 0.00429261 -0.0112832 -0.00827737 -0.0141205 0.00595835 0.00762907 0.0165661 0.00519421 0.00575119 0.00804572 0.00138576 -0.0116838 0.00446807 -0.00275625 -0.0203332 -0.0166267 0.00536447 0.00593071 -0.0150345 -0.0123103 -0.0192648 0.00211094 0.00306711 -0.0142519 -0.0110292 -0.0191815 -0.0177548 -0.0122776 -0.0144466 -0.0185426 -0.022677 -0.0191387 -0.0164162 -0.0151948 -0.0217228 -0.0161935 -0.00921151 -0.0222366 -0.0155494 -0.0225387 -0.020514 -0.0126244 -0.0246288 -0.0245341 -0.0212034 -0.021948 -0.0207348 -0.0229667 -0.0248203 -0.0247991 -0.024823
internal_weight=0 318.69 2478.5 264.785 181.155 146.863 2213.72 1537.13 922.902 117.735 109.857 109.001 23.2752 85.7256 37.0408 48.6848 805.166 614.224 86.7256 65.4587 99.4787 87.3033 64.8704 46.4877 42.804 527.498 127.421 120.031 400.077 320.625 52.0106 22.433 676.593 781.868 493.919 35.9936 37.8623 29.9062 83.6298 656.997 206.188 41.6844 450.809 381.833 136.944 287.949 56.4504 244.889 79.4517 19.4034 21.2669 164.504 133.157 23.2982 54.2616 34.2921 68.9762 44.3008 13.4481 33.9198 27.1795 21.2423 20.109 20.3418 16.2434 14.9087 13.9101 17.9909 4.99893 13.0498 21.0891 13.8107 10.7947 12.6728 6.81047 16.6271 7.66904 231.387 154.888 4.46959 13.1583 5.54743 6.32508 76.4991 8.52852 67.9705
internal_count=11145 4488 6657 2087 1423 965 4570 3972 2590 387 383 573 71 502 294 208 2203 1382 258 208 381 434 274 243 225 1124 412 392 712 509 159 160 598 2106 1583 115 392 299 664 584 163 43 421 355 85 523 572 270 203 154 50 120 93 97 564 458 66 48 49 347 92 250 216 217 187 139 161 66 63 208 223 131 175 142 110 55 75 4054 2708 70 56 60 105 1346 150 1196
cat_boundaries=0 1 2 3 4 5 6 7 8 9 10 11 12 13 14 15 16 17 18
cat_threshold=2 1 1 1 2 1 2 1 1 1 1 2 1 1 1 1 1 1
is_linear=0
shrinkage=0.05


Tree=61
num_leaves=86
num_cat=17
split_feature=2 3 2 2 0 1 2 1 2 3 3 3 2 2 3 2 2 3 2 2 3 1 3 3 0 2 2 2 2 2 2 3 2 2 2 2 3 2 2 2 3 3 2 2 2 2 3 2 3 3 2 0 2 2 2 2 2 3 1 1 1 2 1 3 3 2 3 3 2 2 3 2 3 3 3 0 1 3 1 3 3 1 0 1 1
split_gain=50.5342 10.1618 7.0417 3.49829 5.1282 3.72065 3.2045 2.68096 3.60849 2.98172 8.99839 2.37266 2.53558 1.78051 1.76157 1.7544 5.03866 2.08972 1.70653 2.30522 1.84717 1.49114 2.11202 4.91843 1.59788 1.47717 6.62718 4.24231 1.79029 4.45132 1.34229 1.11563 0.608802 1.21785 0.510374 1.72917 0.51019 0.410572 0.294862 3.38185 0.465334 2.12253 0.583721 2.52471 0.332568 0.229187 0.213273 0.16105 0.147886 0.142265 0.12923 0.0598291 0.0586932 0.0513731 0.0339317 0.0325055 0.0537674 0.0514513 0.0306299 0.0302588 0.0171676 0.0162935 0.0162347 0.0138022 0.0135679 0.0119631 0.00823023 0.00668712 0.00660835 0.00561856 0.00523258 0.00331206 0.00310082 0.00280069 0.00250537 0.00171908 0.00238818 0.00165933 0.00113327 0.000647365 0.000454539 0.000224373 1.77006e-06 2.17492e-06 1.2235e-06
threshold=1.0000000180025095e-35 1.0000000180025095e-35 14.500000000000002 7.5000000000000009 0 1 218.50000000000003 2 23.500000000000004 26.500000000000004 17.500000000000004 1.5000000000000002 6.5000000000000009 26.500000000000004 7.5000000000000009 3.5000000000000004 1.5000000000000002 1.0000000180025095e-35 25.500000000000004 22.500000000000004 1.5000000000000002 3 6.5000000000000009 3.5000000000000004 4 56.500000000000007 54.500000000000007 26.500000000000004 82.500000000000014 85.500000000000014 15.500000000000002 86.500000000000014 27.500000000000004 35.500000000000007 1.5000000000000002 2.5000000000000004 1.5000000000000002 13.500000000000002 471.50000000000006 456.50000000000006 32.500000000000007 38.500000000000007 243.50000000000003 238.50000000000003 500.00000000000006 250.50000000000003 14.500000000000002 78.500000000000014 112.50000000000001 9.5000000000000018 23.500000000000004 5 9.5000000000000018 2.5000000000000004 18.500000000000004 978.00000000000011 786.00000000000011 2.5000000000000004 6 7 8 12.500000000000002 9 1.5000000000000002 1.5000000000000002 6.5000000000000009 1.5000000000000002 1.0000000180025095e-35 4.5000000000000009 5.5000000000000009 1.5000000000000002 1.5000000000000002 1.5000000000000002 1.5000000000000002 1.0000000180025095e-35 10 11 1.5000000000000002 12 2.5000000000000004 2.5000000000000004 13 14 15 16
decision_type=2 2 2 2 9 1 2 1 2 2 2 2 2 2 2 2 2 2 2 2 2 1 2 2 9 2 2 2 2 2 2 2 2 2 2 2 2 2 2 2 2 2 2 2 2 2 2 2 2 2 2 9 2 2 2 2 2 2 1 1 1 2 1 2 2 2 2 2 2 2 2 2 2 2 2 9 1 2 1 2 2 1 9 1 1
left_child=1 75 3 4 5 11 7 8 9 10 14 15 79 51 -4 16 -2 -17 19 20 30 22 23 24 36 26 27 -20 47 -30 -9 49 -15 -34 -7 -36 -3 46 39 40 42 -42 43 -8 -40 -44 52 -27 -43 64 -21 66 62 67 -22 56 57 -46 74 61 63 -54 72 65 -23 -55 -10 71 -62 -37 -61 81 -5 -26 -39 76 -1 -64 -73 -13 -66 -6 84 -84 -77
right_child=2 21 6 37 53 34 38 18 13 -11 -12 12 -14 32 -16 17 -18 -19 25 50 54 31 -24 -25 73 28 -28 -29 29 -31 -32 -33 33 -35 35 69 -38 58 44 -41 41 48 45 -45 55 -47 -48 -49 -50 -51 -52 -53 59 60 -56 -57 -58 -59 -60 70 68 -63 77 -65 80 -67 -68 -69 -70 -71 -72 78 -74 -75 -76 82 -78 -79 -80 -81 -82 -83 83 -85 -86
leaf_value=-0.024347555070841232 0.016378700367893087 -0.0011616296787144403 0.0072779851261572234 -0.015060938531026098 -0.023074851268011391 -0.022530317770815003 0.0037656713220706167 -0.01340116309967565 -0.017045754115757452 -0.021871118929134781 0.053221119091424601 -0.022256947408142477 0.011456581914035131 0.0093775278187070796 -0.020208217139573628 0.011594149651870223 -0.022088833943305325 0.036312383105058028 0.044119604001958364 -0.020002240008470361 -0.016518605346992621 -0.023803874275913912 -0.015181561529293239 0.058487448717434332 -0.023357442059202219 -0.0016853262797356583 0.054722720280279837 0.0049164971840672238 0.035428438017974531 0.0045016071139312042 0.0099647132826852294 0.012250113615996682 -0.0089548119109316877 -0.00042027416855915805 0.010280411020200329 -0.016700258167938811 0.010788458788028307 -0.019966419859231439 -0.00045720326189631816 0.026874195123907419 0.021311713208083755 0.0039160177076128589 -0.0012624187135317517 0.026799545401387799 0.0040127988285061931 0.004235653906388471 0.003738246243221536 -0.0077263149225393728 0.0085477522416534495 -0.012403551024012012 -0.012092418888028075 -0.01020015958122495 -0.012913859378487698 -0.019624067529350614 -0.011454486140517217 0.0062313804731562415 0.0031500105715598602 0.0060271924435820502 -0.016948520979404674 -0.0096252182190304236 -0.017241351683743238 -0.0095310811033092885 -0.012012885556349268 -0.014840617584339428 -0.021169217236666864 -0.015347408964379992 -0.014764763075128915 -0.019154872046370813 -0.0135179518250544 -0.015007486086288989 -0.0073545044988975366 -0.021707856184975297 -0.01721509684964679 -0.02127915433423834 -0.021263874335098003 -0.024826415478318219 -0.024747192416115785 -0.013669506993583078 -0.020013518916579577 -0.021546894025211559 -0.020246982941757394 -0.022324206603437816 -0.024777215651063014 -0.024829265376349111 -0.024809950452557569
leaf_weight=83.346522510051727 23.941002175211906 20.028986513614655 93.83893221616745 10.490256726741789 4.934369444847106 7.7784349620342246 52.287803530693054 7.1121189296245566 11.732765495777132 7.7074954509735099 10.996500492095945 6.112558051943779 10.237930327653885 14.563072264194487 6.2153223603963843 38.578220635652542 13.209622859954832 10.985365331172941 7.3471501916646949 11.626695156097414 6.9262804910540563 9.1408657580614143 18.103011727333069 3.9271443188190451 3.8683807030320159 65.985340446233749 7.8442293703556052 113.59862819314003 12.129023343324659 285.52536258101463 45.266427651047707 3.0683741867542258 44.557029992341995 675.46881417930126 8.9115926548838633 12.809736512601377 16.120100051164627 10.538124248385431 29.988318562507629 19.710143446922302 25.253532707691193 72.890209317207336 20.399870693683624 15.400310039520262 50.389971375465393 267.49691522121429 2.1972595751285544 13.247834324836729 22.570177435874939 4.4385731220245352 9.2896698713302595 5.2526446431875256 15.21704310923815 11.746796302497387 6.3315585106611252 52.86908483505249 37.891923785209656 85.460101962089539 10.373631894588472 10.32002993673086 2.0223160609602919 4.6466269940137854 5.4864581152796754 2.2985574528574935 2.3684664368629447 1.8996647521853454 5.9652615040540686 2.2120756320655337 2.9012394100427628 7.9405941516160956 3.3640858978033057 2.8723331019282341 1.9869778528809554 2.790311262011528 5.7513653486967078 51.885833233594894 67.787267938256264 2.0863764211535454 1.5034886598587034 6.7600845471024513 3.0651256144046783 1.2471046708524216 4.9386251010000688 3.3809972293674946 14.418241679668425
leaf_count=1488 128 74 371 126 84 93 74 26 43 4 2 27 15 33 10 177 166 31 21 18 22 79 31 18 66 178 20 371 21 457 133 6 237 1766 76 151 41 39 21 14 23 73 22 14 34 295 8 25 19 15 32 31 169 136 27 26 22 62 37 101 28 47 59 26 29 25 23 33 35 72 30 46 16 44 16 936 1220 16 24 29 31 21 89 61 260
internal_value=0 -0.0190308 0.00229749 -0.0054329 -0.00154231 0.0024811 0.00321408 0.0018545 9.82185e-05 0.00820181 0.010289 0.00712143 -0.00711423 -0.00117217 0.00557056 0.0109154 0.00270082 0.0170727 0.00445319 -0.00203431 0.00257203 -0.00450397 -0.000682155 0.00493426 2.13472e-05 0.0055636 0.0101865 0.00729799 0.00398387 0.00576183 0.00679202 -0.015726 -0.000743703 -0.000948413 -0.0111305 -0.00814106 0.00416732 -0.0139684 0.00586697 0.0065788 0.00573894 0.00842123 0.00482836 0.00900631 0.00449099 0.00384607 -0.0115294 -0.00269538 0.00501112 -0.0202409 -0.0164892 -0.0148862 -0.0121553 -0.0191566 -0.0141001 0.00514581 0.00481547 0.00528001 -0.0190721 -0.0108762 -0.0176281 -0.0121225 -0.0142956 -0.018425 -0.0226277 -0.0190287 -0.0162769 -0.0216545 -0.0150473 -0.0160525 -0.00906699 -0.0221783 -0.015404 -0.0224865 -0.0204245 -0.0246238 -0.0245268 -0.0124693 -0.0211257 -0.0218841 -0.020649 -0.0229234 -0.0248201 -0.0247984 -0.0248228
internal_weight=0 312.677 2484.5 263.361 180.903 147.265 2221.14 1468.53 876.298 118.758 111.051 109.825 23.1106 757.54 100.054 86.7142 37.1506 49.5636 592.23 86.5528 65.6364 86.9193 64.8379 46.7349 42.8078 505.678 128.79 120.946 376.888 297.654 52.3785 22.0814 734.589 720.026 37.4404 29.6619 36.1491 82.4582 752.608 496.009 476.299 120.714 355.585 67.6881 256.599 287.897 55.7951 79.2332 95.4604 19.013 20.9164 22.9507 53.5979 33.6379 13.2578 226.611 173.742 135.85 26.6631 33.5478 20.8686 19.8637 20.0501 15.945 14.5745 13.6465 17.698 12.7694 4.92356 20.7503 13.6841 10.5573 12.4772 6.65869 16.2895 225.757 151.134 7.57283 4.37582 12.8726 5.43359 6.18147 74.6237 8.31962 66.3041
internal_count=11145 4488 6657 2087 1423 965 4570 3871 2520 387 383 573 71 2133 381 502 294 208 1351 258 208 434 274 243 225 1093 412 392 681 478 159 160 2036 2003 392 299 115 664 699 534 520 115 405 88 165 317 572 203 92 154 50 97 564 458 49 144 118 96 92 347 250 216 217 187 139 161 66 208 63 223 131 175 142 110 55 4054 2708 75 70 56 60 105 1346 150 1196
cat_boundaries=0 1 2 3 4 5 6 7 8 9 10 11 12 13 14 15 16 17
cat_threshold=2 1 1 1 2 2 1 1 1 1 2 1 1 1 1 1 1
is_linear=0
shrinkage=0.05


Tree=62
num_leaves=86
num_cat=18
split_feature=2 3 2 2 0 1 2 1 2 3 2 2 2 3 2 2 2 2 2 3 3 2 3 2 2 3 1 3 3 0 2 3 2 3 2 2 2 2 3 2 3 2 2 3 2 2 3 1 3 2 2 2 0 2 2 2 2 2 1 1 1 1 2 3 3 2 3 3 2 2 3 2 3 3 3 0 1 3 1 3 3 1 0 1 1
split_gain=48.8931 10.1438 6.6999 3.39639 4.96658 3.54291 3.0209 2.62737 3.28058 2.85251 4.13907 9.66286 5.29284 2.23147 2.45484 1.77068 1.64674 3.96991 2.22789 2.03911 2.57423 1.9206 1.76521 1.61777 4.80765 1.859 1.44797 2.03007 4.38271 1.54831 1.27243 1.0868 0.732587 0.647924 1.10594 0.998831 0.506273 1.66781 0.478402 0.408445 0.293331 1.48801 2.68204 0.288963 0.419322 0.668538 0.206953 0.161311 0.14306 0.129082 0.0876062 0.141552 0.0593273 0.0579648 0.0518245 0.0417376 0.0929638 0.0336714 0.0308374 0.0297252 0.0171912 0.0161117 0.0160465 0.0138378 0.0138062 0.0120146 0.00821666 0.00677675 0.00658237 0.00560746 0.0051091 0.00336737 0.00309445 0.00285001 0.00253556 0.00176138 0.0024461 0.00164011 0.0011483 0.000657821 0.000460205 0.0002286 1.81471e-06 2.22938e-06 1.25405e-06
threshold=1.0000000180025095e-35 1.0000000180025095e-35 14.500000000000002 7.5000000000000009 0 1 242.50000000000003 2 23.500000000000004 6.5000000000000009 19.500000000000004 20.500000000000004 15.500000000000002 1.5000000000000002 6.5000000000000009 26.500000000000004 25.500000000000004 26.500000000000004 22.500000000000004 1.0000000180025095e-35 4.5000000000000009 47.500000000000007 1.5000000000000002 3.5000000000000004 1.5000000000000002 1.0000000180025095e-35 3 6.5000000000000009 3.5000000000000004 4 15.500000000000002 86.500000000000014 245.50000000000003 2.5000000000000004 64.500000000000014 27.500000000000004 1.5000000000000002 2.5000000000000004 1.5000000000000002 13.500000000000002 31.500000000000004 317.50000000000006 288.50000000000006 15.500000000000002 469.50000000000006 520.50000000000011 14.500000000000002 5 9.5000000000000018 23.500000000000004 369.50000000000006 548.00000000000011 6 9.5000000000000018 2.5000000000000004 474.50000000000006 334.50000000000006 18.500000000000004 7 8 9 10 12.500000000000002 1.5000000000000002 1.5000000000000002 6.5000000000000009 1.5000000000000002 1.0000000180025095e-35 4.5000000000000009 5.5000000000000009 1.5000000000000002 1.5000000000000002 1.5000000000000002 1.5000000000000002 1.0000000180025095e-35 11 12 1.5000000000000002 13 2.5000000000000004 2.5000000000000004 14 15 16 17
decision_type=2 2 2 2 9 1 2 1 2 2 2 2 2 2 2 2 2 2 2 2 2 2 2 2 2 2 1 2 2 9 2 2 2 2 2 2 2 2 2 2 2 2 2 2 2 2 2 1 2 2 2 2 9 2 2 2 2 2 1 1 1 1 2 2 2 2 2 2 2 2 2 2 2 2 2 9 1 2 1 2 2 1 9 1 1
left_child=1 75 3 4 5 13 7 8 9 10 12 -12 -4 23 79 52 18 -18 22 21 -21 -19 30 24 -2 -25 27 28 29 38 -9 48 -8 35 -35 -17 -7 -38 -3 46 43 42 -42 44 47 -46 53 -34 64 -20 -43 -52 66 61 67 56 -45 -24 74 62 63 77 -55 65 -28 -56 -10 71 -62 -39 -61 81 -63 -31 -41 76 -1 -5 -73 -15 -66 -6 84 -84 -77
right_child=2 26 6 39 54 36 32 16 15 -11 11 -13 -14 14 -16 33 17 19 49 20 -22 -23 57 25 -26 -27 31 -29 -30 73 -32 -33 40 34 -36 -37 37 69 -40 58 41 50 -44 55 45 -47 -48 -49 -50 -51 51 -53 -54 59 60 -57 -58 -59 -60 70 68 72 -64 -65 80 -67 -68 -69 -70 -71 -72 78 -74 -75 -76 82 -78 -79 -80 -81 -82 -83 83 -85 -86
leaf_value=-0.024335682742355962 0.015709261613074951 -0.001134121541103935 0.027376668707454699 -0.011857995294183649 -0.023033898534164585 -0.022477933973550423 0.015281091458172569 -0.013246982551114291 -0.016911941113053618 0.021752822620319929 0.054578448495916081 0.0016339834280121751 -0.017342227662059988 -0.022199053777467729 0.011043244365947709 0.01191179983140841 0.041143734516419068 -0.0076826416229274774 -0.019904716543052529 0.011874719579383811 0.0030185421387336265 0.003743131742950297 -0.016380184586991007 0.011174289360227728 -0.022027627882702912 0.034132011363433135 -0.023779172752830674 -0.01503397736470927 0.053754229942547943 -0.023322658624405024 0.0096197235606929957 0.01179865757716359 0.0031567774835795357 -0.0048765272287471803 0.002387434385724281 -0.0022617187521251966 0.0099213162325127394 -0.016563362117764917 0.010406262723635585 -0.019868350541616588 0.0022440959641179094 0.0026482181630855632 0.027307539508676915 0.00079113659417051922 0.013719913338074045 0.0056480468524307756 0.0036316531190860087 0.0057686722722974874 -0.012248468241229358 -0.011937464789490333 0.0073861216555334954 0.0041237338855639408 -0.010050176957558554 -0.012758987487986784 -0.019520911744589607 0.00027627452180651712 0.0053805072927776672 -0.011300404185216727 -0.016813815207458779 -0.0094781693292843461 -0.017109392556759848 -0.014912704912136705 -0.0093845760015506367 -0.014691274606960184 -0.021090910219709519 -0.015200764819307516 -0.014615060549325357 -0.019045132272049681 -0.013364007466743913 -0.014858974214857169 -0.0072255125944344486 -0.021639356601721081 -0.017082883501443151 -0.021202801761446816 -0.021187249287452442 -0.024826344027167421 -0.024745136255051751 -0.013515911024489161 -0.019916167251510585 -0.021475401399182144 -0.020153259943819304 -0.022267654724156941 -0.024775908948118968 -0.024829263933405919 -0.024809466617225422
leaf_weight=81.341740608215332 24.336354151368141 20.005735278129578 8.3102255910634977 5.4209443181753159 4.8218130469322196 7.6051437631249419 20.142687857151031 7.0174441933631888 11.534466654062273 28.445856422185898 11.022550046443937 39.504529148340225 32.470557875931263 5.9780139029026031 10.355896174907684 12.810564443469046 7.6785606592893592 48.873162865638733 11.396445751190187 160.42436203360558 167.96020652353764 148.63450717926025 6.8128078877925855 39.028105907142162 12.921036563813685 11.39160120487213 8.9258471727371269 17.830254912376404 4.1636827364563933 3.7790724188089362 45.719749957323074 3.1061933636665335 149.42712622880936 64.171389147639275 285.63919988274574 418.59764884412289 9.0036802738904971 12.597586698830129 16.294952034950256 10.329802200198172 20.2369025349617 31.701948404312134 22.587901473045349 24.782852649688721 33.970893740653992 104.74901795387268 2.2054888829588881 97.808030962944031 4.3838590681552878 9.1780117750167829 59.712355613708496 75.026435256004333 5.199339076876643 15.021795965731146 11.51852335780859 24.791314363479614 19.89044463634491 6.2594475001096725 10.199295982718468 10.22117395699024 1.9877473637461651 10.333447299897673 4.6025499999523154 2.2646972909569731 2.3188549205660811 1.8707323819398887 5.8778328299522391 2.1701068170368663 2.8622845485806465 7.8223156034946433 3.3394354730844489 2.8106527775526047 1.9530645832419384 2.7315630204975605 5.6303600072860727 50.613550454378128 66.130309551954269 2.058050736784935 1.4736977219581602 6.6159838065505028 3.0036901384592056 1.2195724882185448 4.8177632167935354 3.2980831824243069 14.064926654100416
leaf_count=1488 128 74 37 59 84 93 14 26 43 20 56 122 152 27 15 23 21 168 18 332 303 300 22 177 166 31 79 31 18 66 133 6 176 281 568 1234 76 151 41 39 23 27 20 29 22 63 8 94 15 32 46 47 31 169 136 18 19 27 37 101 28 126 47 26 29 25 23 33 35 72 30 46 16 44 16 936 1220 16 24 29 31 21 89 61 260
internal_value=0 -0.0189199 0.00223387 -0.00532996 -0.0015104 0.00240886 0.00312309 0.00189685 0.000206743 0.00792723 0.00362004 0.0131839 -0.0082295 0.00688974 -0.00699021 -0.000943447 0.0044147 0.00545157 -0.00198976 0.00493043 0.00734501 0.00091583 0.00249998 0.0105229 0.00262193 0.0163613 -0.00441575 -0.000669981 0.00478215 1.92896e-05 0.00657698 -0.0155824 0.00588693 -0.000544203 0.00105489 -0.00184084 -0.0109782 -0.00800588 0.00404622 -0.0138157 0.00560225 0.00715177 0.0154638 0.00489024 0.00542456 0.00762475 -0.0113753 0.00419006 -0.0201471 -0.0163506 0.00501311 0.00556953 -0.0147371 -0.0120004 -0.0190469 0.0019215 0.00283452 -0.0139478 -0.0189613 -0.0107236 -0.0175 -0.0141439 -0.0119676 -0.0183059 -0.0225773 -0.0189173 -0.0161366 -0.021585 -0.014899 -0.0159105 -0.00892343 -0.0221188 -0.0152577 -0.0224333 -0.0203336 -0.0246186 -0.0245193 -0.0123142 -0.0210466 -0.0218189 -0.0205618 -0.0228792 -0.0248199 -0.0247976 -0.0248227
internal_weight=0 306.81 2490.34 261.971 180.656 147.656 2228.37 1543.54 923.584 119.754 91.3079 50.5271 40.7808 110.627 22.9499 803.83 619.955 533.571 86.3839 525.892 328.385 197.508 65.8094 87.6771 37.2574 50.4197 86.5437 64.8053 46.975 42.8113 52.7372 21.7384 684.828 781.219 349.811 431.408 37.0287 29.4236 36.3007 81.3154 664.685 209.266 42.8248 455.42 385.955 138.72 55.156 247.235 18.6323 20.5745 166.441 134.739 22.6116 52.9505 32.9998 69.4646 44.6733 13.0723 26.1595 33.185 20.504 19.7655 19.6243 15.654 14.2484 13.3893 17.4123 12.4958 4.85003 20.4199 13.5606 10.3257 12.2865 6.51064 15.9602 220.266 147.472 7.479 4.28435 12.594 5.32255 6.04139 72.7943 8.11585 64.6785
internal_count=11145 4488 6657 2087 1423 965 4570 3972 2590 387 367 178 189 573 71 2203 1382 1124 258 1103 635 468 208 502 294 208 434 274 243 225 159 160 598 2106 849 1257 392 299 115 664 584 163 43 421 355 85 572 270 154 50 120 93 97 564 458 66 48 49 92 347 250 217 216 187 139 161 66 208 63 223 131 175 142 110 55 4054 2708 75 70 56 60 105 1346 150 1196
cat_boundaries=0 1 2 3 4 5 6 7 8 9 10 11 12 13 14 15 16 17 18
cat_threshold=2 1 1 1 2 1 2 1 1 1 2 2 1 1 1 1 1 1
is_linear=0
shrinkage=0.05


Tree=63
num_leaves=88
num_cat=19
split_feature=2 3 2 2 0 1 2 1 2 3 3 3 2 3 2 2 2 3 2 2 3 1 3 3 0 2 2 2 2 2 3 2 2 2 2 3 2 2 0 2 2 3 3 2 3 1 2 2 3 2 2 2 2 0 2 2 3 3 2 2 1 1 1 1 2 3 3 2 3 3 2 2 3 2 3 3 3 0 1 3 1 3 3 1 0 1 1
split_gain=47.3032 10.1239 6.37497 3.29658 4.80982 3.37426 2.84932 2.39261 3.2112 2.87177 7.61139 2.0998 2.3772 1.71837 1.66543 1.51842 2.15293 1.68712 1.49362 4.59041 1.65943 1.40575 1.95137 3.92504 1.50039 1.39907 5.78536 3.40674 1.68452 4.02823 1.05895 0.540082 1.15856 0.502035 1.60876 0.448813 0.406159 0.370077 0.283743 0.36679 3.22745 0.43759 2.84261 0.732615 0.20078 0.186696 0.244294 0.154243 0.143817 0.128884 0.0633903 0.0631478 0.0791015 0.0588037 0.057219 0.0522638 0.0508614 0.0697865 0.0333982 0.0318034 0.0310358 0.0291877 0.0172081 0.0159823 0.015796 0.0140465 0.0138683 0.0120619 0.00819962 0.00686594 0.00655362 0.00559397 0.00498642 0.00342297 0.00308678 0.00289973 0.00256543 0.0018047 0.00250536 0.00162035 0.00116324 0.000668314 0.000465821 0.000232872 1.86032e-06 2.28534e-06 1.28563e-06
threshold=1.0000000180025095e-35 1.0000000180025095e-35 14.500000000000002 7.5000000000000009 0 1 218.50000000000003 2 23.500000000000004 26.500000000000004 17.500000000000004 1.5000000000000002 6.5000000000000009 7.5000000000000009 26.500000000000004 25.500000000000004 22.500000000000004 1.5000000000000002 3.5000000000000004 1.5000000000000002 1.0000000180025095e-35 3 6.5000000000000009 3.5000000000000004 4 56.500000000000007 54.500000000000007 26.500000000000004 82.500000000000014 85.500000000000014 86.500000000000014 27.500000000000004 35.500000000000007 1.5000000000000002 2.5000000000000004 1.5000000000000002 13.500000000000002 19.500000000000004 5 471.50000000000006 453.50000000000006 32.500000000000007 38.500000000000007 243.50000000000003 14.500000000000002 6 541.50000000000011 78.500000000000014 9.5000000000000018 23.500000000000004 649.50000000000011 514.50000000000011 456.50000000000006 7 9.5000000000000018 2.5000000000000004 2.5000000000000004 20.500000000000004 18.500000000000004 621.50000000000011 8 9 10 11 12.500000000000002 1.5000000000000002 1.5000000000000002 6.5000000000000009 1.5000000000000002 1.0000000180025095e-35 4.5000000000000009 5.5000000000000009 1.5000000000000002 1.5000000000000002 1.5000000000000002 1.5000000000000002 1.0000000180025095e-35 12 13 1.5000000000000002 14 2.5000000000000004 2.5000000000000004 15 16 17 18
decision_type=2 2 2 2 9 1 2 1 2 2 2 2 2 2 2 2 2 2 2 2 2 1 2 2 9 2 2 2 2 2 2 2 2 2 2 2 2 2 9 2 2 2 2 2 2 1 2 2 2 2 2 2 2 9 2 2 2 2 2 2 1 1 1 1 2 2 2 2 2 2 2 2 2 2 2 2 2 9 1 2 1 2 2 1 9 1 1
left_child=1 77 3 4 5 11 7 8 9 10 13 18 81 -4 53 16 17 37 19 -2 -20 22 23 24 35 26 27 -17 47 -30 48 -16 -33 -7 -35 -3 44 -9 39 40 41 43 -43 -8 54 46 -41 -27 65 -18 -48 52 56 68 63 69 -40 -58 -19 -47 76 64 66 79 -56 -23 67 -57 -10 73 -64 -36 -63 83 -65 -26 -38 78 -1 -5 -75 -13 -67 -6 86 -86 -79
right_child=2 21 6 36 55 33 38 15 14 -11 -12 12 -14 -15 31 25 49 58 20 -21 -22 30 -24 -25 75 28 -28 -29 29 -31 -32 32 -34 34 71 -37 60 -39 51 45 -42 42 -44 -45 -46 59 50 -49 -50 -51 -52 -53 -54 -55 61 62 57 -59 -60 -61 -62 72 70 74 -66 82 -68 -69 -70 -71 -72 -73 -74 80 -76 -77 -78 84 -80 -81 -82 -83 -84 -85 85 -87 -88
leaf_value=-0.024323524829563566 0.015077410290106775 -0.0011072333760925712 0.0069021365660071228 -0.011703266506539651 -0.022992064147201986 -0.022424482219541617 0.010042309875744984 0.0099462334085138413 -0.016776905261775242 -0.021870768495182571 0.047583359191451742 -0.022140012703618924 0.010649275056141279 -0.020215349365663004 0.0087288035164855438 0.038484445621291864 -0.019805712379930698 -0.016240647582522399 0.01077421356240988 -0.021965229529072972 0.032153499861959416 -0.023753903219737527 -0.014885602761468631 0.049641565882515649 -0.02328710873698597 -0.0017937528852937643 0.049980671178139757 0.0047356473339117801 0.033044548089024538 0.0041942411723900992 0.011369036821145463 -0.0087646138577222553 -0.00039346932316077925 0.0095782509580179965 -0.016425310975028546 0.010041495935236471 -0.019768800718825023 0.0014966777222337 0.0019959148268328983 -0.0009313897763511197 0.026947901418975087 0.024813586282200015 0.0045858885698176546 0.0034528616215205874 0.0035284804199282854 0.0052661049002901278 0.0062731925986786417 -0.0077062622799585331 -0.012093425375502216 -0.011782646879588021 0.003518245816381241 0.0054276893814851797 8.0840037076004368e-05 -0.0099008952110805747 -0.01260399628861777 -0.019416269498773245 0.0053045455578024092 0.0017607499535096276 -0.011146655684354424 0.0072926570331416961 -0.016677905944076497 -0.0093319774430600383 -0.01697617288022079 -0.014763714188664066 -0.0092389517082177852 -0.021011227505949397 -0.014541235194663066 -0.01505328476936996 -0.014464683161872924 -0.018933916755312776 -0.013209757224376843 -0.014709719507069946 -0.0070978556750558074 -0.021569576397802832 -0.016949415996711941 -0.021125089776441546 -0.021109261335211429 -0.024826270986373154 -0.024743028870519559 -0.013361962817798818 -0.01981733622822561 -0.021402597260476552 -0.020058067206454956 -0.022209973646422288 -0.024774569669069602 -0.02482926437682309 -0.024808969076336798
leaf_weight=79.386127173900604 24.721678733825684 19.983059644699097 94.950425550341606 5.3570423722267151 4.7120172679424277 7.4361028820276251 52.816709995269775 30.619073174893856 11.341036528348925 7.7065837383270255 11.852644443511961 5.8467698395252228 10.47089284658432 6.2249299883842459 14.844596534967421 8.0010744184255582 11.171845480799677 6.7021217644214612 39.466663427650928 12.639528661966322 11.787131398916243 8.7161015868187004 17.564200103282928 4.3936229869723311 3.6919540911912909 66.295928567647934 8.3414590358734113 114.29351679980755 12.628631919622419 288.54914480447769 3.143059402704238 44.029494866728783 674.72785677015781 9.0934533029794711 12.390646748244764 16.465406626462936 10.126591064035891 22.46770715713501 32.53306519985199 28.433490753173828 19.133340835571289 21.573940694332123 89.103127300739288 209.47140729427338 2.2135129645466796 39.231533169746399 29.294884443283081 13.232320189476011 4.330490991473197 9.0691010206937772 72.693424940109253 38.376403570175171 18.395319759845734 5.1473465859890011 14.831350654363634 11.295851945877075 53.148596405982971 18.808598816394806 6.1891112923622131 38.22043764591217 10.029240235686302 10.124753437936304 1.9540275931358326 10.180490873754026 4.5595591217279425 2.2704602926969519 2.2316692247986785 1.8425109684467322 5.7925526052713385 2.1291679665446273 2.8242874294519424 7.706943340599536 3.3153933137655249 2.7504854053258896 1.919984035193919 2.6742559261620045 5.512323111295701 49.372471690177917 64.513986706733704 2.0304214358329773 1.4446376860141752 6.4754175543785095 2.9437618255615234 1.1927155964076508 4.699865397065877 3.217202503234148 13.720276504755018
leaf_count=1488 128 74 371 59 84 93 65 104 43 4 2 27 15 10 33 21 18 22 177 166 31 79 31 18 66 178 20 371 21 457 6 237 1766 76 151 41 39 55 39 21 14 19 84 230 8 26 22 25 15 32 43 25 13 31 169 136 60 19 27 19 37 101 28 126 47 29 26 25 23 33 35 72 30 46 16 44 16 936 1220 16 24 29 31 21 89 61 260
internal_value=0 -0.0188075 0.0021722 -0.00522837 -0.001479 0.00233903 0.00303499 0.00175222 8.91295e-05 0.00766111 0.00967469 0.00666736 -0.00686747 0.0052337 -0.00112032 0.00419197 -0.00194606 0.00243015 0.0101487 0.00254566 0.0156909 -0.00432873 -0.000657761 0.00463581 1.73438e-05 0.00522692 0.00969168 0.00694365 0.00369488 0.00540396 -0.0154378 -0.000711299 -0.000906267 -0.0108264 -0.00787186 0.00392915 -0.0136627 0.00637016 0.00551914 0.0060196 0.00691975 0.0058923 0.00852881 0.00477977 -0.0112215 0.0043217 0.00316698 -0.00277751 -0.0200519 -0.0162109 0.00430957 0.00365717 0.00310424 -0.0145873 -0.0118455 -0.0189357 0.00363651 0.00437825 -0.013795 0.00626615 -0.018849 -0.0105716 -0.0173707 -0.0139917 -0.0118127 -0.0225259 -0.0181854 -0.0188044 -0.0159952 -0.0215143 -0.01475 -0.0157674 -0.00878087 -0.0220582 -0.0151105 -0.0223789 -0.0202413 -0.0246134 -0.0245116 -0.0121592 -0.0209662 -0.0217525 -0.0204731 -0.0228341 -0.0248196 -0.0247968 -0.0248225
internal_weight=0 301.086 2496.03 260.613 180.413 148.035 2235.41 1474.18 876.617 120.735 113.028 111.408 22.7931 101.175 755.883 597.561 86.219 65.978 88.615 37.3612 51.2538 86.1764 64.7725 47.2083 42.8147 511.342 130.636 122.295 380.706 301.178 21.4039 733.602 718.757 36.6271 29.191 36.4485 80.2007 53.0868 761.234 599.972 392.099 372.965 110.677 262.288 54.5325 207.874 130.422 79.5282 18.2608 20.2409 101.988 161.262 122.886 22.2809 52.319 32.3774 104.49 71.9572 12.8912 77.452 25.6682 32.8311 20.1483 19.4879 19.3909 13.9303 15.37 13.1384 17.1336 12.229 4.77832 20.0976 13.4401 10.0999 12.1005 6.36621 15.6389 214.91 143.9 7.38746 4.19512 12.3222 5.21422 5.90473 71.0098 7.91707 63.0927
internal_count=11145 4488 6657 2087 1423 965 4570 3871 2520 387 383 573 71 381 2133 1351 258 208 502 294 208 434 274 243 225 1093 412 392 681 478 160 2036 2003 392 299 115 664 159 699 543 412 398 103 295 572 131 86 203 154 50 65 156 131 97 564 458 118 79 49 45 92 347 250 217 216 139 187 161 66 208 63 223 131 175 142 110 55 4054 2708 75 70 56 60 105 1346 150 1196
cat_boundaries=0 1 2 3 4 5 6 7 8 9 10 11 12 13 14 15 16 17 18 19
cat_threshold=2 1 1 1 2 2 1 2 1 1 1 2 2 1 1 1 1 1 1
is_linear=0
shrinkage=0.05


Tree=64
num_leaves=84
num_cat=19
split_feature=2 3 2 2 0 1 2 1 2 3 3 2 3 2 2 2 2 2 2 3 3 2 3 0 1 3 3 2 3 2 2 3 2 2 2 2 2 3 2 2 3 2 2 3 1 2 3 2 2 3 0 2 2 2 2 2 1 1 1 1 2 3 2 3 3 3 3 2 2 3 2 3 3 0 1 3 3 1 1 1 0 1 1
split_gain=45.7629 10.1021 6.0661 3.19884 4.65774 3.21418 2.70186 2.35132 2.92316 2.74409 7.0017 3.87376 2.03381 1.65296 1.47575 4.20345 1.46578 3.24011 2.08034 1.90001 2.39663 1.82324 1.61278 1.38046 1.61052 2.69807 1.7427 1.20913 0.853773 0.667505 0.629366 0.612184 1.04074 0.9049 0.497666 1.5519 0.403715 0.257438 1.32691 2.42667 0.266461 0.389244 0.625348 0.19475 0.153342 0.148552 0.146528 0.128635 0.125093 0.0629292 0.0582588 0.0564566 0.0526903 0.0392379 0.0857083 0.0331122 0.0312248 0.0286469 0.017218 0.0158466 0.0155422 0.0138934 0.0121049 0.0113624 0.00817909 0.00695462 0.0065971 0.00652213 0.00557809 0.00486464 0.00347884 0.00307779 0.00259495 0.00184908 0.00256603 0.00160009 0.00159551 0.00117809 0.00023719 0.000121069 1.90679e-06 2.34241e-06 1.31801e-06
threshold=1.0000000180025095e-35 1.0000000180025095e-35 14.500000000000002 7.5000000000000009 0 1 242.50000000000003 2 23.500000000000004 26.500000000000004 6.5000000000000009 19.500000000000004 3.5000000000000004 26.500000000000004 3.5000000000000004 1.5000000000000002 25.500000000000004 26.500000000000004 22.500000000000004 1.0000000180025095e-35 4.5000000000000009 47.500000000000007 1.5000000000000002 3 4 6.5000000000000009 1.5000000000000002 15.500000000000002 86.500000000000014 245.50000000000003 6.5000000000000009 2.5000000000000004 60.500000000000007 27.500000000000004 1.5000000000000002 2.5000000000000004 13.500000000000002 31.500000000000004 317.50000000000006 288.50000000000006 15.500000000000002 469.50000000000006 520.50000000000011 14.500000000000002 5 361.50000000000006 11.500000000000002 23.500000000000004 548.00000000000011 5.5000000000000009 6 9.5000000000000018 2.5000000000000004 474.50000000000006 334.50000000000006 18.500000000000004 7 8 9 10 12.500000000000002 1.5000000000000002 6.5000000000000009 1.5000000000000002 1.5000000000000002 1.0000000180025095e-35 1.5000000000000002 4.5000000000000009 5.5000000000000009 1.5000000000000002 1.5000000000000002 1.5000000000000002 1.0000000180025095e-35 11 12 1.5000000000000002 2.5000000000000004 13 14 15 16 17 18
decision_type=2 2 2 2 9 1 2 1 2 2 2 2 2 2 2 2 2 2 2 2 2 2 2 9 1 2 2 2 2 2 2 2 2 2 2 2 2 2 2 2 2 2 2 2 1 2 2 2 2 2 9 2 2 2 2 2 1 1 1 1 2 2 2 2 2 2 2 2 2 2 2 2 2 9 1 2 2 1 1 1 9 1 1
left_child=1 73 3 4 5 12 7 8 9 10 11 -4 14 50 15 -2 18 -18 22 21 -21 -19 27 24 25 26 -3 -9 46 -8 -16 33 -33 -15 -7 -36 43 40 39 -39 41 44 -43 51 -31 -40 63 -20 -47 66 64 59 65 54 -42 -24 72 60 61 75 -53 62 -54 -26 -10 70 79 -60 -37 -59 78 -61 -38 74 -1 -5 -68 -72 -6 -25 82 -82 -75
right_child=2 23 6 36 52 34 29 16 13 -11 -12 -13 -14 31 30 -17 17 19 47 20 -22 -23 55 49 28 -27 -28 -29 -30 37 -32 32 -34 -35 35 68 56 38 45 -41 53 42 -44 -45 -46 48 -48 -49 -50 -51 -52 57 58 -55 -56 -57 -58 69 67 71 -62 -63 -64 -65 -66 -67 76 -69 -70 -71 77 -73 -74 80 -76 -77 -78 -79 -80 -81 81 -83 -84
leaf_value=-0.024311070352741132 0.012147516309360437 -0.0010809535500459686 -0.0082101730492619984 -0.011548746647681454 -0.022949334046609052 -0.022369947300345448 0.014414442534148182 -0.01320868902895061 -0.016640672033023048 -0.021805350743261117 0.03479660910282989 0.012418979065170839 -0.020521048377865513 0.011161214470679713 0.010051953502861609 -0.021954063673537749 0.036094139925131961 -0.0076320359859508753 -0.019705226205415191 0.011277008415681966 0.0027850428505273184 0.003501067410720338 -0.016100023646820585 -0.023250774179968303 -0.023916719508551586 -0.014560604285257404 0.019775285133337719 0.0090911586594539309 0.010033937422898959 0.0029297409521634918 0.021611145852022312 -0.0051245479495235051 0.002233462639911143 -0.0021956200463421971 0.0092502599172248293 -0.016286133154629935 -0.019667765426137296 0.0018925473409070592 0.00086801245715146429 0.025448775957983245 0.00068633085880904186 0.013064648209177446 0.0053185450025135762 0.0034285970814853296 0.0054645335848727177 0.0067873948525675014 -0.011291843180972433 -0.011628014018597877 0.0038603702521514821 -0.011041533201300557 -0.0097523570848074004 -0.012448934198080859 -0.019310142766666746 0.00017341383399684441 0.0050766315052892226 -0.010993287056303855 -0.016540818477290983 -0.0091866801947107692 -0.016841719939857513 -0.014614007265633248 -0.009094246007881366 -0.014390540967242746 -0.014905011845673622 -0.020524671001212177 -0.014313673095978066 -0.01882123130857688 -0.021332217477645427 -0.013055248446205951 -0.01455976374600978 -0.0069715530553596449 -0.021498503652669605 -0.016814718767244892 -0.021029899940813425 -0.024826195409900199 -0.024740868100801266 -0.013207709277419724 -0.019546200119426829 -0.019717023128527741 -0.022151148959623387 -0.022689291079886643 -0.02477319953088724 -0.024829264131793163 -0.024808458306295633
leaf_weight=77.478473782539368 26.741529554128647 19.960944175720215 40.733355052769184 5.2947130426764488 4.6049142032861736 7.2712078168988219 20.587513864040375 6.9943195879459372 11.152356132864954 7.5398647785186759 21.840643465518951 51.564675346016884 6.5778900682926169 13.077729746699331 49.775880165398121 13.648490093648432 8.3149934560060483 48.729346215724945 10.952755630016329 163.08006347715855 169.38043454289436 149.90449213981628 6.5941541418433172 3.6069726124405852 7.2032164782285708 16.654961109161377 20.103301018476486 46.432176679372787 2.8568628430366507 150.64926797151566 15.424889922142027 57.497467294335365 292.71180334687233 417.37518681585789 9.1809707656502741 12.188789002597334 9.9283665642142278 20.50313663482666 22.039866149425507 23.422969460487366 24.884648740291595 34.558321475982666 105.89387631416321 2.2213371247053137 98.789987862110138 70.481253385543823 3.7395225167274466 8.9628700166940671 75.715159177780151 1.5747971534728993 5.0966346934437778 14.645589187741281 11.078643944114443 24.893305420875549 20.092552840709686 6.1205065697431564 9.8633605390787125 10.030709117650984 1.9211356192827249 10.03129291534424 4.5176275670528403 2.1994528472423545 1.8149827569723136 3.7561532780528069 5.709368333220481 2.0892337150871745 2.77846559882164 2.7872245460748672 7.5944060608744612 3.2919443994760504 2.6917937397956848 1.8877156376838673 5.3971816152334222 48.161826342344284 62.937304079532623 2.0034714117646217 2.2737755328416824 1.4162905812263487 1.1665174104273308 1.3082829415798176 4.5848587006330481 3.1383051984012127 13.384078145027159
leaf_count=1488 137 74 189 59 84 93 14 26 43 4 16 178 21 23 188 173 21 168 18 332 303 300 22 66 55 27 48 133 5 176 54 253 596 1234 76 151 39 23 19 20 29 22 63 8 94 54 12 32 47 8 31 169 136 18 19 27 37 101 28 126 47 26 25 36 23 33 47 35 72 30 46 16 16 936 1220 16 32 24 21 24 89 61 260
internal_value=0 -0.0186938 0.00211242 -0.00512816 -0.00144811 0.00227151 0.00294968 0.00178947 0.000187378 0.00740906 0.00933893 0.00331483 0.00645378 -0.000907441 0.00813421 0.000623999 0.00415701 0.00512381 -0.00190294 0.00463893 0.00695056 0.000769867 0.00236292 -0.00424294 -0.00174307 0.00235309 0.00938422 0.00617178 -0.0149769 0.00554611 0.0127866 -0.000526888 0.00102542 -0.00178982 -0.010675 -0.00773903 -0.0135092 0.00527439 0.0067151 0.0144536 0.00460955 0.00511911 0.00722448 -0.011068 0.00393364 0.00469461 -0.019838 -0.0160701 0.00527149 -0.0203297 -0.0144368 -0.0116908 -0.0188231 0.0017661 0.0026476 -0.0136418 -0.0187352 -0.0104201 -0.01724 -0.013839 -0.0116581 -0.0180635 -0.0186901 -0.0227541 -0.0158528 -0.0214422 -0.0217972 -0.0146002 -0.0156234 -0.00863934 -0.0219964 -0.0149626 -0.0201475 -0.024608 -0.0245037 -0.0120042 -0.0205284 -0.0208843 -0.022788 -0.0231013 -0.0248194 -0.024796 -0.0248223
internal_weight=0 295.502 2501.56 259.288 180.174 148.404 2242.28 1549.77 924.299 121.679 114.139 92.298 112.169 802.621 105.591 40.39 625.466 539.409 86.0568 531.094 332.46 198.634 66.1412 85.8173 74.275 56.7192 40.0642 53.4265 17.5558 692.512 65.2008 780.662 350.209 430.453 36.2354 28.9642 79.1133 671.924 212.162 43.9261 459.762 389.891 140.452 53.9244 249.439 168.236 14.6989 19.9156 146.196 11.5423 21.9584 51.7031 31.7702 69.8705 44.9772 12.7147 25.1889 32.4859 19.8014 19.2172 19.1632 15.0931 12.8936 10.9594 16.8617 11.9687 9.9675 4.70836 19.7832 13.3227 9.87952 11.919 15.3255 209.685 140.416 7.29818 5.05224 4.10808 5.77143 4.91526 69.2691 7.72316 61.5459
internal_count=11145 4488 6657 2087 1423 965 4570 3972 2590 387 383 367 573 2203 552 310 1382 1124 258 1103 635 468 208 434 257 149 122 159 108 598 242 2106 849 1257 392 299 664 584 163 43 421 355 85 572 270 120 103 50 101 177 97 564 458 66 48 49 92 347 250 217 216 187 161 91 66 208 169 63 223 131 175 142 55 4054 2708 75 79 70 105 90 1346 150 1196
cat_boundaries=0 1 2 3 4 5 6 7 8 9 10 11 12 13 14 15 16 17 18 19
cat_threshold=2 1 1 2 1 1 2 1 1 1 2 2 1 1 1 1 1 1 1
is_linear=0
shrinkage=0.05


Tree=65
num_leaves=81
num_cat=19
split_feature=2 3 2 2 0 1 2 1 2 3 3 2 3 2 2 2 2 3 3 2 3 2 2 0 1 3 3 3 2 2 2 2 2 2 2 2 2 2 3 2 2 3 3 1 3 2 3 0 2 2 2 1 2 2 1 1 1 2 3 2 3 3 3 2 3 2 3 2 3 3 0 1 3 1 3 1 1 0 1 1
split_gain=44.2705 10.0787 5.77199 3.10341 4.51049 3.06253 2.54328 2.22191 2.7582 2.62338 6.34297 3.65597 1.94614 1.59763 1.38406 2.93957 2.00989 1.78429 2.23081 1.73987 1.54179 1.37374 4.03575 1.34807 1.55398 2.57319 1.61053 0.832603 0.618637 0.592359 1.15265 0.571879 0.493168 1.49713 0.401116 0.356393 0.248844 2.85948 0.628613 1.34427 0.317841 0.200957 0.188861 0.169665 0.147143 0.128336 0.0926948 0.0576933 0.0556787 0.0531035 0.032814 0.031404 0.0310162 0.0461589 0.0281035 0.017221 0.0157049 0.0152855 0.0139132 0.0121436 0.0115633 0.00815509 0.00704269 0.00648793 0.00625291 0.00555984 0.00474385 0.00353495 0.0030675 0.00262409 0.00189451 0.00262808 0.00157934 0.00119281 0.00101585 0.000241552 0.000123438 1.95479e-06 2.40122e-06 1.35093e-06
threshold=1.0000000180025095e-35 1.0000000180025095e-35 14.500000000000002 7.5000000000000009 0 1 242.50000000000003 2 23.500000000000004 26.500000000000004 6.5000000000000009 19.500000000000004 3.5000000000000004 26.500000000000004 25.500000000000004 26.500000000000004 22.500000000000004 1.0000000180025095e-35 4.5000000000000009 47.500000000000007 1.5000000000000002 3.5000000000000004 1.5000000000000002 3 4 6.5000000000000009 1.5000000000000002 86.500000000000014 245.50000000000003 126.50000000000001 119.50000000000001 6.5000000000000009 1.5000000000000002 2.5000000000000004 13.500000000000002 19.500000000000004 471.50000000000006 456.50000000000006 34.500000000000007 317.50000000000006 500.00000000000006 9.5000000000000018 14.500000000000002 5 11.500000000000002 23.500000000000004 7.5000000000000009 6 9.5000000000000018 2.5000000000000004 18.500000000000004 7 978.00000000000011 786.00000000000011 8 9 10 12.500000000000002 1.5000000000000002 6.5000000000000009 1.5000000000000002 1.5000000000000002 1.0000000180025095e-35 4.5000000000000009 1.5000000000000002 5.5000000000000009 1.5000000000000002 1.5000000000000002 1.5000000000000002 1.0000000180025095e-35 11 12 1.5000000000000002 13 2.5000000000000004 14 15 16 17 18
decision_type=2 2 2 2 9 1 2 1 2 2 2 2 2 2 2 2 2 2 2 2 2 2 2 9 1 2 2 2 2 2 2 2 2 2 2 2 2 2 2 2 2 2 2 1 2 2 2 9 2 2 2 1 2 2 1 1 1 2 2 2 2 2 2 2 2 2 2 2 2 2 9 1 2 1 2 1 1 9 1 1
left_child=1 70 3 4 5 12 7 8 9 10 11 -4 21 47 16 -16 20 19 -19 -17 35 22 -2 24 25 26 -3 44 -8 30 -15 -23 -7 -34 42 -9 37 38 43 -40 -38 -31 48 -30 60 -18 64 61 56 62 -22 69 53 -42 57 58 68 -50 59 -51 -26 -10 67 -57 76 -35 -56 75 -5 -36 71 -1 -58 -69 -66 -6 -25 79 -79 -72
right_child=2 23 6 34 49 32 28 14 13 -11 -12 -13 -14 29 15 17 45 18 -20 -21 50 31 -24 46 27 -27 -28 -29 36 41 -32 -33 33 65 51 -37 40 -39 39 -41 52 -43 -44 -45 -46 -47 -48 -49 54 55 -52 -53 -54 -55 66 63 72 -59 -60 -61 -62 -63 -64 -65 74 -67 -68 73 -70 -71 77 -73 -74 -75 -76 -77 -78 78 -80 -81
leaf_value=-0.024298318751981809 0.011701056429944422 -0.0010552673384914856 -0.0080731657494449854 -0.014463625315548109 -0.022905690774235991 -0.02231431340788818 0.013852824427113435 0.0094614943075439217 -0.016503268265076382 -0.021738689818958573 0.032757513385332934 0.011959254373641509 -0.020431726167041912 -0.00090234300464370741 0.033934375206162375 -0.0075002840217688899 -0.019603254742181147 0.01087212483506728 0.0027082428923887129 0.0034020545176287028 -0.015958345153057382 0.0097030852960276037 -0.021890243242586649 -0.023213643142589935 -0.023894630503237008 -0.014409992594395876 0.01890188248789448 0.0096858714933374546 0.0027881365697963864 0.00029282348767920024 -0.010343710083308238 0.020618282681697145 0.0089364681992584408 -0.016145859642385966 -0.019565244748017869 0.0012194153468585191 -0.00088605183553766738 0.023892958926517813 0.015410279334639114 0.0035917784317373901 0.0046478459621325857 0.0030391858640361272 0.0033318781685189418 0.0052567424305197926 -0.01113811484752562 -0.011473614318098943 -0.0066934827626748145 -0.0096046023495926867 -0.012293848895254094 -0.019202531644419676 -0.010840345047145475 -0.016402580467135008 0.0055916271607613956 0.0026915388356267937 -0.0090423145737171841 -0.016706056975720723 -0.011394484673410518 -0.0089504954484394272 -0.014239236348190293 -0.014755982706786817 -0.020435407340040707 -0.014162073989466917 -0.018707081580838354 -0.012900527987435299 -0.021256815764037901 -0.014409148129353204 -0.0068466222099827813 -0.02142612110668498 -0.016678817293659109 -0.020949153708943173 -0.024826118208712063 -0.024738653563947218 -0.013053196827451444 -0.019615224432903137 -0.019881398385433791 -0.022091163173649349 -0.022640182006984921 -0.024771791687928809 -0.024829264157542833 -0.024807936791807116
leaf_weight=75.617599725723267 27.068354338407516 19.939380049705505 40.400296226143837 9.8857613354921323 4.5004381388425854 7.1103568002581587 20.886420547962189 31.051910147070885 10.968309119343759 7.3772346973419181 22.614000827074051 52.209049612283707 6.4442804008722296 456.36382988095284 8.6205978095531446 48.358857959508896 10.739041551947595 164.9295270293951 169.85282301902771 150.43023735284805 6.4888381808996183 50.278749279677868 13.352115511894224 3.5240751206874839 7.0329832285642642 16.414211690425873 20.504805654287338 2.8856727480888358 178.63455468416214 185.02351620793343 34.791840791702271 15.76186755299568 9.2662910073995608 11.991888411343099 9.7350057736039144 22.706855282187462 30.525441825389862 20.916176795959473 40.218814373016357 59.886520385742188 138.76348912715912 104.07498413324356 2.2289662435650817 114.03598433732986 3.6975337862968436 8.859252914786337 1.1363803446292866 5.0471720471978214 14.464397355914118 10.866766311228272 6.0535905659198761 9.701554536819458 53.980924248695374 38.523168206214905 9.9389820992946607 1.8890512958169008 5.233917362987996 4.4767293632030478 2.1680281534790984 1.788131088018418 3.6798453032970428 5.6282283663749686 2.0502795279026023 2.7510731145739555 2.7198225185275078 7.4846345111727706 3.2690742760896674 2.6345419213175774 1.8562396168708808 5.2848645597696313 46.980871707201004 61.399284526705742 1.9771841540932653 1.3886390626430509 2.6508877128362656 1.1409618146717537 1.2789331376552571 4.4726725071668616 3.061342865228653 13.056124299764631
leaf_count=1488 137 74 189 126 84 93 14 104 43 4 16 178 21 1536 21 168 18 332 303 300 22 188 173 66 55 27 48 5 209 344 47 54 76 151 39 55 21 14 39 49 96 179 8 108 12 32 6 31 169 136 27 37 26 22 101 28 59 47 26 25 36 23 33 35 47 72 30 46 16 16 936 1220 16 24 34 21 24 89 61 260
internal_value=0 -0.0185785 0.00205453 -0.005029 -0.00141721 0.00220693 0.00286712 0.00174104 0.000181983 0.00716661 0.00901728 0.00322023 0.00624967 -0.000885883 0.00403585 0.00497008 -0.00186096 0.00450212 0.00673016 0.000749874 0.00229728 0.00786474 0.000604824 -0.00415798 -0.00170554 0.00228655 0.00906281 -0.014829 0.00537775 -0.00051418 -0.00157114 0.0123082 -0.0105241 -0.00760742 -0.0133554 0.00598017 0.0051157 0.00587912 0.00491985 0.00834004 0.00390932 0.00128151 -0.010915 0.00375 -0.0197381 -0.0159283 -0.0202373 -0.0142857 -0.0115364 -0.018709 -0.0134881 -0.01862 0.00454227 0.00422275 -0.0102692 -0.0171081 -0.0136859 -0.0115036 -0.0179402 -0.0185742 -0.0227064 -0.0157093 -0.0213688 -0.0144498 -0.0217502 -0.0154785 -0.00849887 -0.0219334 -0.0148138 -0.0200522 -0.0246025 -0.0244956 -0.0118493 -0.0208011 -0.0205779 -0.022741 -0.0230609 -0.0248192 -0.0247951 -0.0248222
internal_weight=0 290.052 2506.95 257.989 179.936 148.759 2248.96 1552.59 924.498 122.601 115.223 92.6093 112.905 801.898 628.092 542.192 85.8995 533.571 334.782 198.789 66.3012 106.461 40.4205 85.4645 74.1544 56.8584 40.4442 17.296 696.371 780.254 491.156 66.0406 35.8532 28.7428 78.0527 53.7588 675.485 413.692 392.776 100.105 261.793 289.099 53.3313 292.671 14.4104 19.5983 11.3101 21.6437 51.1023 31.1779 12.5424 24.7214 231.268 177.287 32.1492 19.463 18.9531 18.9411 14.8229 12.6549 10.7128 16.5965 11.7149 4.64012 10.1737 19.4765 13.2081 9.66458 11.742 15.0199 204.588 137.017 7.2111 4.02318 5.37071 5.6414 4.80301 67.571 7.53402 60.037
internal_count=11145 4488 6657 2087 1423 965 4570 3972 2590 387 383 367 573 2203 1382 1124 258 1103 635 468 208 552 310 434 257 149 122 108 598 2106 1583 242 392 299 664 159 584 419 405 88 165 523 572 317 103 50 177 97 564 458 49 92 144 118 347 250 217 216 187 161 91 66 208 63 171 223 131 175 142 55 4054 2708 75 70 81 105 90 1346 150 1196
cat_boundaries=0 1 2 3 4 5 6 7 8 9 10 11 12 13 14 15 16 17 18 19
cat_threshold=2 1 1 2 1 1 2 1 1 1 1 2 1 1 1 1 1 1 1
is_linear=0
shrinkage=0.05


Tree=66
num_leaves=92
num_cat=20
split_feature=2 3 2 2 0 1 2 1 2 2 3 2 3 2 3 0 1 3 3 2 2 3 2 2 2 2 2 2 2 3 2 3 3 0 3 3 2 2 2 2 2 0 2 2 3 2 2 3 1 2 3 2 2 3 2 2 2 2 2 2 3 3 2 1 2 1 1 1 2 3 2 3 3 2 3 2 3 2 3 3 0 1 3 1 3 3 1 1 0 1 1
split_gain=42.8245 10.0532 5.49238 3.01 4.36758 2.91842 2.39482 2.01818 2.77711 7.43945 5.47228 1.967 1.90062 2.24805 1.36923 1.31618 1.49927 2.45469 1.49016 1.27614 1.94168 1.47417 1.34993 5.02479 2.49227 1.58199 3.64967 1.2094 4.04459 1.46183 1.15032 0.828289 1.29661 0.917299 0.812039 0.562994 1.72959 1.41999 0.488547 1.44434 0.398365 0.256404 0.32522 2.93335 0.358215 0.896195 0.228421 0.183111 0.171687 0.233475 0.147715 0.147096 0.127985 0.0925981 0.0593094 0.0819552 0.0584051 0.0548861 0.0535028 0.0485195 0.0430913 0.072747 0.0325037 0.0315733 0.0305608 0.027558 0.017217 0.0155574 0.0150262 0.0139276 0.0121778 0.0117659 0.00713009 0.00645105 0.00635199 0.00553921 0.00462414 0.00359128 0.00305591 0.00265281 0.00194102 0.0026916 0.00155812 0.00120741 0.00102815 0.000843024 0.000245958 0.000125837 2.00367e-06 2.46151e-06 1.38495e-06
threshold=1.0000000180025095e-35 1.0000000180025095e-35 14.500000000000002 7.5000000000000009 0 1 218.50000000000003 2 20.500000000000004 19.500000000000004 1.0000000180025095e-35 16.500000000000004 1.5000000000000002 6.5000000000000009 1.0000000180025095e-35 3 4 6.5000000000000009 1.5000000000000002 25.500000000000004 22.500000000000004 1.5000000000000002 56.500000000000007 54.500000000000007 26.500000000000004 82.500000000000014 85.500000000000014 3.5000000000000004 1.5000000000000002 1.0000000180025095e-35 15.500000000000002 8.5000000000000018 9.5000000000000018 5 86.500000000000014 1.0000000180025095e-35 58.500000000000007 47.500000000000007 1.5000000000000002 2.5000000000000004 13.500000000000002 6 471.50000000000006 454.50000000000006 1.5000000000000002 243.50000000000003 248.50000000000003 14.500000000000002 7 541.50000000000011 11.500000000000002 78.500000000000014 23.500000000000004 7.5000000000000009 514.50000000000011 456.50000000000006 649.50000000000011 9.5000000000000018 2.5000000000000004 18.500000000000004 2.5000000000000004 20.500000000000004 18.500000000000004 8 621.50000000000011 9 10 11 12.500000000000002 1.5000000000000002 6.5000000000000009 1.5000000000000002 1.0000000180025095e-35 4.5000000000000009 1.5000000000000002 5.5000000000000009 1.5000000000000002 1.5000000000000002 1.5000000000000002 1.0000000180025095e-35 12 13 1.5000000000000002 14 2.5000000000000004 2.5000000000000004 15 16 17 18 19
decision_type=2 2 2 2 9 1 2 1 2 2 2 2 2 2 2 9 1 2 2 2 2 2 2 2 2 2 2 2 2 2 2 2 2 9 2 2 2 2 2 2 2 9 2 2 2 2 2 2 1 2 2 2 2 2 2 2 2 2 2 2 2 2 2 1 2 1 1 1 2 2 2 2 2 2 2 2 2 2 2 2 9 1 2 1 2 2 1 1 9 1 1
left_child=1 80 3 4 5 12 7 8 9 10 59 -12 27 85 -11 16 17 18 -3 20 21 30 23 24 -21 51 -27 28 -2 -29 -9 35 -33 -34 50 37 -37 -10 -7 -40 47 42 43 44 46 -46 -8 57 49 -44 71 -24 -22 74 55 60 -51 67 72 -4 -43 -62 -23 79 -50 68 69 82 -59 70 -60 -18 77 -68 87 -41 -67 86 -69 -42 81 -1 -5 -79 -76 -14 -6 -17 90 -90 -82
right_child=2 15 6 40 58 38 41 19 31 14 11 -13 13 -15 -16 53 34 -19 -20 22 52 62 25 -25 -26 26 -28 29 -30 -31 -32 32 33 -35 -36 36 -38 -39 39 75 63 54 48 -45 45 -47 -48 -49 64 56 -52 -53 -54 -55 -56 -57 -58 65 66 -61 61 -63 -64 -65 -66 76 73 78 -70 -71 -72 -73 -74 -75 84 -77 -78 83 -80 -81 88 -83 -84 -85 -86 -87 -88 -89 89 -91 -92
leaf_value=-0.024285258882187331 0.013553846902323358 -0.0010301660992614356 -0.014713251464628872 -0.011240526824540666 -0.022861122370344732 -0.022257562674907447 -0.00070927211850310592 -0.013165062503385123 0.0044184523875909184 0.031398363787452359 0.027546679498252014 0.003438677711879284 -0.022117184367910769 0.0097819293822245489 0.065199294680703221 -0.023175699931960003 -0.023872029303943134 -0.014258763961961516 0.018083044866662186 0.031973721663077333 -0.019499796691907802 -0.015815644587242113 -0.0020249485606851827 0.045445848026820182 0.0045365276595174097 0.030653602025731055 0.0037503067641857127 0.009563128493386917 -0.021770407888221287 0.029135448750017501 0.0086006226450376765 0.013664869244275873 -0.001299966150475192 0.007671562338311325 0.0093531764008609238 -0.0085042358361499693 -0.00058357756360505103 -0.0027117031204698851 0.0086360663994946938 -0.016004520649456587 -0.019461239393350895 0.0017843773524777882 -0.0011653626708779069 0.025476755025404137 0.013096984977983658 0.0051420558303920845 0.0043692075711069811 0.0032382045907517936 0.0048004106241944042 0.0058009255251680212 -0.010984768746686052 -0.0077832003717720651 -0.011319493679345108 -0.0065716840106175324 0.0049865167537462606 -0.00030221153647675325 0.0031754947443430252 -0.012138789211364144 -0.019093440005527089 -0.019414326465761446 0.0049071129559759051 0.0013175518022379186 -0.010687875480743465 -0.016263221610898822 0.0067711614940981968 -0.0088989166264357277 -0.016569209823793427 -0.014312610750729871 -0.0088077343072506236 -0.014087363770376352 -0.014606239726660288 -0.020344693403597822 -0.018591475650537297 -0.012745644153848013 -0.021180064503585075 -0.014257916894418358 -0.0067230793042053821 -0.021352418503774423 -0.016541737533515719 -0.020867010974781566 -0.024826038543103425 -0.024736385035992584 -0.012898473652433858 -0.019511939006320655 -0.019782043604698218 -0.021280149708714342 -0.022030002510591156 -0.022590055723862097 -0.024770349849511847 -0.024829265551374841 -0.024807399767912689
leaf_weight=73.802363097667694 25.702969685196877 19.918349623680115 15.244680590927601 5.1746179312467575 4.3985239863395718 6.9534513950347892 29.0415980219841 6.9681595638394347 110.4749636054039 7.930545359849928 16.075435474514961 17.862718470394611 5.7975557446479797 10.73328959941864 4.8153518438339233 3.4432107210159293 6.866924427449705 16.179378986358643 20.896071583032608 8.9181526601314527 10.530571550130846 6.3861088901758176 66.968052983283997 8.8797299265861493 115.06850239634514 13.172843128442763 293.03125816583633 40.856432467699051 11.834507048130034 12.446342915296553 47.11350354552269 21.623443529009819 130.83216893672943 36.423790007829666 2.9137587547302237 101.17652575671673 216.2011805921793 189.78293342888355 9.3494703620672244 11.799823820590975 9.5463888794183713 32.791652917861938 28.714622497558594 19.092283129692078 42.364372432231903 215.54050344228745 93.191441297531128 2.2364052906632415 39.848141312599182 29.746563315391541 3.6565788239240637 13.292044967412947 8.7581862807273847 1.1287993788719166 38.944244503974915 18.682608902454376 73.583122253417969 14.287662893533708 10.660087596625086 8.5764060020446777 53.858938038349152 19.127411484718323 5.9883218556642532 9.5437219068408012 38.851181745529175 9.8495158180594462 1.8577548712492014 9.7438067719340342 4.4368392601609221 2.137375831604003 1.7619391381740577 3.6054092422127724 2.0122812986373892 2.715810738503933 2.6626178920269012 7.3775603398680678 3.2467686235904685 2.5786942914128304 1.8255364894866932 5.1753027588129052 45.828879028558731 59.898982718586922 1.9515433013439176 1.3616660535335543 2.5987048037350178 6.2520100027322769 1.1160330064594735 1.2503031492233265 4.3632375225424758 2.9862677827477455 12.736213505268095
leaf_count=1488 128 74 98 59 84 93 34 26 396 35 35 42 27 15 23 66 55 27 48 21 18 22 178 20 371 21 457 177 166 31 133 39 272 62 5 463 524 505 76 151 39 39 21 13 52 209 104 8 26 22 12 25 32 6 25 13 43 169 136 26 60 19 27 37 19 101 28 126 47 26 25 36 33 35 47 72 30 46 16 16 936 1220 16 24 34 29 21 24 89 61 260
internal_value=0 -0.0184618 0.0019984 -0.00493125 -0.00138687 0.0021444 0.00278714 0.00161023 7.76886e-05 0.00959375 0.0019641 0.0148579 0.00605335 -0.00685941 0.0441682 -0.00407434 -0.0016687 0.00222213 0.00875537 0.00383155 -0.00181954 0.00223405 0.00476459 0.0091122 0.00651004 0.00326988 0.00490768 0.00929188 0.00241711 0.0141333 0.00579622 -0.000754201 0.00214333 0.000653788 -0.0146803 -0.0016403 -0.0031086 -8.82795e-05 -0.0103737 -0.00747704 -0.0132012 0.00504257 0.00551378 0.0063526 0.0053921 0.00644876 0.0031626 -0.0107624 0.00392473 0.00282297 -0.0196367 -0.00297858 -0.0157855 -0.0201435 0.0032836 0.00275075 0.0039313 -0.0113822 -0.0185934 -0.0164058 0.00328997 0.0039664 -0.0133342 -0.0185033 0.0057733 -0.0101189 -0.0169749 -0.0135324 -0.0113495 -0.0178155 -0.018457 -0.0226576 -0.021294 -0.0142988 -0.0216825 -0.0153326 -0.00835949 -0.0218692 -0.0146643 -0.0199554 -0.0245968 -0.0244874 -0.0116946 -0.0207164 -0.0204895 -0.0216829 -0.0226929 -0.0230197 -0.0248189 -0.0247943 -0.024822
internal_weight=0 284.736 2512.2 256.722 179.704 149.103 2255.47 1482.1 877.02 70.5051 57.7592 33.9382 113.623 22.7829 12.7459 85.1201 74.0365 56.9938 40.8144 605.075 85.7449 66.4561 519.331 132.866 123.987 386.464 306.204 90.8403 37.5375 53.3028 54.0817 806.515 188.879 167.256 17.0427 617.636 317.378 300.258 35.4803 28.5269 77.0181 773.379 609.974 399.23 380.138 257.905 122.233 52.7527 210.744 132.044 14.1289 80.2601 19.2888 11.0836 163.405 124.461 103.33 50.5163 30.6002 23.8211 105.778 72.9863 12.3744 24.2654 78.6993 31.8208 19.133 18.6955 18.7245 14.5594 12.422 10.4723 11.4672 4.57357 9.95484 19.1774 13.0963 9.45492 11.5693 14.7217 199.616 133.701 7.12616 3.94036 5.26132 12.0496 5.51456 4.69351 65.9146 7.34951 58.5651
internal_count=11145 4488 6657 2087 1423 965 4570 3871 2520 259 201 77 573 71 58 434 257 149 122 1351 258 208 1093 412 392 681 478 502 294 208 159 2261 373 334 108 1888 987 901 392 299 664 699 543 412 399 261 138 572 131 86 103 203 50 177 156 131 65 564 458 124 118 79 49 92 45 347 250 217 216 187 161 91 208 63 171 223 131 175 142 55 4054 2708 75 70 81 56 105 90 1346 150 1196
cat_boundaries=0 1 2 3 4 5 6 7 8 9 10 11 12 13 14 15 16 17 18 19 20
cat_threshold=2 1 1 2 1 2 2 1 1 1 1 2 2 1 1 1 1 1 1 1
is_linear=0
shrinkage=0.05


Tree=67
num_leaves=85
num_cat=19
split_feature=2 3 2 2 0 1 2 1 2 2 3 3 2 0 1 3 3 2 2 2 3 2 2 3 3 3 3 2 3 3 2 0 3 2 2 3 2 2 2 3 3 3 2 2 3 3 3 1 2 3 3 2 2 2 2 2 2 1 1 1 1 2 3 2 3 3 3 2 2 3 2 3 3 3 0 1 3 1 3 1 1 0 1 1
split_gain=41.4224 10.0258 5.22674 2.91836 4.2286 2.78106 2.27615 1.99262 2.55004 6.68107 5.20183 1.82586 1.78499 1.28479 1.44633 2.3422 1.38033 1.23452 2.43755 1.87548 1.65547 2.1185 1.65984 1.40957 1.22955 3.45553 1.12566 1.09278 0.875325 1.12764 2.42128 0.798014 0.792048 0.566785 0.533914 0.535679 0.483807 1.39345 0.395465 0.22815 1.26463 0.243669 0.368236 0.586978 0.177498 0.175417 0.148245 0.135419 0.127585 0.118008 0.0924752 0.0540798 0.0538876 0.0485592 0.0382181 0.0408457 0.0321818 0.0317322 0.0270109 0.0172059 0.0154041 0.0147645 0.0139364 0.0122076 0.0119702 0.00721673 0.00645137 0.00641151 0.00551623 0.0045056 0.00364777 0.00304301 0.00268109 0.00228131 0.00198864 0.00275653 0.00153648 0.00122187 0.00104033 0.000250406 0.000128267 2.05396e-06 2.52315e-06 1.41955e-06
threshold=1.0000000180025095e-35 1.0000000180025095e-35 14.500000000000002 7.5000000000000009 0 1 242.50000000000003 2 20.500000000000004 19.500000000000004 1.0000000180025095e-35 3.5000000000000004 16.500000000000004 3 4 6.5000000000000009 1.5000000000000002 25.500000000000004 26.500000000000004 22.500000000000004 1.0000000180025095e-35 56.500000000000007 47.500000000000007 1.5000000000000002 2.5000000000000004 1.5000000000000002 1.0000000180025095e-35 15.500000000000002 8.5000000000000018 9.5000000000000018 105.50000000000001 5 86.500000000000014 245.50000000000003 21.500000000000004 1.0000000180025095e-35 1.5000000000000002 2.5000000000000004 13.500000000000002 31.500000000000004 37.500000000000007 15.500000000000002 469.50000000000006 520.50000000000011 14.500000000000002 151.50000000000003 11.500000000000002 6 23.500000000000004 47.500000000000007 7.5000000000000009 9.5000000000000018 2.5000000000000004 18.500000000000004 458.50000000000006 317.50000000000006 18.500000000000004 7 8 9 10 12.500000000000002 1.5000000000000002 6.5000000000000009 1.5000000000000002 1.0000000180025095e-35 1.5000000000000002 4.5000000000000009 5.5000000000000009 1.5000000000000002 1.5000000000000002 1.5000000000000002 1.0000000180025095e-35 1.0000000180025095e-35 11 12 1.5000000000000002 13 2.5000000000000004 14 15 16 17 18
decision_type=2 2 2 2 9 1 2 1 2 2 2 2 2 9 1 2 2 2 2 2 2 2 2 2 2 2 2 2 2 2 2 9 2 2 2 2 2 2 2 2 2 2 2 2 2 2 2 1 2 2 2 2 2 2 2 2 2 1 1 1 1 2 2 2 2 2 2 2 2 2 2 2 2 2 9 1 2 1 2 1 1 9 1 1
left_child=1 74 3 4 5 11 7 8 9 10 53 24 -12 14 15 16 -3 19 -19 23 22 -22 -20 27 25 -2 -11 -9 34 30 -30 -31 46 -8 73 -36 -7 -38 44 41 -41 42 47 -44 51 49 64 -35 -21 -42 66 60 65 -4 55 -43 -25 72 61 62 76 -53 63 -54 -16 70 80 -61 -39 -60 79 -62 -40 -10 75 -1 -5 -72 -68 -6 -15 83 -83 -76
right_child=2 13 6 38 52 36 33 17 28 26 12 -13 -14 50 32 -17 -18 18 20 48 21 -23 -24 56 -26 -27 -28 -29 29 31 -32 -33 -34 39 35 -37 37 68 57 40 45 54 43 -45 -46 -47 -48 -49 -50 -51 -52 58 59 -55 -56 -57 -58 -59 69 67 71 -63 -64 -65 -66 -67 78 -69 -70 -71 77 -73 -74 -75 81 -77 -78 -79 -80 -81 -82 82 -84 -85
leaf_value=-0.024271888508279042 0.0089731960328093188 -0.0010056380134965005 -0.014563311239219681 -0.011086920309111199 -0.022815610168832771 -0.022199681633771211 0.013101835293207005 -0.013010487397825777 -0.014470694285410793 0.029660338502576579 0.026123584502058934 -0.020323886022701874 0.0033416401427696658 -0.023136929901434178 -0.023848902177429104 -0.014106962134868643 0.017314034069512211 0.030186246483359949 -0.0074488491369859482 -0.019394853163511742 0.014735907238123539 0.0045011603292948628 0.0032025996039861011 -0.015671955362372061 0.027892746628767257 -0.022717549800948353 0.059516758917163931 0.0083143384390731608 0.029311525692956076 -0.00073240824546359469 -0.0034498019179496466 0.0072753270961288573 0.0090349529670499824 0.0025949920750157106 0.00016349230264562761 -0.0027451018375406664 0.0083483012096307319 -0.01586214841064958 -0.019355748154828857 0.014207079756763342 0.00055198147008538945 0.0009141120062172971 0.012308026732399868 0.0048737616702942202 0.0031474634880426394 0.0074569094656403287 -0.010831851731646469 0.0049592954322057641 -0.011165701140485802 0.0042470517986288063 -0.0064513053519084087 -0.011983803259464377 -0.018982871063290167 -0.019308171798339695 4.6873301761333291e-05 0.0040032828848298478 -0.010535923448055621 -0.016122770569327972 -0.0087565213647893946 -0.016431207160608599 -0.01416100769250315 -0.0086659977200686366 -0.013934967775346885 -0.014455823489327958 -0.020252521968065196 -0.018474421156195357 -0.021101949425280504 -0.012590644568799676 -0.014106111657164007 -0.006600939818272325 -0.021277381452610263 -0.016403507160176373 -0.020783462457481767 -0.01282775931450171 -0.024825957507968944 -0.02473405854122249 -0.012743588025016765 -0.019407168846980904 -0.019681204874257428 -0.021967649752142764 -0.022538896209589446 -0.02476887246406698 -0.024829265712679613 -0.024806851803590504
leaf_weight=72.031638622283936 91.696692921221256 19.89784187078476 15.022024057805538 5.1167783737182617 4.2991094738245037 6.8003939837217322 21.299945950508118 6.877024643123149 5.1366894543170911 8.1835013628005964 16.524416327476501 6.2900312170386306 17.924248725175858 3.3643295019865027 6.7049384489655512 15.950318008661268 21.277373105287552 9.2079067826271039 48.215745642781258 10.327216714620592 61.861710771918297 276.77633199095726 151.50059169530869 6.2859028428792936 6.8476263731718054 9.4922493994235975 5.1397704631090155 47.520455896854401 11.165320321917536 149.36725150048733 11.396199166774748 39.297706708312035 2.9411393404006949 152.48813831806183 305.80356442928314 328.18258544057608 9.4305631369352358 11.612476527690889 9.3624003455042821 39.843278884887695 26.692637383937836 21.832618832588196 35.262399911880493 107.47956776618958 2.2436589971184722 35.981932640075684 3.6166318804025641 100.46554601192474 8.6596071720123273 113.42500305175781 1.1214056313037861 14.115276336669924 10.458480697125193 8.4115068018436432 27.781923055648804 20.985986649990082 5.9246603101491928 9.3897657692432404 9.7622544988989848 1.8272269368171716 9.605340741574766 4.3979323580861083 2.1074769198894492 1.7363908961415297 3.5327994152903557 1.97521562129259 2.6068165265023708 2.681415744125843 7.273118019104003 3.2250135764479628 2.5242165997624397 1.7955873161554325 5.0684285163879403 3.5893626362085342 44.705136984586716 58.435471504926682 1.9265330135822294 1.3353548347949984 2.5478022657334805 1.0917156524956215 1.2223753631114949 4.2564861103892317 2.9130338206887245 12.42414817214012
leaf_count=1488 502 74 98 59 84 93 14 26 28 35 35 21 42 66 55 27 48 21 168 18 184 451 300 22 17 33 23 133 21 299 19 66 5 176 888 990 76 151 39 29 23 26 22 63 8 23 12 94 32 88 6 169 136 26 20 20 27 37 101 28 126 47 26 25 36 33 47 35 72 30 46 16 16 20 936 1220 16 24 34 21 24 89 61 260
internal_value=0 -0.0183436 0.0019437 -0.00483522 -0.00135763 0.00208308 0.00270942 0.00164366 0.000164527 0.00925519 0.00190719 0.00586332 0.0142697 -0.003992 -0.00163253 0.00215975 0.00846109 0.00380491 0.00467782 -0.00177922 0.00424153 0.00637082 0.000631115 0.00217231 0.00738797 0.00600038 0.0411782 0.00561842 -0.000593496 0.00219889 0.0127632 0.000935552 -0.014531 0.00507001 -0.00151121 -0.00134214 -0.010224 -0.00734793 -0.0130468 0.00481925 0.00616286 0.00419702 0.00467982 0.00671029 -0.0106103 0.00434283 -0.0195338 0.00353402 -0.0156417 0.00354313 -0.0200482 -0.0112283 -0.0184764 -0.0162665 0.0014911 0.00242816 -0.0131799 -0.0183851 -0.00996933 -0.0168404 -0.0133785 -0.0111956 -0.0176894 -0.0183383 -0.0226079 -0.0212179 -0.0216135 -0.0141471 -0.0151859 -0.00822124 -0.0218038 -0.0145142 -0.0198572 -0.0137949 -0.0245911 -0.0244789 -0.0115401 -0.0206303 -0.0203997 -0.0226439 -0.0229776 -0.0248186 -0.0247934 -0.0248218
internal_weight=0 279.55 2517.33 255.489 179.48 149.443 2261.84 1558.3 925.144 71.2055 57.8822 114.327 34.4487 84.7838 73.921 57.1255 41.1752 633.157 547.562 85.5949 538.354 338.638 199.716 66.608 108.037 101.189 13.3233 54.3975 853.939 211.226 22.5615 188.665 16.7955 703.539 642.712 633.986 35.1166 28.3162 76.009 682.239 215.943 466.296 395.696 142.742 52.1884 176.1 13.8544 252.954 18.9868 140.118 10.8627 49.9447 30.0366 23.4335 70.6005 42.8186 12.2106 23.8206 31.5005 18.811 18.4442 18.5132 14.3023 12.1949 10.2377 11.2256 9.74132 4.50864 18.8856 12.9873 9.2504 11.4009 14.4308 8.72605 194.766 130.467 7.04331 3.85957 5.15462 5.39083 4.5867 64.2988 7.16952 57.1293
internal_count=11145 4488 6657 2087 1423 965 4570 3972 2590 259 201 573 77 434 257 149 122 1382 1124 258 1103 635 468 208 552 535 58 159 2331 405 40 365 108 598 1926 1878 392 299 664 584 163 421 355 85 572 134 103 270 50 111 177 564 458 124 66 46 49 92 347 250 217 216 187 161 91 208 171 63 223 131 175 142 55 48 4054 2708 75 70 81 105 90 1346 150 1196
cat_boundaries=0 1 2 3 4 5 6 7 8 9 10 11 12 13 14 15 16 17 18 19
cat_threshold=2 1 1 2 1 2 1 1 1 1 2 2 1 1 1 1 1 1 1
is_linear=0
shrinkage=0.05


Tree=68
num_leaves=86
num_cat=21
split_feature=2 3 2 2 0 1 2 1 2 2 3 3 2 0 1 3 3 0 2 2 3 2 2 2 2 2 3 3 3 3 2 3 0 2 2 2 3 2 2 2 2 2 3 2 2 3 0 1 3 3 3 2 2 2 2 2 1 2 2 1 1 1 2 3 2 3 3 3 2 2 3 2 3 3 3 0 1 3 1 3 1 1 0 1 1
split_gain=40.0644 9.99652 4.97368 2.82903 4.09407 2.65088 2.14469 1.88419 2.39938 6.02134 4.94734 1.74923 1.62333 1.25388 1.3951 2.23533 1.27996 1.23008 1.20984 3.69071 2.04541 0.982181 2.09618 1.88069 6.11082 1.78022 1.66473 0.935597 0.832024 1.05426 2.21376 0.772599 0.753098 0.549568 0.526485 0.51644 0.511444 0.478952 1.34437 0.392418 0.230797 2.43927 0.565952 1.23073 0.291396 0.17202 0.163916 0.149522 0.14873 0.131006 0.0923259 0.0542573 0.0532607 0.0487098 0.0485796 0.0451448 0.0318805 0.0282494 0.0427909 0.0264629 0.0171877 0.0152452 0.0145007 0.0139397 0.0122327 0.012176 0.00730252 0.00655098 0.00636937 0.0054909 0.00438831 0.00370441 0.00302883 0.00270889 0.00226156 0.00203743 0.00282301 0.00151443 0.00123617 0.00105237 0.000254893 0.000130726 2.10539e-06 2.58601e-06 1.45531e-06
threshold=1.0000000180025095e-35 1.0000000180025095e-35 14.500000000000002 7.5000000000000009 0 1 242.50000000000003 2 20.500000000000004 19.500000000000004 1.0000000180025095e-35 3.5000000000000004 16.500000000000004 3 4 6.5000000000000009 1.5000000000000002 5 3.5000000000000004 1.5000000000000002 2.5000000000000004 25.500000000000004 22.500000000000004 56.500000000000007 54.500000000000007 82.500000000000014 1.5000000000000002 1.0000000180025095e-35 8.5000000000000018 9.5000000000000018 105.50000000000001 86.500000000000014 6 45.500000000000007 245.50000000000003 21.500000000000004 1.0000000180025095e-35 1.5000000000000002 2.5000000000000004 13.500000000000002 471.50000000000006 456.50000000000006 34.500000000000007 317.50000000000006 500.00000000000006 14.500000000000002 7 8 11.500000000000002 11.500000000000002 7.5000000000000009 2.5000000000000004 9.5000000000000018 96.500000000000014 18.500000000000004 22.500000000000004 9 978.00000000000011 786.00000000000011 10 11 12 12.500000000000002 1.5000000000000002 6.5000000000000009 1.5000000000000002 1.0000000180025095e-35 1.5000000000000002 4.5000000000000009 5.5000000000000009 1.5000000000000002 1.5000000000000002 1.5000000000000002 1.0000000180025095e-35 1.0000000180025095e-35 13 14 1.5000000000000002 15 2.5000000000000004 16 17 18 19 20
decision_type=2 2 2 2 9 1 2 1 2 2 2 2 2 9 1 2 2 9 2 2 2 2 2 2 2 2 2 2 2 2 2 2 9 2 2 2 2 2 2 2 2 2 2 2 2 2 9 1 2 2 2 2 2 2 2 2 1 2 2 1 1 1 2 2 2 2 2 2 2 2 2 2 2 2 2 9 1 2 1 2 1 1 9 1 1
left_child=1 75 3 4 5 11 7 8 9 10 54 18 -12 14 15 16 -3 21 19 -2 -20 22 26 24 -23 -25 -9 -11 35 30 -30 48 -31 46 -8 74 -37 -7 -39 45 41 42 47 -44 -42 52 55 -36 65 53 67 66 61 -35 -4 -19 73 58 -46 62 63 72 -54 64 -53 -16 71 81 -62 -40 -61 80 -5 -41 -10 76 -1 -63 -73 -69 -6 -15 84 -84 -77
right_child=2 13 6 39 51 37 34 17 28 27 12 -13 -14 50 31 -17 -18 33 20 -21 -22 23 -24 25 -26 -27 -28 -29 29 32 -32 -33 -34 49 40 36 -38 38 69 56 44 -43 43 -45 57 -47 -48 -49 -50 -51 -52 60 59 -55 -56 -57 -58 -59 -60 70 68 77 -64 -65 -66 -67 -68 79 -70 -71 -72 78 -74 -75 -76 82 -78 -79 -80 -81 -82 -83 83 -85 -86
leaf_value=-0.024258192338623669 0.010555674803560372 -0.00098166693737550444 -0.01441271097921417 -0.014008859733150867 -0.022769138834346985 -0.022140652379280583 0.012608110276938365 0.0076190831726170973 -0.014319708085148831 0.028067891229144343 0.024809749601174984 -0.020231382264943677 0.0032476597012537269 -0.023097318270335371 -0.023825241503961245 -0.013954631129532775 0.016590642357238856 -0.0096426424938601263 0.0086668726104053902 -0.021785140418659997 0.04052446714117508 0.0079740562105930449 -0.01634778190144958 -0.0035495322557492805 0.054997211869250377 0.0053792183792441169 -0.013925769885330334 0.054643221756472106 0.027747608810506849 -0.00071475300797704713 -0.0033759195841822037 0.008730368730352633 0.0070426032290609262 -0.0021583969741215945 0.0025059620258512331 0.0001594065421334115 -0.00268439518800315 0.0080724785220199959 -0.015718776534314288 -0.019248771406871003 -0.0010551213760320495 0.021640129320914421 0.014386515789899116 0.0031964198677351739 0.0042248890125479912 0.0030595460768157033 -0.015259623970388578 0.0048081968909152051 -0.010679409424769682 0.0053387610056301665 -0.0063323604410027677 -0.018870829854917802 -0.011828939665129571 0.00076996583576416952 -0.019200534998182941 -0.0035794433771493706 -0.015981260007721182 0.005115273090065273 0.0023533378501684348 -0.0086151618051836191 -0.016292077469457031 -0.010933712529540059 -0.008525318283285321 -0.013782093277004193 -0.014304779135850543 -0.020158886592097462 -0.018355928400455 -0.021022460108405049 -0.012435578020953311 -0.013953777387828444 -0.0064802179085039742 -0.021200996701130553 -0.016264155695033585 -0.020698496629132604 -0.012672815134645894 -0.024825874383264009 -0.02473167387843388 -0.012588587549605582 -0.019300913941803579 -0.019578881315911581 -0.021904091209676197 -0.022486687803147342 -0.024767359968769075 -0.024829263841664319 -0.024806288039325074
leaf_weight=70.304345369338989 27.94453564286232 19.877841353416443 14.804839067161083 9.47027789801359 4.2021332681179073 6.651090942323207 21.580850601196289 49.136413335800171 5.0628935098648054 8.4298623800277692 16.9617810100317 6.1634836643934241 17.984244510531425 3.2873827815055838 6.5469244867563265 15.726886957883833 21.648978650569916 4.8072783350944528 62.527923099696636 12.891115099191664 5.4799878001213065 107.63912114500999 16.676939427852631 69.362408488988876 7.3828971982002249 286.04824450612068 10.967174738645552 5.454959347844123 11.497436463832857 149.25789351761341 11.356952309608458 2.9678329825401297 39.58465301990509 26.640849038958549 180.47855359315872 305.85356332361698 327.28292673826218 9.5096214711666125 11.429730981588365 9.1829268112778646 30.742522835731506 21.930190205574036 41.268762528896332 60.731339871883392 140.78354454040527 2.2507319450378409 6.917708858847619 115.76185131072998 3.5776685625314704 11.102905929088591 1.1141943931579579 10.261821094900366 13.947131365537645 30.410593450069427 8.2506533563137054 8.4954267442226392 9.2395906001329422 54.839645981788635 39.002466917037964 9.6771443635225314 1.7974486723542238 5.0603622347116479 4.3599845841526976 2.0783129930496207 1.7114703804254539 3.4619709476828575 1.9390596374869336 2.5523839294910431 2.6478666514158249 7.1712430268526068 3.2037955000996581 2.4710752815008163 1.7663736194372184 4.9641761034727105 3.5436132252216339 43.608951687812805 57.007855549454689 1.9021378383040426 1.3096892237663271 2.4981486722826958 1.0679947324097145 1.1951325237750996 4.15235262364149 2.8415959849953651 12.119735553860663
leaf_count=1488 137 74 98 126 84 93 14 132 28 35 35 21 42 66 55 27 48 30 232 173 10 327 40 171 15 431 41 23 21 299 19 5 66 71 209 888 990 76 151 39 21 14 39 49 96 8 17 108 12 18 6 136 169 47 26 42 37 26 22 101 28 59 47 26 25 36 33 47 35 72 30 46 16 16 20 936 1220 16 24 34 21 24 89 61 260
internal_value=0 -0.0182241 0.00189078 -0.0047402 -0.00132828 0.00202457 0.00263421 0.00159935 0.000159607 0.00893236 0.00185218 0.00568172 0.0137133 -0.00391097 -0.00159704 0.00209932 0.00817922 0.0036954 0.0071491 0.000346234 0.0112339 0.00457936 -0.000664008 0.00543515 0.0109923 0.00363667 0.00368777 0.0385086 -0.000579333 0.00213882 0.0122815 -0.014381 0.000911323 -0.00177806 0.00491861 -0.00147599 -0.00131062 -0.0100749 -0.00722009 -0.0128923 0.00467654 0.00540563 0.00451163 0.00772388 0.00352214 -0.0104587 -0.0090169 0.00340561 -0.0194294 0.000369593 -0.0199515 -0.018358 -0.0110748 -0.000597468 -0.0161261 -0.00577054 -0.0182656 0.00412189 0.00381888 -0.00982047 -0.0167048 -0.0132243 -0.0110422 -0.017562 -0.0182182 -0.0225571 -0.0211405 -0.0215432 -0.0139949 -0.0150383 -0.00808415 -0.0217371 -0.0143634 -0.0197575 -0.0136416 -0.0245851 -0.0244702 -0.0113858 -0.0205428 -0.0203084 -0.0225938 -0.0229345 -0.0248184 -0.0247925 -0.0248216
internal_weight=0 274.49 2522.31 254.28 179.256 149.769 2268.03 1560.91 925.326 71.8863 58.0015 115.007 34.946 84.4553 73.8081 57.2537 41.5268 635.588 108.844 40.8357 68.0079 547.213 76.7805 470.433 115.022 355.411 60.1036 13.8848 853.44 211.697 22.8544 16.5544 188.843 88.3748 707.12 641.743 633.136 34.7617 28.1106 75.0246 685.539 420.171 398.241 102 265.368 51.6379 20.2204 296.24 13.5866 68.1543 10.6472 29.4869 49.3872 57.0514 23.0555 13.3027 23.3867 234.626 179.786 31.1881 18.4969 18.1992 18.3071 14.0516 11.9733 10.0089 10.99 9.53305 4.44532 18.601 12.8809 9.05089 11.2367 14.1471 8.60651 190.035 127.312 6.9625 3.78076 5.05053 5.27013 4.48252 62.7226 6.99395 55.7287
internal_count=11145 4488 6657 2087 1423 965 4570 3972 2590 259 201 573 77 434 257 149 122 1382 552 310 242 1157 213 944 342 602 173 58 2331 405 40 108 365 225 598 1926 1878 392 299 664 584 419 405 88 165 572 89 317 103 136 177 458 564 118 124 72 92 144 118 347 250 217 216 187 161 91 208 171 63 223 131 175 142 55 48 4054 2708 75 70 81 105 90 1346 150 1196
cat_boundaries=0 1 2 3 4 5 6 7 8 9 10 11 12 13 14 15 16 17 18 19 20 21
cat_threshold=2 1 1 2 1 2 2 1 1 1 1 1 1 2 1 1 1 1 1 1 1
is_linear=0
shrinkage=0.05


Tree=69
num_leaves=91
num_cat=22
split_feature=2 3 2 2 0 1 2 1 2 3 3 3 3 2 2 0 1 3 3 0 2 2 2 3 3 2 2 2 3 2 2 2 2 2 2 0 2 2 3 2 2 3 0 1 2 3 3 3 2 0 2 2 2 2 2 2 3 3 2 1 2 2 1 1 3 1 2 3 3 2 3 3 3 2 2 3 2 3 3 0 1 3 1 3 3 1 1 0 1 1
split_gain=38.748 9.96526 4.73331 2.74151 3.96328 2.5268 2.0268 1.71144 2.38621 2.44108 5.6656 1.81854 1.69275 2.1585 1.50312 1.22347 1.34553 2.13377 1.18807 1.12792 1.05412 3.68885 1.29752 0.956552 1.95884 2.51505 1.77012 0.780526 0.753665 0.51577 0.475987 1.09949 0.473988 1.29702 0.389227 0.232104 0.300279 2.50064 0.320815 0.860488 0.218121 0.166674 0.160699 0.160437 0.220497 0.149172 0.103494 0.0921504 0.0826875 0.0566352 0.054771 0.0546113 0.0537697 0.083465 0.0524299 0.043767 0.0398609 0.0711175 0.0329627 0.0320179 0.0287507 0.0279415 0.0259145 0.0171624 0.0171261 0.0150811 0.0142353 0.0139374 0.0123832 0.0122531 0.00891102 0.00738924 0.00665076 0.00632466 0.00546325 0.00427235 0.00374171 0.00301338 0.00273618 0.00208736 0.00289102 0.001492 0.00143186 0.00106426 0.000692767 0.000382192 0.000133214 2.15829e-06 2.65111e-06 1.49168e-06
threshold=1.0000000180025095e-35 1.0000000180025095e-35 14.500000000000002 7.5000000000000009 0 1 218.50000000000003 2 23.500000000000004 26.500000000000004 17.500000000000004 7.5000000000000009 1.5000000000000002 6.5000000000000009 26.500000000000004 3 4 6.5000000000000009 1.5000000000000002 5 3.5000000000000004 1.5000000000000002 5.5000000000000009 9.5000000000000018 2.5000000000000004 31.500000000000004 56.500000000000007 94.500000000000014 86.500000000000014 45.500000000000007 27.500000000000004 35.500000000000007 1.5000000000000002 2.5000000000000004 13.500000000000002 6 471.50000000000006 454.50000000000006 1.5000000000000002 243.50000000000003 248.50000000000003 14.500000000000002 7 8 541.50000000000011 11.500000000000002 22.500000000000004 7.5000000000000009 96.500000000000014 9 649.50000000000011 2.5000000000000004 514.50000000000011 456.50000000000006 9.5000000000000018 22.500000000000004 20.500000000000004 2.5000000000000004 84.500000000000014 10 49.500000000000007 621.50000000000011 11 12 5.5000000000000009 13 12.500000000000002 1.5000000000000002 1.5000000000000002 6.5000000000000009 1.5000000000000002 1.5000000000000002 1.5000000000000002 4.5000000000000009 5.5000000000000009 1.5000000000000002 1.5000000000000002 1.5000000000000002 1.0000000180025095e-35 14 15 1.5000000000000002 16 2.5000000000000004 2.5000000000000004 17 18 19 20 21
decision_type=2 2 2 2 9 1 2 1 2 2 2 2 2 2 2 9 1 2 2 9 2 2 2 2 2 2 2 2 2 2 2 2 2 2 2 9 2 2 2 2 2 2 9 1 2 2 2 2 2 9 2 2 2 2 2 2 2 2 2 1 2 2 1 1 2 1 2 2 2 2 2 2 2 2 2 2 2 2 2 9 1 2 1 2 2 1 1 9 1 1
left_child=1 79 3 4 5 12 7 8 9 10 11 -4 20 84 49 16 17 18 -3 23 21 -2 -22 24 26 -26 -9 60 45 42 -16 -32 -7 -34 41 36 37 38 40 -40 -8 54 55 44 -38 68 -29 72 58 70 -46 71 53 56 65 -21 57 -37 -31 78 -25 -45 66 67 -50 81 -56 69 -18 -53 -10 76 86 -65 -35 -64 85 -67 -36 80 -1 -5 -78 -74 -14 -6 -17 89 -89 -81
right_child=2 15 6 34 51 32 35 19 14 -11 -12 -13 13 -15 30 47 28 -19 -20 29 22 -23 -24 27 25 -27 -28 46 -30 48 31 -33 33 74 59 52 43 -39 39 -41 -42 -43 -44 61 50 -47 -48 -49 64 -51 -52 63 -54 -55 62 -57 -58 -59 -60 -61 -62 -63 75 73 -66 77 -68 -69 -70 -71 -72 -73 83 -75 -76 -77 82 -79 -80 87 -82 -83 -84 -85 -86 -87 -88 88 -90 -91
leaf_value=-0.0242441699815652 0.012304806082636215 -0.00095824585484165161 0.0059865728446759124 -0.010780948458458809 -0.022585551435982554 -0.022080461718443314 -0.00090397677784766802 0.0072934009119392093 -0.016366285460702248 -0.021689662064057876 0.038629579825995547 -0.020643079656014637 -0.022009469120662262 0.009289230075767773 0.0081648374761974698 -0.023056848612590351 -0.023801031897377325 -0.013801815759102918 0.015909128161594687 -0.0094954950371010198 0.019775312991650629 -0.021662775299328627 0.0043223151194111478 -0.0097646901531769966 -0.012833006768006004 0.013352575710144253 -5.1966679670939542e-05 0.00075463502524598025 0.0084386559964964164 -0.00071294658737092826 -0.0085217954764922801 -0.00030833973801142224 0.007807949813697368 -0.015574439606763624 -0.019140313177301072 0.0016131892037343641 -0.0013749382184867682 0.023078196508447446 0.012410214320588692 0.0046844324326417138 0.004036650458574759 0.0029743494166204511 -0.015112474703869179 0.0043933272567943946 0.0053503264122600255 -0.010527487719247906 0.0049206046371820314 -0.0062148599301626245 0.0010753860648067591 -0.0094456785208526448 0.0028258378123348152 -0.018757321832157111 0.0045630388453642657 -0.00061236272878643222 -0.011674246685307789 -0.0035032446401585919 0.00094025747348388383 0.0045541009294999572 -0.0046402374773746018 -0.015838721934259892 -0.0063625494034350296 0.0062636274391311116 -0.0084748713639153702 -0.016151849641871507 0.0033394291397556251 -0.013856212038044075 -0.0083857279055534421 -0.013628786197836907 -0.020063780997883411 -0.014153145476868854 -0.01389182362756167 -0.017287041636232989 -0.020941584701220858 -0.012280493358007585 -0.013800960001422211 -0.006360925783158184 -0.021023693381843424 -0.01612371238198362 -0.020612104451181612 -0.024825788462213994 -0.024729230960905412 -0.012433521085229297 -0.01903031952804039 -0.019475071407987928 -0.021240913849105626 -0.021575835120795153 -0.022433413425177576 -0.024765804865497454 -0.024829265253403926 -0.024805711405808513
leaf_weight=68.619407951831818 26.567515209317207 19.858337044715881 97.771479777991772 5.0053352266550064 4.3173556625843075 6.5054493956267825 29.27793961763382 153.13645456731319 10.790774613618852 7.2620332241058341 13.525002956390379 6.8609715551137915 5.5760909169912338 10.888287842273712 15.098334506154059 3.2123233526945105 6.3927862420678156 15.508948236703871 22.01114496588707 4.7611462697386751 30.591762155294418 11.432237617671488 24.433708727359772 10.348197296261789 10.073166675865648 102.25470405817032 176.61227765679359 32.516418009996414 2.9938566684722892 20.472652122378353 43.373895615339279 672.38539871573448 9.5866983383893984 11.251474067568781 9.0078571662306768 33.003945708274841 28.971201062202454 20.048166275024414 43.14565646648407 218.88255655765533 94.265076458454132 2.2576286867260924 6.8129487335681924 40.403243541717529 30.190697073936462 3.5396644771099082 27.530379235744476 1.1071611791849125 23.205361753702164 4.9950310289859798 74.513469219207764 10.069987639784809 39.50534451007843 18.921881258487701 13.783123232424261 8.4650722742080671 19.407457947731018 54.505999386310577 7.2296855747699729 9.0931038931012154 15.528315037488936 39.485355854034424 9.5941322594881076 1.76840175688267 13.050078004598616 9.3385347351431864 4.3229722380638114 2.0498659685254088 3.3928802683949471 1.6871625706553466 5.489161565899848 1.1571118533611287 2.4992866143584251 2.6151427552103996 7.0718718543648711 3.1831013634800902 2.7484452649950981 1.737877421081065 4.8624813556671151 42.539650171995163 55.61524860560894 1.8783426731824873 1.3401388786733148 2.4497134499251842 6.1836495995521545 1.1970212571322907 1.1685579121112812 4.050773072987794 2.7719099633395672 11.822787746787069
leaf_count=1488 128 74 371 59 88 93 34 439 43 4 2 10 27 15 33 66 55 27 48 30 113 166 95 26 37 181 329 50 5 61 237 1766 76 151 39 39 21 13 52 209 104 8 17 26 22 12 40 6 36 31 43 136 25 13 169 42 19 60 13 37 29 19 101 28 21 126 47 26 36 25 23 19 47 35 72 30 52 16 16 936 1220 16 25 34 29 24 24 89 61 260
internal_value=0 -0.0181031 0.00183933 -0.00464683 -0.0012999 0.00196731 0.00256123 0.00147793 6.25908e-05 0.00644747 0.0081768 0.00424041 0.005506 -0.00675244 -0.0010021 -0.00383124 -0.00156221 0.00204079 0.00790908 0.00350741 0.00849045 0.00208565 0.0129135 0.00436356 0.0053018 0.0110043 0.00335925 -0.000463698 -0.0142304 -0.00187428 -0.000620738 -0.000806062 -0.00992649 -0.00709356 -0.0127375 0.00461805 0.00506247 0.00586143 0.00496623 0.00595656 0.00286579 -0.0103077 -0.00887388 0.00354501 0.00248557 -0.0193235 0.00266466 -0.0198532 0.000318822 -0.014103 0.00355376 -0.0182381 0.00295379 0.00244859 -0.0109216 -0.00566032 0.0029903 0.00344495 -0.00173788 -0.0181446 -0.00772309 0.00531773 -0.00967238 -0.0165679 0.00189032 -0.0130698 -0.0108891 -0.0174333 -0.0225053 -0.0180966 -0.015532 -0.0210617 -0.0214717 -0.0138423 -0.01489 -0.00794824 -0.0215165 -0.014212 -0.0196563 -0.024579 -0.0244613 -0.0112319 -0.0203703 -0.0202157 -0.0216053 -0.0223664 -0.0228906 -0.0248181 -0.0247916 -0.0248214
internal_weight=0 269.554 2527.18 253.104 179.039 150.089 2274.08 1489.55 877.552 125.419 118.157 104.632 115.673 22.648 752.133 84.1347 73.6976 57.3784 41.8695 611.997 93.0252 37.9998 55.0255 528 442.077 112.328 329.749 85.9233 16.3192 83.9969 730.858 715.759 34.4155 27.91 74.0645 784.528 619.183 405.619 385.571 262.028 123.543 51.101 20.0392 213.564 133.675 13.3253 60.0468 10.437 63.9578 21.275 104.704 28.9506 165.345 125.839 48.8434 13.2262 106.917 87.5099 27.7023 22.9634 25.8765 79.8886 30.8833 18.1906 36.2554 17.9601 18.1061 13.807 9.78567 11.7572 16.2799 10.7601 9.32988 4.38354 18.3233 12.7772 9.60296 11.0764 13.8703 185.42 124.235 6.88368 4.08858 4.949 11.7597 5.51438 4.38088 61.1851 6.82268 54.3624
internal_count=11145 4488 6657 2087 1423 965 4570 3871 2520 387 383 381 573 71 2133 434 257 149 122 1351 502 294 208 1131 986 218 768 145 108 220 2036 2003 392 299 664 699 543 412 399 261 138 572 89 131 86 103 90 177 131 97 65 458 156 131 564 72 118 99 74 92 55 45 347 250 57 217 216 187 91 161 66 208 171 63 223 131 189 142 55 4054 2708 75 77 81 56 112 90 1346 150 1196
cat_boundaries=0 1 2 3 4 5 6 7 8 9 10 11 12 13 14 15 16 17 18 19 20 21 22
cat_threshold=2 1 1 2 1 2 2 1 1 2 1 1 1 2 2 1 1 1 1 1 1 1
is_linear=0
shrinkage=0.05


Tree=70
num_leaves=85
num_cat=18
split_feature=2 3 2 1 2 3 3 0 3 2 2 2 2 2 2 2 3 3 1 3 3 2 2 3 3 2 2 3 2 2 0 0 2 2 2 2 2 2 2 3 2 1 1 2 2 0 1 2 3 2 2 2 2 3 2 1 2 3 2 2 2 2 2 3 2 2 2 0 3 2 0 1 2 3 1 3 3 2 1 2 2 1 0 0
split_gain=42.4702 6.02534 5.78071 3.93911 3.77702 3.1125 3.23737 3.72951 2.86902 3.17186 1.9787 2.04817 1.95584 2.36384 1.5737 1.34938 1.74543 2.75025 1.50153 1.27535 1.18263 0.894554 0.843891 1.81916 2.70328 2.52502 1.06276 2.98052 0.716038 3.21888 0.635038 0.629721 0.627036 0.427156 0.32334 0.274014 0.299744 2.05272 0.608053 0.241402 0.20049 1.71673 0.566692 0.188909 0.181821 0.0980132 0.0660546 0.0510661 0.0476815 0.0437576 0.0303036 0.028258 0.0268447 0.0248042 0.0222152 0.0194131 0.0132588 0.0755914 0.0283048 0.0349311 0.0116124 0.00996702 0.00939031 0.00806438 0.00675013 0.00528471 0.00524703 0.00439639 0.00264258 0.00258376 0.00254841 0.00355287 0.00225124 0.00118206 0.000993598 0.000970668 0.000810124 0.000342644 0.000277294 0.000204623 2.80649e-05 5.7118e-07 6.06464e-07 8.88178e-16
threshold=3.5000000000000004 1.0000000180025095e-35 21.500000000000004 0 1.0000000180025095e-35 1.0000000180025095e-35 7.5000000000000009 1 6.5000000000000009 19.500000000000004 198.50000000000003 205.50000000000003 14.500000000000002 13.500000000000002 22.500000000000004 1.0000000180025095e-35 2.5000000000000004 1.5000000000000002 2 1.0000000180025095e-35 91.500000000000014 212.50000000000003 37.500000000000007 22.500000000000004 1.0000000180025095e-35 27.500000000000004 38.500000000000007 1.0000000180025095e-35 41.500000000000007 42.500000000000007 3 4 7.5000000000000009 27.500000000000004 2.5000000000000004 1279.5000000000002 471.50000000000006 465.00000000000006 486.50000000000006 31.500000000000004 1.5000000000000002 5 6 13.500000000000002 8.5000000000000018 7 8 19.500000000000004 3.5000000000000004 6.5000000000000009 18.500000000000004 16.500000000000004 40.500000000000007 7.5000000000000009 6.5000000000000009 9 15.500000000000002 1.0000000180025095e-35 16.500000000000004 18.500000000000004 19.500000000000004 5.5000000000000009 1.5000000000000002 1.5000000000000002 17.500000000000004 10.500000000000002 6.5000000000000009 10 1.0000000180025095e-35 1.5000000000000002 11 12 2.5000000000000004 1.0000000180025095e-35 13 1.5000000000000002 6.5000000000000009 4.5000000000000009 14 4.5000000000000009 14.500000000000002 15 16 17
decision_type=2 2 2 1 2 2 2 9 2 2 2 2 2 2 2 2 2 2 1 2 2 2 2 2 2 2 2 2 2 2 9 9 2 2 2 2 2 2 2 2 2 1 1 2 2 9 1 2 2 2 2 2 2 2 2 1 2 2 2 2 2 2 2 2 2 2 2 9 2 2 9 1 2 2 1 2 2 2 1 2 2 1 9 9
left_child=1 4 3 5 70 12 7 8 9 -7 14 -12 13 30 19 16 17 18 -3 -4 39 -13 23 24 25 -16 27 -24 52 -30 32 34 -2 -26 40 36 37 -23 -38 46 42 -42 -6 44 61 -14 76 56 65 -32 51 -47 -28 -48 77 69 57 80 -58 -60 -52 67 78 66 -56 68 -63 79 -46 75 71 -1 -64 -67 -36 -17 -18 -9 -33 -5 -45 82 -72 -83
right_child=2 15 10 43 31 6 -8 54 -10 -11 11 21 45 -15 22 55 20 -19 -20 -21 -22 35 26 -25 33 -27 28 -29 29 -31 49 62 -34 -35 74 -37 38 -39 -40 -41 41 -43 -44 47 48 50 53 -49 -50 -51 60 -53 -54 -55 64 -57 58 -59 59 -61 -62 63 72 -65 -66 73 -68 -69 -70 -71 81 -73 -74 -75 -76 -77 -78 -79 -80 -81 -82 83 -84 -85
leaf_value=-0.024188443708845528 5.5383855235759316e-05 -0.014477802421690217 0.0017649007674289026 -0.01540394486282053 -0.022778871490085707 0.0077849222215865491 -0.017422807097997855 -0.015743971589419183 0.049139530181480956 0.045899527940281404 0.018051065754845455 -0.0040584743532762063 -0.0092424860762817529 0.021731394140268284 0.0087408221618638111 -0.023422903387018273 -0.023249932770685891 0.01553829746520612 0.011111300816750174 0.019753646779339537 0.0084548045430386538 0.0043065571513066702 0.033248539642643085 0.017958369239669973 -0.014603700858768826 -0.0070447693402584319 -0.0077511172710934585 -0.010726788894457136 0.026774979673044874 0.0013965759814097436 -0.018905422840782594 -0.022682767828658659 -0.011983047533612741 -0.0070219881365762814 -0.01966008893142622 0.0099407919698762844 -0.0040615140888846345 0.02018190685934744 0.0037024339672661263 -0.010061421881176143 -0.022354927857997042 0.013436862257668998 -0.0056099100672792499 -0.011506349389950984 -0.0095887626138591777 -0.016940741323147632 -0.019390090892741178 -0.012291123218013964 0.00042223884469289367 -0.012707108173741925 -0.019730287286281251 -0.012168101883686382 -0.0045021914247715001 -0.012043493521528151 -0.012166588680176994 -0.017760625570298401 -0.019130007600964435 -0.018597627580912258 -0.013328923090933933 -0.017664397899583777 -0.017164724590336602 -0.01392104608398537 -0.02052908169137484 -0.014827652484072674 -0.0094922417970811669 -0.0073137042746688682 -0.011243470104066414 -0.012888587832839568 -0.0074269330062658517 -0.021138201738603073 -0.024819785203626599 -0.024721977205892122 -0.018637841850193394 -0.0059754473625718094 -0.018350108399435388 -0.022153105050629812 -0.022462689358419996 -0.016824895034926648 -0.02180994821677992 -0.015954203225681481 -0.011693353989899645 -0.024829266557736325 -0.024799988091106964 -0.02482926538607514
leaf_weight=69.856468915939331 43.128382071852684 22.377388201653957 18.636169150471687 3.6500621065497416 5.8993601426482201 48.79387416690588 12.469691976904867 1.4372214451432221 5.7602843195199958 6.1460113674402228 27.060792982578278 32.485138058662415 4.6596285700798035 9.3187841251492483 60.277064636349678 3.1299105472862703 6.5276916995644569 21.362589746713638 7.7072793468832996 20.906110391020775 5.129454940557479 512.93886053562164 9.0717338621616346 10.850232511758803 32.875109978020191 43.697888478636742 16.90600848197937 6.6980724781751624 12.647266611456869 1033.9333192110062 5.8379645347595197 4.11141838878393 14.437623672187327 42.717120081186295 3.2730138301849356 21.729187965393066 28.157005310058594 21.203804492950439 241.62772685289383 6.9830990433692923 5.768712639808653 7.9911942631006241 25.93628287315369 4.5558120310306531 4.2304792404174831 8.6644050180912036 2.4135076440870842 11.308181181550024 2.0144574269652358 5.5584378689527512 8.3681821823120135 4.830559939146041 10.190326407551767 2.1927722692489624 8.6564840450882894 3.3492637090384951 8.4876046776771563 7.2931423783302298 8.6866569966077805 9.9880256354808807 9.3260249495506269 2.6014897748827917 3.31705292314291 3.6766015887260428 3.2435791864991179 6.2078953012824041 6.1669298633933067 1.814942095428705 2.1229773759841919 3.7310162670910358 41.85124146938324 56.391485139727592 2.9935624748468399 2.2474308758974075 2.5952882096171379 2.89899817481637 6.5440632998943329 1.4965814948081968 1.1686324775218961 3.1454509869217873 3.5851738005876541 12.021062463521957 4.2624911069869986 2.703932806849477
leaf_count=1552 177 132 43 53 85 195 28 23 8 25 36 38 39 42 144 20 31 99 83 34 11 541 26 6 114 224 72 22 42 2385 72 86 185 204 56 10 16 10 156 18 86 59 122 28 48 46 32 43 15 75 26 34 45 11 86 46 23 17 42 26 38 34 64 25 22 65 72 27 22 39 944 1268 53 22 39 21 11 18 24 40 17 271 96 61
internal_value=0 -0.0169269 0.00180032 -0.00478644 -0.020988 -0.000885952 0.00617974 0.0100762 0.0155685 0.0120487 0.00267846 0.00450725 -0.00633419 -0.00190478 0.00145151 -0.00615969 -0.00375765 0.00181935 -0.00792223 0.0112756 -0.0133889 0.00408015 0.00114799 -0.00192301 -0.00312433 0.00210656 0.00168475 0.0145704 0.00149549 0.00170326 -0.0050987 -0.0104048 -0.00296387 -0.0103193 -0.00803351 0.00440036 0.00425061 0.00493676 0.00289212 -0.0179324 -0.00661169 -0.00156851 -0.00879143 -0.0133765 -0.0106704 -0.0160064 -0.0210415 -0.015278 -0.00679499 -0.0158823 -0.017017 -0.0152324 -0.00652927 -0.0158928 -0.0123984 -0.0210452 -0.0160709 -0.0149007 -0.0167359 -0.0156477 -0.0183781 -0.0137669 -0.0209337 -0.0128621 -0.0114376 -0.00777676 -0.0120379 -0.0150748 -0.0088664 -0.0221723 -0.0245549 -0.0244268 -0.0196319 -0.00695799 -0.0190807 -0.0228123 -0.0228558 -0.0162954 -0.0224896 -0.0156586 -0.0115887 -0.0248207 -0.024818 -0.0248293
internal_weight=0 344.488 2498.53 293.917 250.141 202.134 88.0037 75.534 60.7002 54.9399 2204.61 885.203 114.13 78.2812 1319.41 94.347 81.2378 51.4473 30.0847 39.5423 29.7906 858.142 1279.86 190.417 179.567 103.975 1089.45 15.7698 1073.68 1046.58 68.9624 63.0545 57.566 75.5922 51.4639 825.657 803.927 534.143 269.785 24.6611 45.5955 13.7599 31.8356 91.7833 37.8787 35.8488 17.678 53.9046 16.8232 11.3964 31.1892 13.495 27.0963 4.60628 14.8339 13.1092 42.5964 15.4341 27.1623 18.6747 17.6942 21.0555 11.5907 12.445 11.9001 14.8088 8.76842 8.61046 6.35346 9.75992 187.087 126.248 6.31062 8.45533 5.8683 6.02891 13.0718 2.9338 5.28005 6.79551 8.14099 60.8387 46.1137 14.725
internal_count=11346 5420 5926 1758 4866 1139 405 377 228 220 4168 807 734 551 3361 554 428 314 215 77 114 771 3284 692 686 368 2592 48 2544 2427 509 674 362 318 447 733 723 551 172 103 352 145 207 619 423 183 85 196 172 147 144 80 117 43 149 126 153 62 91 68 64 251 227 131 108 157 106 120 70 80 4192 2820 117 87 95 41 42 41 110 93 45 1372 1040 332
cat_boundaries=0 1 2 3 4 5 6 7 8 9 10 11 12 13 14 15 16 17 18
cat_threshold=1 2 1 2 2 1 2 1 1 1 2 2 1 1 1 1 1 1
is_linear=0
shrinkage=0.05


Tree=71
num_leaves=90
num_cat=18
split_feature=2 3 2 1 2 3 3 0 3 3 2 2 2 2 2 3 3 1 3 3 2 3 3 2 2 3 2 2 0 0 2 2 2 2 2 2 3 3 2 2 3 3 3 2 2 1 1 2 2 3 2 0 1 2 3 2 2 2 2 3 2 1 2 2 2 2 2 2 3 2 2 2 0 2 0 1 3 2 2 3 1 3 3 2 1 2 1 0 0
split_gain=41.0408 5.99012 5.50263 3.81746 3.80043 2.96119 3.08196 3.49894 2.52143 2.94364 1.90602 2.21436 1.87846 1.46827 1.3239 1.68564 2.59077 1.44438 1.17294 1.15106 0.813435 1.70733 2.6003 2.39205 0.987822 2.72992 0.686988 2.96294 0.623126 0.618767 0.605406 0.500249 0.419576 0.318132 0.306675 2.79938 0.241236 0.229159 1.83535 0.293751 0.209415 0.462138 1.34544 0.475522 0.193812 1.65037 0.55963 0.186936 0.178462 0.150405 0.141116 0.0972796 0.0667249 0.0507551 0.045998 0.0436597 0.0303307 0.0281053 0.0260193 0.0247445 0.022002 0.0196337 0.0132461 0.0239551 0.0392086 0.0116773 0.0098868 0.00951681 0.0079836 0.00663795 0.0051813 0.00514732 0.00436944 0.00262663 0.00261067 0.003638 0.00257979 0.00227185 0.00129191 0.00114742 0.00100098 0.000989016 0.000825585 0.000342346 0.000282137 0.000204066 5.8539e-07 6.21606e-07 2.22045e-15
threshold=3.5000000000000004 1.0000000180025095e-35 21.500000000000004 0 1.0000000180025095e-35 1.0000000180025095e-35 7.5000000000000009 1 6.5000000000000009 3.5000000000000004 14.500000000000002 13.500000000000002 204.50000000000003 22.500000000000004 1.0000000180025095e-35 2.5000000000000004 1.5000000000000002 2 1.0000000180025095e-35 91.500000000000014 37.500000000000007 22.500000000000004 1.0000000180025095e-35 27.500000000000004 38.500000000000007 1.0000000180025095e-35 41.500000000000007 42.500000000000007 3 4 7.5000000000000009 208.50000000000003 27.500000000000004 2.5000000000000004 314.50000000000006 320.50000000000006 31.500000000000004 1.0000000180025095e-35 471.50000000000006 783.00000000000011 16.500000000000004 1.5000000000000002 2.5000000000000004 248.50000000000003 1.5000000000000002 5 6 13.500000000000002 8.5000000000000018 66.500000000000014 241.50000000000003 7 8 19.500000000000004 3.5000000000000004 6.5000000000000009 18.500000000000004 16.500000000000004 40.500000000000007 7.5000000000000009 6.5000000000000009 9 18.500000000000004 16.500000000000004 15.500000000000002 19.500000000000004 5.5000000000000009 1.5000000000000002 1.5000000000000002 17.500000000000004 6.5000000000000009 10.500000000000002 10 1.5000000000000002 11 12 1.0000000180025095e-35 2.5000000000000004 17.500000000000004 1.0000000180025095e-35 13 1.5000000000000002 6.5000000000000009 4.5000000000000009 14 4.5000000000000009 15 16 17
decision_type=2 2 2 1 2 2 2 9 2 2 2 2 2 2 2 2 2 1 2 2 2 2 2 2 2 2 2 2 9 9 2 2 2 2 2 2 2 2 2 2 2 2 2 2 2 1 1 2 2 2 2 9 1 2 2 2 2 2 2 2 2 1 2 2 2 2 2 2 2 2 2 2 9 2 9 1 2 2 2 2 1 2 2 2 1 2 1 9 9
left_child=1 4 3 5 74 10 7 8 9 -7 11 29 13 18 15 16 17 -3 -4 36 21 22 23 -15 25 -22 58 -28 33 30 -2 -14 -24 44 40 -36 52 38 -37 -39 41 43 -43 -33 46 -46 -6 48 66 50 -42 -12 82 62 71 -31 57 -53 -26 -54 83 -16 63 64 -49 -58 72 84 70 -62 -68 76 85 81 75 -1 -50 -69 -65 -73 -35 -63 -17 -9 -30 -5 87 -76 -88
right_child=2 14 12 47 28 6 -8 60 -10 -11 51 -13 31 20 61 19 -18 -19 -20 -21 24 -23 32 -25 26 -27 27 -29 67 55 -32 34 -34 80 35 37 -38 39 -40 -41 49 42 -44 -45 45 -47 -48 53 54 -51 -52 56 59 -55 -56 -57 65 -59 -60 -61 69 73 -64 78 -66 -67 68 77 -70 -71 -72 79 -74 -75 86 -77 -78 -79 -80 -81 -82 -83 -84 -85 -86 -87 88 -89 -90
leaf_value=-0.024172754293418697 5.4005895412555925e-05 -0.014326846270477143 0.0017180061746899225 -0.015257633386745973 -0.022731629655817962 0.016031993608467316 -0.017292634778758469 -0.015599801474931285 0.045592597750086339 -0.018284169249700818 -0.0090977576706637916 0.020730482416142421 0.011298836440423012 0.0084486701005180125 -0.017633960993362532 -0.02321278358309475 0.014915900439530921 0.010714163271319318 0.018881614012944064 0.0081745805438560633 0.031349288542278246 0.017196832093283165 -0.014453274154872742 -0.0069190393014257031 -0.007618228147718023 -0.0105747002288041 0.025411613766026853 0.0013861340427642785 -0.022633521730301549 -0.018792364966103214 -0.011828184172407696 -0.0019840851185847675 -0.0068965056397450406 -0.019557456957384894 0.02324733634074852 0.013732600303980986 -0.0099120861516244496 0.0029239627029092343 0.001368150087268711 0.0064830648749536384 0.0032171045111291743 0.01706010855370468 0.0033730832731322675 0.0046958234050313505 -0.02229899158581275 0.012926125625576906 -0.0055017870693658292 -0.014751665911201818 -0.0094419219802155032 0.0048967588523897623 -0.0014025840430648175 -0.016805965492905344 -0.019283595157478694 -0.012136064144576169 0.00041157910453994422 -0.012552087481427844 -0.019628684003361891 -0.012013098422758411 -0.0044104687461992628 -0.011888576890090423 -0.012011586061438874 -0.023389573978328033 -0.017536710514425211 -0.013820444418831299 -0.019019931233162913 -0.017032028606405781 -0.013768130623067511 -0.020439890168119965 -0.014678246801891073 -0.0093459660291773383 -0.011089856401171563 -0.0071851311287642709 -0.012733693672996912 -0.021059349526943067 -0.024819546094023176 -0.024719292051159143 -0.0072972060075677404 -0.018521365142446313 -0.012591180333365508 -0.0058624501311881419 -0.018230117712877015 -0.022093158379063175 -0.022408928603865119 -0.016689083068372707 -0.021743373846454691 -0.015811472793678394 -0.024829263914519603 -0.024799253267347207 -0.024829265741673219
leaf_weight=68.187023103237152 43.130771234631538 22.055746041238308 18.669089287519455 3.5942676737904566 5.7664983719587326 48.434914670884609 12.254316635429857 1.4147710353136056 6.0504122227430335 7.1749829873442641 4.6167604550719261 9.5235106050968152 25.630157828330994 60.80624495446682 3.2903037741780281 6.3776738941669464 21.697120577096939 7.793395102024081 21.323188468813896 5.173007369041442 9.3784261047840136 11.046845346689222 32.398500293493271 43.39112862944603 16.775474593043327 6.6266077011823645 12.990470990538595 1056.7394672930241 4.0192099884152395 5.7286320626735669 14.265649929642676 51.582835912704468 42.418211668729782 3.2092944979667655 20.105079889297485 48.323823273181915 6.9131915122270575 304.81432813405991 79.20639955997467 71.591212511062622 24.044353544712067 22.301365673542023 92.129953861236572 55.101975739002228 5.6411841809749586 8.0992950648069364 25.791191130876545 15.205947697162628 4.190108090639117 20.117119431495667 52.899346232414246 8.5188599824905413 2.3671603538096031 11.170041963458059 2.0153081864118567 5.4882530346512794 8.2046936154365557 4.7721373140811911 10.144550800323488 2.1665220260620117 8.5518022477626783 3.0574508011341077 9.8131422400474531 4.0682427957653982 8.3267800211906433 9.1673126965761167 2.565525218844412 3.2496511489152908 3.6224884539842597 3.2129359990358344 6.0979807153344154 6.1626584008336049 1.7917001359164713 3.6529769450426102 40.825286984443665 55.014465034008026 2.1072685644030571 2.9382856525480747 4.5033987984061241 2.2340415418148041 2.5480986312031746 2.8354825079441071 6.3987046480178833 1.4716123118996618 1.1434206068515775 3.0956660881638527 11.726263705641031 4.1580812931060782 2.63762270286679
leaf_count=1552 177 132 43 53 85 188 28 23 8 32 39 42 23 144 46 31 99 83 34 11 26 6 114 224 72 22 42 2416 86 72 185 64 204 56 15 42 18 239 44 38 32 22 113 69 86 59 122 62 48 21 54 46 32 43 15 75 26 34 45 11 86 20 26 21 23 38 34 64 25 22 72 65 27 39 944 1268 22 53 21 22 39 21 11 18 24 40 271 96 61
internal_value=0 -0.0167926 0.00175163 -0.00469257 -0.0209066 -0.000868005 0.00598296 0.00972063 0.0149395 0.0116044 -0.00621785 -0.00186243 0.00260446 0.00143266 -0.00604655 -0.00368076 0.00176817 -0.00778882 0.0108693 -0.0132355 0.00114296 -0.00188005 -0.00305727 0.00204906 0.00165935 0.0139914 0.00147937 0.00167789 -0.010255 -0.00499832 -0.00289926 0.00441742 -0.0101689 -0.00789919 0.00420801 0.00495145 -0.0178077 0.00422152 0.00605329 0.00360089 0.00298355 0.00383342 0.00604053 0.00146604 -0.00649209 -0.00153562 -0.00865018 -0.0132223 -0.0105187 0.00104745 4.10354e-05 -0.0158641 -0.020961 -0.015131 -0.00667211 -0.0157391 -0.0168829 -0.0150851 -0.00640942 -0.0157497 -0.0122433 -0.0209647 -0.015929 -0.0154376 -0.0162619 -0.0182584 -0.0136136 -0.0208513 -0.0127072 -0.0112836 -0.011883 -0.00764365 -0.0149266 -0.0221128 -0.024548 -0.0244168 -0.00872424 -0.0195289 -0.0131746 -0.00683322 -0.01897 -0.0227658 -0.0228102 -0.0161552 -0.0224364 -0.0155139 -0.0248205 -0.0248177 -0.0248293
internal_weight=0 338.734 2503.1 292.547 244.955 201.982 88.5657 76.3114 61.6603 55.6099 113.417 78.1368 2210.56 1342.71 93.7787 80.9425 51.5463 29.8491 39.9923 29.3963 1302.72 190.061 179.014 104.197 1112.65 16.005 1096.65 1069.73 62.4061 68.6133 57.3964 867.848 74.8167 51.0556 842.218 524.041 24.2233 503.936 127.53 376.406 318.177 221.116 114.431 106.685 45.2982 13.7405 31.5577 90.5646 37.477 97.0608 76.9437 35.2798 17.3101 53.0876 16.7094 11.2169 30.663 13.291 26.92 4.53368 14.6511 12.8362 41.9175 32.1044 23.5327 17.372 20.7676 11.3506 12.286 11.7647 8.66351 14.6941 8.48163 9.54591 182.549 123.201 6.29738 6.18794 8.57164 8.3967 5.75739 5.89293 12.7764 2.88638 5.16263 6.68993 59.3473 44.9834 14.3639
internal_count=11346 5420 5926 1758 4866 1139 405 377 228 220 734 551 4168 3392 554 428 314 215 77 114 3315 692 686 368 2623 48 2575 2458 674 509 362 776 318 447 753 378 103 363 86 277 375 268 135 133 352 145 207 619 423 107 86 183 85 196 172 147 144 80 117 43 149 126 153 127 85 64 251 227 131 108 106 157 120 80 4192 2820 70 117 42 87 95 41 42 41 110 93 1372 1040 332
cat_boundaries=0 1 2 3 4 5 6 7 8 9 10 11 12 13 14 15 16 17 18
cat_threshold=1 2 1 2 2 1 2 1 1 2 2 2 1 1 1 1 1 1
is_linear=0
shrinkage=0.05


Tree=72
num_leaves=92
num_cat=20
split_feature=2 3 2 2 1 3 3 0 3 2 2 2 2 2 2 3 3 1 3 3 2 3 2 3 2 2 0 2 2 2 3 1 2 2 2 1 3 3 2 2 3 3 3 2 2 1 1 2 2 3 2 2 0 1 2 2 3 2 2 3 2 1 3 2 2 2 2 2 2 3 2 2 2 0 0 0 1 2 3 2 3 2 3 1 3 2 1 2 1 0 0
split_gain=39.6557 5.95318 5.23791 3.82307 3.69866 2.81756 2.93536 3.28549 2.22661 2.79635 1.85692 2.07615 1.77114 1.37696 1.29857 1.62763 2.44188 1.38955 1.12033 1.08022 0.803319 3.10001 2.02615 5.93945 2.26628 0.921996 0.616374 0.613173 0.7285 0.466172 0.426073 0.630324 0.312894 0.288036 2.57513 0.272546 0.240985 0.214767 1.70808 0.275663 0.197521 0.434375 1.24529 0.450287 0.187305 1.58725 0.552491 0.184897 0.17509 0.142161 0.133941 0.127266 0.0965106 0.0673838 0.0665687 0.050423 0.0443629 0.0303456 0.027941 0.0246749 0.0217809 0.0198515 0.01752 0.0132349 0.0238387 0.0392209 0.0117384 0.00980273 0.00964272 0.00789997 0.00652463 0.00511401 0.00501148 0.00483604 0.00434071 0.00267441 0.00372506 0.00266972 0.00251744 0.00229194 0.00139101 0.00127879 0.00111338 0.00100807 0.00100757 0.000341905 0.000287017 0.000203422 6.00283e-07 6.37121e-07 1.77636e-15
threshold=3.5000000000000004 1.0000000180025095e-35 21.500000000000004 1.0000000180025095e-35 0 1.0000000180025095e-35 7.5000000000000009 1 6.5000000000000009 19.500000000000004 14.500000000000002 13.500000000000002 204.50000000000003 22.500000000000004 1.0000000180025095e-35 2.5000000000000004 1.5000000000000002 2 91.500000000000014 1.0000000180025095e-35 25.500000000000004 22.500000000000004 27.500000000000004 1.0000000180025095e-35 37.500000000000007 38.500000000000007 3 4.5000000000000009 7.5000000000000009 208.50000000000003 1.0000000180025095e-35 4 2.5000000000000004 314.50000000000006 320.50000000000006 5 31.500000000000004 1.0000000180025095e-35 471.50000000000006 783.00000000000011 16.500000000000004 1.5000000000000002 2.5000000000000004 248.50000000000003 1.5000000000000002 6 7 13.500000000000002 8.5000000000000018 66.500000000000014 241.50000000000003 32.500000000000007 8 9 23.500000000000004 19.500000000000004 3.5000000000000004 18.500000000000004 16.500000000000004 7.5000000000000009 6.5000000000000009 10 2.5000000000000004 18.500000000000004 16.500000000000004 15.500000000000002 19.500000000000004 5.5000000000000009 1.5000000000000002 1.5000000000000002 17.500000000000004 6.5000000000000009 10.500000000000002 11 12 13 14 1.5000000000000002 1.0000000180025095e-35 2.5000000000000004 7.5000000000000009 17.500000000000004 1.0000000180025095e-35 15 1.5000000000000002 4.5000000000000009 16 4.5000000000000009 17 18 19
decision_type=2 2 2 2 1 2 2 9 2 2 2 2 2 2 2 2 2 1 2 2 2 2 2 2 2 2 9 2 2 2 2 1 2 2 2 1 2 2 2 2 2 2 2 2 2 1 1 2 2 2 2 2 9 1 2 2 2 2 2 2 2 1 2 2 2 2 2 2 2 2 2 2 2 9 9 9 1 2 2 2 2 2 2 1 2 2 1 2 1 9 9
left_child=1 3 4 75 5 10 7 8 9 -7 11 27 13 19 15 16 17 -3 36 -4 21 30 23 35 51 -26 32 73 -29 -14 31 -15 44 40 -35 -22 53 38 -36 -39 41 43 -43 -31 46 -46 -5 48 67 50 -42 -24 -12 80 -32 63 72 58 -54 -55 85 -16 -25 64 65 -49 -59 74 86 71 -62 -69 78 -2 87 76 -1 84 -50 -70 -17 -66 -74 -34 -63 -9 -28 -6 89 -77 -90
right_child=2 14 12 26 47 6 -8 60 -10 -11 52 -13 29 20 61 18 -18 -19 -20 -21 22 -23 24 62 25 -27 68 28 -30 33 54 -33 83 34 37 -37 -38 39 -40 -41 49 42 -44 -45 45 -47 -48 55 56 -51 -52 -53 57 59 -56 -57 -58 66 -60 -61 70 77 -64 -65 81 -67 -68 69 79 -71 -72 -73 82 -75 -76 88 -78 -79 -80 -81 -82 -83 -84 -85 -86 -87 -88 -89 90 -91 -92
leaf_value=-0.024156692079207304 -0.020029391546011521 -0.014175297770474419 0.0016724366189142797 -0.022683401601194905 -0.01511047324821801 0.0071519547038371616 -0.017161173282936197 -0.015454694701700803 0.04245397562657411 0.042016054262569026 -0.008953983647628774 0.019795728929709374 0.010892927157423758 -0.0014294658327800741 -0.017505953992897599 -0.023241295435372025 0.014327466760829589 0.010335379611591465 0.007905887943732412 0.018064027373113235 0.030340221120138851 0.022000893022105682 -0.008634701088392871 -0.014343468933925841 0.013443870940340661 0.0014403666124928021 -0.022583257774601267 0.00020765958077349729 -0.011722619944052564 -0.0019387133950751129 -0.018868159825419405 -0.016013896459546657 -0.019453338327498404 0.022142574511046387 0.013206665381275243 0.020101471127836917 -0.0097634906931235443 0.0028429318173239689 0.0013323326664951719 0.0062807217017912037 0.0031270213874596527 0.016351532251474839 0.0032781146558460992 0.0045575037921714101 -0.022241937019227404 0.012441234128830752 -0.0053951583766658363 -0.014601902967403808 -0.0092959481152146001 0.0047515534402129099 -0.0013697031242071844 -0.0047950708474715116 -0.016669986873400142 -0.019175616860876564 -0.01269082635447848 -0.011981080285160517 0.0004011924429789147 -0.019525595542359327 -0.011858207859326068 -0.011733812351002666 -0.011856697061068878 -0.023355502244973333 -0.010861792721636395 -0.017407694809353717 -0.013667241539742154 -0.018908380271521457 -0.016898088643374543 -0.013614786217700387 -0.020349248595672172 -0.014528148802534635 -0.0092005812736123838 -0.010936640598465483 -0.0070578993589501737 -0.017180119981697887 -0.012578687560817123 -0.024819300654447256 -0.024716539629073803 -0.020979114954884165 -0.007168802986508559 -0.018403444854018302 -0.022180665463050996 -0.012436114409522988 -0.0057509315599497852 -0.018108711812725307 -0.022032036239672217 -0.016552091220824499 -0.021675540486942341 -0.015667755953995756 -0.024829265326360497 -0.024798499799940584 -0.024829263637557584
leaf_weight=66.558517158031464 4.6337279081344596 21.742009103298187 18.701190620660782 5.6368949264287949 3.5398439168930071 49.759595096111298 12.044228829443453 1.3928721435368054 6.3326511383056632 6.5030723959207526 4.5749486312270164 9.7229978591203672 25.921390950679779 23.497579112648964 3.232791256159544 6.863796092569828 22.023178175091743 7.8773435056209591 5.2154679000377646 21.729628995060921 16.109260767698288 9.3601671457290632 44.880131766200066 9.08706036955118 16.233992546796799 1098.2781415134668 3.9292627945542318 43.27709049731493 18.167433127760887 51.480593085289001 8.2828599214553851 10.819687172770498 3.1471387445926657 20.57794463634491 48.992012083530426 10.89562499523163 6.8450057804584494 305.70689845085144 79.314839363098145 72.056849956512451 24.121831297874451 22.685093283653259 92.441240608692169 55.36133348941803 5.5167832225561124 8.2046678066253644 25.649682551622394 14.983280897140506 4.1507315263152149 20.215869784355164 52.825202286243439 41.570834323763847 8.37688857316971 2.3219502866268238 9.211292549967764 11.035300545394419 2.0161378011107436 8.0452165007591265 4.7151523530483237 2.1409176886081696 8.4496960788965207 2.9867683164775354 5.9983361810445777 9.6425522863864881 4.0124046206474286 8.1699018478393555 9.012496814131735 2.5304447859525663 3.1839028485119343 3.5697050318121901 3.1830479428172103 6.0307283774018288 6.1185374483466131 2.1945337951183319 1.7690298110246656 39.824494302272797 53.671219155192375 3.5768520943820477 2.0919473916292191 2.8843655735254288 5.6244507133960724 4.4470511600375175 2.2209829166531563 2.5020672753453255 2.7735246829688549 1.4472562372684477 1.118827164173126 3.0471038073301315 11.438693352043629 4.0562320947647086 2.5729389749467346
leaf_count=1552 58 132 43 85 53 195 28 23 8 25 39 42 23 69 46 32 99 83 11 34 30 2 225 29 48 2575 86 172 239 64 17 26 56 15 42 19 18 239 44 38 32 22 113 69 86 59 122 62 48 21 54 206 46 32 41 43 15 26 34 11 86 20 28 26 21 23 38 34 64 25 22 72 65 40 27 944 1268 39 22 53 10 21 22 39 21 18 24 40 271 96 61
internal_value=0 -0.0166572 0.00170432 -0.0208239 -0.00460003 -0.000850267 0.00579394 0.00938137 0.0143455 0.0111817 -0.00610292 -0.0018209 0.00253266 0.00139463 -0.0059348 -0.00360514 0.00171859 -0.00765662 -0.0130817 0.0104821 0.00111291 -0.0044809 0.00138819 0.0121711 0.00101028 0.00161521 -0.0101057 -0.00489941 -0.00331979 0.00428814 -0.00926505 -0.0060277 -0.00776606 0.00408572 0.00480399 0.0262092 -0.0176817 0.00409897 0.00586637 0.00349868 0.00290039 0.00372338 0.00585417 0.00142737 -0.00637388 -0.00150332 -0.00850998 -0.0130679 -0.0103675 0.00102026 3.99578e-05 -0.00678838 -0.0157208 -0.0208791 -0.0156156 -0.0149831 -0.00655063 -0.0167476 -0.014937 -0.0156056 -0.0120883 -0.0208829 -0.0129591 -0.0157862 -0.0152916 -0.0161215 -0.0181373 -0.0134599 -0.0207675 -0.0125521 -0.0111299 -0.0117282 -0.00751179 -0.0191137 -0.0147777 -0.0245411 -0.0244066 -0.022052 -0.00858313 -0.0194244 -0.0227636 -0.0130201 -0.00670983 -0.0188578 -0.0227183 -0.0160139 -0.0223821 -0.0153683 -0.0248203 -0.0248174 -0.0248293
internal_weight=0 333.12 2507.57 239.896 291.209 201.833 89.1124 77.0682 62.5953 56.2627 112.72 77.9958 2216.36 1344.66 93.2241 80.6541 51.6425 29.6194 29.0116 40.4308 1304.22 61.1716 1243.05 42.0903 1200.96 1114.51 61.7736 68.2728 61.4445 871.701 51.8114 34.3173 50.6572 845.78 526.649 27.0049 23.7961 506.071 128.307 377.764 319.131 221.968 115.126 106.842 45.008 13.7215 31.2866 89.3757 37.0852 97.1629 76.947 86.451 34.7247 16.9511 17.4942 52.2905 16.5983 30.1498 13.092 4.46287 14.4729 12.5699 15.0854 41.2552 31.6126 23.1532 17.0577 20.4869 11.1164 12.1309 11.6327 8.56117 14.5822 6.82826 8.35598 178.122 120.23 9.33715 6.24268 6.06827 12.4882 8.45946 8.33952 5.64921 5.76029 2.84013 5.04809 6.58695 57.8924 43.8807 14.0116
internal_count=11346 5420 5926 4866 1758 1139 405 377 228 220 734 551 4168 3392 554 428 314 215 114 77 3315 155 3160 106 3054 2623 674 509 411 776 153 95 447 753 378 49 103 363 86 277 375 268 135 133 352 145 207 619 423 107 86 431 183 85 58 196 172 144 80 43 149 126 57 153 127 85 64 251 227 131 108 106 157 98 120 4192 2820 80 70 117 42 42 87 95 41 41 110 93 1372 1040 332
cat_boundaries=0 1 2 3 4 5 6 7 8 9 10 11 12 13 14 15 16 17 18 19 20
cat_threshold=1 2 1 2 1 1 1 2 1 1 2 2 2 2 1 1 1 1 1 1
is_linear=0
shrinkage=0.05


Tree=73
num_leaves=90
num_cat=20
split_feature=2 3 2 2 1 3 3 0 3 3 2 2 2 2 2 3 3 1 3 3 2 2 3 3 0 2 2 0 0 2 2 2 2 2 2 2 2 0 3 2 2 3 3 3 2 2 2 1 1 2 3 2 1 0 3 2 2 3 2 2 2 1 3 2 2 2 2 2 2 3 2 2 2 0 0 1 2 3 2 2 3 3 1 2 1 2 1 0 0
split_gain=38.3136 5.91453 4.98596 3.84493 3.58265 2.68116 2.79691 3.08755 1.97476 2.74752 1.80854 1.94816 1.67041 1.29196 1.27338 1.57134 2.30274 1.33693 1.09088 0.996096 0.768057 3.91338 1.23481 2.1058 1.86266 1.85398 0.62826 0.609472 0.600829 0.583482 0.434707 0.423159 1.60593 1.16028 0.307631 0.27063 3.39342 0.222225 0.20407 1.59086 0.260046 0.186346 0.408422 1.15376 0.426448 0.182798 0.180966 1.52715 0.545282 0.171707 0.134392 0.127138 0.100664 0.0957069 0.0543774 0.0500705 0.0441623 0.0427754 0.0303482 0.0277655 0.0215522 0.0200663 0.014721 0.0132181 0.0237122 0.0392174 0.0117956 0.00976792 0.00971488 0.0078136 0.00641031 0.00504525 0.00487727 0.00431021 0.00273968 0.00381409 0.00271301 0.00245556 0.00231148 0.00126521 0.00107995 0.00102632 0.00101487 0.000341319 0.000291931 0.000202691 6.15049e-07 6.53293e-07 1.77636e-15
threshold=3.5000000000000004 1.0000000180025095e-35 21.500000000000004 1.0000000180025095e-35 0 1.0000000180025095e-35 7.5000000000000009 1 6.5000000000000009 3.5000000000000004 14.500000000000002 13.500000000000002 204.50000000000003 22.500000000000004 1.0000000180025095e-35 2.5000000000000004 1.5000000000000002 2 52.500000000000007 1.0000000180025095e-35 55.500000000000007 56.500000000000007 1.5000000000000002 22.500000000000004 3 47.500000000000007 27.500000000000004 4 5 4.5000000000000009 208.50000000000003 80.500000000000014 78.500000000000014 81.500000000000014 2.5000000000000004 314.50000000000006 318.50000000000006 6 1.0000000180025095e-35 471.50000000000006 783.00000000000011 16.500000000000004 1.5000000000000002 2.5000000000000004 248.50000000000003 13.500000000000002 1.5000000000000002 7 8 8.5000000000000018 66.500000000000014 241.50000000000003 9 10 12.500000000000002 19.500000000000004 6.5000000000000009 3.5000000000000004 18.500000000000004 16.500000000000004 6.5000000000000009 11 11.500000000000002 18.500000000000004 16.500000000000004 15.500000000000002 19.500000000000004 1.5000000000000002 5.5000000000000009 1.5000000000000002 17.500000000000004 6.5000000000000009 10.500000000000002 12 13 14 1.5000000000000002 1.0000000180025095e-35 2.5000000000000004 17.500000000000004 1.0000000180025095e-35 1.5000000000000002 15 4.5000000000000009 16 4.5000000000000009 17 18 19
decision_type=2 2 2 2 1 2 2 9 2 2 2 2 2 2 2 2 2 1 2 2 2 2 2 2 9 2 2 9 9 2 2 2 2 2 2 2 2 9 2 2 2 2 2 2 2 2 2 1 1 2 2 2 1 9 2 2 2 2 2 2 2 1 2 2 2 2 2 2 2 2 2 2 2 9 9 1 2 2 2 2 2 2 1 2 1 2 1 9 9
left_child=1 3 4 74 5 10 7 8 9 -7 11 28 13 19 15 16 17 -3 52 -4 22 -22 24 26 25 -15 -24 34 29 -2 -14 32 -23 -33 46 41 -37 -26 39 -38 -40 42 44 -44 -32 49 48 -48 -5 68 51 -43 62 -12 -54 63 -30 72 59 -55 83 -16 -17 64 65 -47 -60 84 73 71 -62 -70 77 85 75 -1 81 -51 -69 -66 -74 -63 -36 -9 -29 -6 87 -76 -88
right_child=2 14 12 27 45 6 -8 60 -10 -11 53 -13 30 20 61 18 -18 -19 -20 -21 21 31 23 -25 37 -27 -28 67 56 -31 35 33 -34 -35 82 36 38 -39 40 -41 -42 50 43 -45 -46 55 47 -49 -50 57 -52 -53 54 58 -56 -57 -58 -59 66 -61 70 76 -64 -65 79 -67 -68 78 69 -71 -72 -73 80 -75 86 -77 -78 -79 -80 -81 -82 -83 -84 -85 -86 -87 88 -89 -90
leaf_value=-0.024140248282208648 -0.019932284227290029 -0.014023198306477139 0.0016281516433352236 -0.022634168273553839 -0.014962502543032191 0.014938377628491113 -0.017028444094695304 -0.015308688489960469 0.039657319409691014 -0.018244719381212273 -0.0088111979380818602 0.018921031436713892 0.010505919725601566 0.0054857421194025383 -0.017376623527345182 -0.023155033288642601 0.013770447692311231 0.0099738114471316659 0.0016376643420804714 0.01729615702755239 0.030586770794796127 0.0011803507616765349 -0.014680980669205246 0.011980511522150948 -0.0058492447030874181 -0.0069854626640110098 -0.0052885281898890375 -0.022531958863330027 -0.018637459541954955 -0.0012510955937774662 -0.0018942921306669227 0.014940582268131181 -0.01211586544883109 0.0017377849861794318 -0.019347734937501995 0.027704572097698763 0.012707640038000102 -0.013771662883850353 0.0027619776527981563 0.0012974998834661589 0.0060859408804908172 0.003039738063607043 0.015683639711959879 0.0031861262709596025 0.0044238781860485004 -0.014451468206448465 -0.022183743518796109 0.011980416514037071 -0.0052900249385403001 -0.0091508780582053098 0.0046113321638965093 -0.0013375484000739228 -0.018238974633194668 -0.016532832089975986 -0.0083997666674305166 -0.01182621936392809 -0.012287916025700342 0.00039107207518615934 -0.019421020491128697 -0.01170347858331024 -0.011701969867378053 -0.023320677232358249 -0.019895041031259785 -0.017277371463962628 -0.013513640077672162 -0.018795361248960748 -0.016762927793019283 -0.020257149399198936 -0.013461059960807004 -0.014377400377750819 -0.0090561249490617134 -0.010783868264309094 -0.0069320271849733633 -0.012423617612566794 -0.024819052764934582 -0.024713720035380318 -0.020897489122536236 -0.0070417436903683905 -0.018284093085478768 -0.012281029484192442 -0.005640897432328369 -0.021969724433418283 -0.017985902006612386 -0.016413946157774983 -0.021606436810655636 -0.015523084842015379 -0.024829263907878915 -0.024797726753976474 -0.024829265190008675
leaf_weight=64.969945073127747 4.5418402999639502 21.435983516275883 18.732493117451668 5.5104706436395645 3.4867572486400622 49.766880482435226 11.839299261569975 1.3715112097561353 6.6072858124971381 7.1319951415061942 4.5341675952076912 9.9173898920416814 26.205294549465179 164.31605078279972 3.1766906641423702 7.9396100491285342 22.340985715389252 7.9591811299324062 8.8721933364868146 22.125720724463463 11.697556674480436 175.2332621216774 21.895768620073795 16.607759311795235 22.395645402371883 36.402879521250725 95.276797741651535 3.841521702706812 5.585314214229582 52.440975777804852 51.38088321685791 17.043429791927338 26.091028302907944 704.10164919495583 3.0865079760551444 15.509020090103148 49.643324851989746 14.636269733309744 312.10689330101013 79.420583963394165 72.51084303855896 24.197378933429718 23.059078335762024 92.74477082490921 55.614218890666962 14.766086131334308 5.395434156060217 8.3073810636997205 25.511671692132953 4.1123253032565144 20.312155067920685 52.752897143363953 3.1474624089896706 8.2384033054113406 2.5353775471448898 10.903874546289442 5.3726477846503258 2.0169468522071829 7.8896524310112026 4.6595693528652182 8.3501021414995176 2.9178190790116769 6.1416956335306168 9.4761502444744092 3.9579391777515394 8.0168733596801758 8.8614825308322889 3.1197676211595535 2.4962266460061056 3.5182186737656584 3.1538963243365279 5.9651318415999413 6.0755054354667646 1.7469171844422815 38.848240971565247 52.360911414027214 3.5025945082306862 2.0770042538642883 2.8317687474191189 4.3920896053314209 2.2082468420267105 2.7130864560604095 2.4571659564971924 1.4234983101487158 1.0948368608951566 2.9997347369790077 11.158176749944687 3.9568805694580069 2.5098411738872501
leaf_count=1552 58 132 43 85 53 188 28 23 8 32 39 42 23 550 46 35 99 83 20 34 37 524 79 22 117 126 399 86 72 304 64 27 42 1351 56 10 42 41 244 44 38 32 22 113 69 62 86 59 122 48 21 54 38 46 9 43 75 15 26 34 86 20 12 26 21 23 38 64 34 25 22 72 65 27 944 1268 39 22 53 21 22 21 39 18 24 40 271 96 61
internal_value=0 -0.0165206 0.00165837 -0.0207398 -0.00450885 -0.00083279 0.00561219 0.00905732 0.0137836 0.010779 -0.00598942 -0.00178023 0.002463 0.00135761 -0.00582443 -0.00353077 0.00167055 -0.00752565 -0.0129278 0.0101128 0.00108364 0.00184841 -0.00083927 -0.00468197 0.00132299 0.00322393 -0.00704367 -0.00995716 -0.00480202 -0.00274009 0.00416321 0.00148399 -0.000542799 0.00204982 -0.00763416 0.0039675 0.00466164 -0.00898045 0.00396593 0.00568631 0.00338863 0.00281979 0.00361692 0.00567465 0.00138978 -0.0129133 -0.00625707 -0.0014716 -0.00837087 -0.0102169 0.000993809 3.89101e-05 -0.0194663 -0.0155766 -0.0138492 -0.0148345 -0.0155243 -0.00643058 -0.0166112 -0.0147882 -0.0119334 -0.0207996 -0.0217332 -0.0156423 -0.0151446 -0.01598 -0.0180149 -0.0206823 -0.0133058 -0.0123971 -0.0109766 -0.0115737 -0.00738123 -0.0146281 -0.0245339 -0.0243962 -0.0219901 -0.0084431 -0.0193184 -0.0128653 -0.00658784 -0.0226698 -0.0187441 -0.0158716 -0.0223267 -0.0152217 -0.02482 -0.0248171 -0.0248293
internal_weight=0 327.643 2511.92 234.961 289.902 201.686 89.6445 77.8052 63.5062 56.8989 112.041 77.8582 2222.01 1346.56 92.6827 80.3725 51.7362 29.3952 28.6363 40.8582 1305.7 934.167 371.531 133.78 237.751 200.719 117.173 61.1565 67.9408 56.9828 875.457 922.469 201.324 721.145 50.2686 849.252 529.191 37.0319 513.682 129.064 384.618 320.061 222.799 115.804 106.995 88.216 44.725 13.7028 31.0221 36.703 97.2624 76.9503 19.7641 34.1833 5.68284 51.513 10.958 16.49 29.6491 12.898 14.299 12.3102 14.0813 40.6091 31.133 22.783 16.7511 10.8879 20.213 11.9796 11.504 8.46136 14.4731 8.23341 173.804 117.331 9.1335 6.18933 5.95154 8.35003 8.28375 5.63091 5.54367 2.79501 4.93636 6.48649 56.4731 42.8051 13.668
internal_count=11346 5420 5926 4866 1758 1139 405 377 228 220 734 551 4168 3392 554 428 314 215 114 77 3315 1981 1334 500 834 676 478 674 509 362 776 1944 566 1378 447 753 378 158 368 86 282 375 268 135 133 619 352 145 207 423 107 86 94 183 47 196 147 172 144 80 149 126 47 153 127 85 64 227 251 131 108 106 157 120 4192 2820 80 70 117 42 87 41 95 41 110 93 1372 1040 332
cat_boundaries=0 1 2 3 4 5 6 7 8 9 10 11 12 13 14 15 16 17 18 19 20
cat_threshold=1 2 1 2 2 2 1 1 2 1 1 2 2 2 1 1 1 1 1 1
is_linear=0
shrinkage=0.05


Tree=74
num_leaves=92
num_cat=20
split_feature=2 3 2 2 1 3 3 0 2 2 3 3 2 2 3 3 1 2 3 3 2 3 2 3 2 2 0 2 2 2 3 1 2 2 2 1 3 3 2 2 2 3 3 3 2 2 1 1 2 3 2 2 0 1 2 2 3 2 2 3 2 1 3 2 2 2 2 2 2 3 2 2 0 2 0 0 1 2 3 2 2 3 3 1 3 2 1 2 1 0 0
split_gain=37.0132 5.87423 4.74617 3.86599 3.46943 2.55157 2.66604 2.90373 1.7609 1.82943 1.75824 2.59411 1.57575 1.24837 1.51672 2.17257 1.28641 1.21276 1.07382 0.919635 0.766343 2.84438 1.90823 5.39685 2.15014 0.849968 0.602428 0.585448 0.703838 0.405632 0.402456 0.613285 0.302347 0.254346 3.10899 0.24199 0.238686 0.191425 1.48276 0.244225 0.180639 0.175843 0.38415 1.06999 0.403923 0.174794 1.46988 0.538009 0.168318 0.12707 0.122827 0.120687 0.0948694 0.0687038 0.0667547 0.0496981 0.0412346 0.0303383 0.0275788 0.0246113 0.0213163 0.0202778 0.0182251 0.0131958 0.0235759 0.0391979 0.0118487 0.00989228 0.00962337 0.00772458 0.00629512 0.0049751 0.00493593 0.00474477 0.00427798 0.0028065 0.00390513 0.00275646 0.0023942 0.00233044 0.0012512 0.00104714 0.00104527 0.00102137 0.000865522 0.000340588 0.000296877 0.000201872 6.30712e-07 6.69586e-07 4.88498e-15
threshold=3.5000000000000004 1.0000000180025095e-35 21.500000000000004 1.0000000180025095e-35 0 1.0000000180025095e-35 7.5000000000000009 1 14.500000000000002 13.500000000000002 6.5000000000000009 3.5000000000000004 204.50000000000003 1.0000000180025095e-35 2.5000000000000004 1.5000000000000002 2 22.500000000000004 91.500000000000014 1.0000000180025095e-35 25.500000000000004 22.500000000000004 27.500000000000004 1.0000000180025095e-35 37.500000000000007 38.500000000000007 3 4.5000000000000009 7.5000000000000009 208.50000000000003 1.0000000180025095e-35 4 2.5000000000000004 314.50000000000006 318.50000000000006 5 31.500000000000004 1.0000000180025095e-35 471.50000000000006 783.00000000000011 13.500000000000002 16.500000000000004 1.5000000000000002 2.5000000000000004 248.50000000000003 1.5000000000000002 6 7 8.5000000000000018 66.500000000000014 32.500000000000007 241.50000000000003 8 9 23.500000000000004 19.500000000000004 3.5000000000000004 18.500000000000004 16.500000000000004 7.5000000000000009 6.5000000000000009 10 2.5000000000000004 18.500000000000004 16.500000000000004 15.500000000000002 19.500000000000004 1.5000000000000002 5.5000000000000009 1.5000000000000002 17.500000000000004 6.5000000000000009 11 10.500000000000002 12 13 14 1.5000000000000002 1.0000000180025095e-35 2.5000000000000004 17.500000000000004 1.0000000180025095e-35 1.5000000000000002 15 6.5000000000000009 4.5000000000000009 16 4.5000000000000009 17 18 19
decision_type=2 2 2 2 1 2 2 9 2 2 2 2 2 2 2 2 1 2 2 2 2 2 2 2 2 2 9 2 2 2 2 1 2 2 2 1 2 2 2 2 2 2 2 2 2 2 1 1 2 2 2 2 9 1 2 2 2 2 2 2 2 1 2 2 2 2 2 2 2 2 2 2 9 2 9 9 1 2 2 2 2 2 2 1 2 2 1 2 1 9 9
left_child=1 3 4 75 5 8 7 10 9 27 11 -7 17 14 15 16 -3 19 36 -4 21 30 23 35 50 -26 32 72 -29 -14 31 -19 45 41 -35 -22 53 38 -36 -39 48 42 44 -44 -31 47 -47 -5 68 51 -24 -43 -10 84 -32 63 73 58 -54 -55 85 -15 -25 64 65 -42 -59 86 74 71 -62 -70 -2 78 87 76 -1 82 -50 -69 -66 -75 -63 -34 -16 -9 -28 -6 89 -77 -90
right_child=2 13 12 26 40 6 -8 60 52 -11 -12 -13 29 61 18 -17 -18 20 -20 -21 22 -23 24 62 25 -27 67 28 -30 33 54 -33 83 34 37 -37 -38 39 -40 -41 55 49 43 -45 -46 46 -48 -49 56 -51 -52 -53 57 59 -56 -57 -58 66 -60 -61 70 77 -64 -65 80 -67 -68 79 69 -71 -72 -73 -74 81 -76 88 -78 -79 -80 -81 -82 -83 -84 -85 -86 -87 -88 -89 90 -91 -92
leaf_value=-0.024123411924372694 -0.019833695875093021 -0.013870595832640671 0.00158510963583671 -0.022583918770160111 -0.014813761584181013 0.014348729001302799 -0.016894471230263219 -0.015161819325331928 -0.008669435846064881 0.018101011346845962 0.037149999888965994 -0.018123483233236818 0.010136634544164856 -0.017245990173469165 -0.023096252125751358 0.013242557302195588 0.0096284161536663859 -0.001472036711498124 0.007594964097235324 0.016573812742891384 0.028501742297932349 0.020436272370165535 -0.0084928463819956158 -0.014131593021321479 0.012800946542824041 0.0013718492910534553 -0.02247960823687661 0.00027666688599871229 -0.011518743748284767 -0.0018508054263807279 -0.018693074055002763 -0.015911165811071763 -0.019240646953235969 0.026269120598761214 0.012233652118380392 0.018990946364796576 -0.0095213369785323836 0.0026858763562935938 0.0012636223421545044 0.0058983640855433707 -0.014300404711501062 0.0029551521953659916 0.015053205844146308 0.0030970077161051653 0.0042947516428080354 -0.022124400203963113 0.011542049611021043 -0.0051863881692575421 -0.0090067486439637558 0.0044758843355511453 -0.0047086280669192074 -0.0013061061099362507 -0.016394527759157621 -0.018960081055097305 -0.012428089476041409 -0.011671529635088669 0.00038121099149049262 -0.019314959261602715 -0.011548958617592387 -0.011413498526969214 -0.011547452314336869 -0.023285082129395795 -0.010542001203088078 -0.017145761464854217 -0.013359686830183 -0.0186808794651654 -0.016626573209328057 -0.020163587931540706 -0.013306996418167245 -0.014226044586600768 -0.0089126324510655757 -0.010631584669048356 -0.016901179842793775 -0.006807531801916622 -0.012268533559115044 -0.024818795233633353 -0.024710826698724361 -0.020814460700181801 -0.0069160464767157861 -0.018163319748661987 -0.012125973915023673 -0.0055323518378611707 -0.021906205906687543 -0.017861704497802857 -0.022244889546954378 -0.01627467790633335 -0.021536043943577474 -0.01537749661448435 -0.024829265962592523 -0.024796935533612102 -0.024829263375652891
leaf_weight=63.420335531234741 4.4522075653076163 21.137480199337006 18.763017803430557 5.3871463611721992 3.4349749535322207 50.515897713601589 11.639401167631148 1.3506750725209706 4.4943916350603104 10.106823846697806 6.8745780214667311 7.0030538961291304 26.482055962085724 3.1219673417508602 5.9488287195563316 22.650759741663933 8.0389615148305911 23.540405839681625 5.2654801607131949 22.511739417910576 16.664595872163773 9.68370473384857 44.490422293543816 8.9070839360356313 16.511355370283127 1101.1501994282007 3.7559325695037824 43.158137798309326 17.889164865016937 51.283645272254944 8.0465229153633135 10.695051670074461 3.0273650586605063 15.944697856903074 50.278199672698975 11.171750605106356 6.7367257624864569 312.97011744976044 79.523699402809143 72.953486204147339 14.554228961467748 24.271044433116913 23.423579752445221 93.040738463401794 55.860794365406036 5.2770610526204091 8.40750604867935 25.377069473266605 4.0748655572533634 20.406037628650665 41.392237320542336 52.682384967803955 8.1033191382884997 2.2366805896163067 9.0161379575729352 10.775682404637335 2.0177357643842688 7.7379060983657864 4.6053540408611289 2.0898011922836304 8.2529589608311635 2.8505608998239023 5.8640756234526625 9.3138331919908506 3.9048128053545934 7.867600515484809 8.7141759544610959 3.0572056882083416 2.4628501161932927 3.4679976776242247 3.1254631802439681 5.9011503159999847 2.1173219382762909 6.0335356146097165 1.7253483720123766 37.895932674407959 51.082738786935806 3.4301585257053375 2.0624298900365829 2.7804628871381283 4.3384800180792809 2.1958254054188728 2.6541306637227535 2.4133666343986988 5.9925590008497238 1.4003237932920454 1.0714351236820219 2.9535292014479637 10.884538237005472 3.8599655628204337 2.4482911229133579
leaf_count=1552 58 132 43 85 53 188 28 23 39 42 8 32 23 46 31 99 83 69 11 34 30 2 225 29 48 2575 86 172 239 64 17 26 56 10 42 19 18 244 44 38 62 32 22 113 69 86 59 122 48 21 206 54 46 32 41 43 15 26 34 11 86 20 28 26 21 23 38 64 34 25 22 72 40 65 27 944 1268 39 22 53 21 22 21 39 11 18 24 40 271 96 61
internal_value=0 -0.0163829 0.00161375 -0.0206543 -0.00441902 -0.000815554 0.00543734 0.00874756 -0.00587734 -0.00174034 0.0132515 0.0103952 0.00239543 -0.00571542 -0.00345759 0.00162399 -0.00739593 0.00132165 -0.0127736 0.00976013 0.00105519 -0.00441758 0.001323 0.0117219 0.000954865 0.00154069 -0.00980931 -0.00470607 -0.00317983 0.00404241 -0.00910931 -0.00598278 -0.00750349 0.00385313 0.00452411 0.0246847 -0.0174357 0.00385181 0.00551282 0.00329315 -0.0127586 0.00274168 0.00351391 0.00550167 0.00135324 -0.00614168 -0.00144045 -0.00823288 -0.010067 0.000968071 -0.00666899 3.7891e-05 -0.0154314 -0.0207132 -0.0153826 -0.0146852 -0.00631195 -0.0164736 -0.0146386 -0.0153149 -0.0117786 -0.0207149 -0.0127065 -0.0154975 -0.0149969 -0.0158375 -0.017891 -0.0205956 -0.0131515 -0.012242 -0.0108237 -0.0114194 -0.0188886 -0.00725198 -0.0144777 -0.0245266 -0.0243855 -0.021927 -0.00830417 -0.0192109 -0.0127104 -0.00646728 -0.0226202 -0.018629 -0.022669 -0.0157283 -0.0222702 -0.0150744 -0.0248198 -0.0248168 -0.0248293
internal_weight=0 322.3 2516.15 230.146 288.626 201.541 90.1624 78.523 111.379 77.7237 64.3935 57.519 2227.53 92.1541 80.0973 51.8272 29.1764 1348.41 28.2701 41.2748 1307.13 60.9818 1246.15 42.6075 1203.54 1117.66 60.5546 67.6168 61.0473 879.12 51.2981 34.2355 49.8895 852.638 531.67 27.8363 23.0046 515.726 129.802 385.924 87.0849 320.968 223.609 116.464 107.144 44.4488 13.6846 30.7642 36.3302 97.3595 85.8827 76.9534 33.6551 16.2679 17.0627 50.7546 16.3844 29.1608 12.7087 4.32648 14.1294 12.0568 14.7712 39.979 30.6651 22.4218 16.4521 10.665 19.9459 11.832 11.3784 8.364 6.56953 14.3667 8.11385 169.592 114.503 8.93485 6.1373 5.83767 8.24329 8.22936 5.50469 5.44073 11.9414 2.751 4.82737 6.3885 55.0887 41.7559 13.3328
internal_count=11346 5420 5926 4866 1758 1139 405 377 734 551 228 220 4168 554 428 314 215 3392 114 77 3315 155 3160 106 3054 2623 674 509 411 776 153 95 447 753 378 49 103 368 86 282 619 375 268 135 133 352 145 207 423 107 431 86 183 85 58 196 172 144 80 43 149 126 57 153 127 85 64 227 251 131 108 106 98 157 120 4192 2820 80 70 117 42 87 41 95 42 41 110 93 1372 1040 332
cat_boundaries=0 1 2 3 4 5 6 7 8 9 10 11 12 13 14 15 16 17 18 19 20
cat_threshold=1 2 1 2 1 1 1 2 1 1 2 2 2 2 1 1 1 1 1 1
is_linear=0
shrinkage=0.05


Tree=75
num_leaves=90
num_cat=21
split_feature=2 3 2 2 1 3 3 0 2 2 3 2 2 2 3 3 1 2 3 3 2 3 2 3 2 2 0 0 2 3 2 2 2 3 1 2 2 2 3 3 2 1 2 2 1 1 2 2 3 0 0 1 2 2 2 3 2 2 3 2 1 3 2 2 2 2 2 2 3 2 2 2 0 0 1 2 2 3 3 2 3 1 3 2 1 2 1 0 0
split_gain=35.7534 5.83227 4.51796 3.88623 3.35894 2.42845 2.54225 2.73279 1.71401 1.71914 1.57103 2.46336 1.49021 1.22352 1.46378 2.05068 1.23788 1.1907 1.18175 0.850013 0.679894 2.68593 1.86191 5.01114 1.94509 0.822554 0.595249 0.582923 0.557877 0.394706 0.607732 0.297046 0.250772 0.225093 0.213713 0.189846 2.4146 0.556469 0.246783 2.54516 0.350237 0.224266 0.178425 0.168787 1.41526 0.530677 0.164925 0.119182 0.100627 0.093999 0.0739923 0.0693249 0.066539 0.0493062 0.0446377 0.0397398 0.0303159 0.0273812 0.0245117 0.0210734 0.0204858 0.0179999 0.0131679 0.0234299 0.0391624 0.0118977 0.0100157 0.00952832 0.00763304 0.00617918 0.00490365 0.00461405 0.00424406 0.00287487 0.00399829 0.00280007 0.0023488 0.0023334 0.00146225 0.00123675 0.00106442 0.00102755 0.00101497 0.000339711 0.000301851 0.000200968 6.46697e-07 6.86425e-07 4.44089e-16
threshold=3.5000000000000004 1.0000000180025095e-35 21.500000000000004 1.0000000180025095e-35 0 1.0000000180025095e-35 7.5000000000000009 1 14.500000000000002 13.500000000000002 6.5000000000000009 19.500000000000004 166.50000000000003 1.0000000180025095e-35 2.5000000000000004 1.5000000000000002 2 22.500000000000004 96.500000000000014 1.0000000180025095e-35 25.500000000000004 22.500000000000004 27.500000000000004 1.0000000180025095e-35 37.500000000000007 38.500000000000007 3 4 7.5000000000000009 1.0000000180025095e-35 23.500000000000004 2.5000000000000004 1279.5000000000002 31.500000000000004 5 471.50000000000006 466.50000000000006 486.50000000000006 34.500000000000007 38.500000000000007 205.50000000000003 6 13.500000000000002 1.5000000000000002 7 8 8.5000000000000018 32.500000000000007 6.5000000000000009 9 10 11 23.500000000000004 19.500000000000004 6.5000000000000009 3.5000000000000004 18.500000000000004 16.500000000000004 7.5000000000000009 6.5000000000000009 12 2.5000000000000004 18.500000000000004 16.500000000000004 15.500000000000002 19.500000000000004 1.5000000000000002 5.5000000000000009 1.5000000000000002 17.500000000000004 6.5000000000000009 10.500000000000002 13 14 15 1.5000000000000002 2.5000000000000004 1.0000000180025095e-35 7.5000000000000009 17.500000000000004 1.5000000000000002 16 1.0000000180025095e-35 4.5000000000000009 17 4.5000000000000009 18 19 20
decision_type=2 2 2 2 1 2 2 9 2 2 2 2 2 2 2 2 1 2 2 2 2 2 2 2 2 2 9 9 2 2 2 2 2 2 1 2 2 2 2 2 2 1 2 2 1 1 2 2 2 9 9 1 2 2 2 2 2 2 2 2 1 2 2 2 2 2 2 2 2 2 2 2 9 9 1 2 2 2 2 2 2 1 2 2 1 2 1 9 9
left_child=1 3 4 73 5 8 7 10 9 27 11 -7 17 14 15 16 -3 19 33 -4 21 29 23 34 47 -26 31 28 -2 30 -19 43 35 51 -22 36 38 -37 40 -40 -14 50 46 45 -45 -5 67 -24 -43 -10 -39 78 -31 62 -29 71 57 -51 -53 83 -15 -25 63 64 -44 -58 84 72 70 -61 -69 77 85 74 -1 80 -68 -48 -16 -65 -62 -33 -73 -9 -28 -6 87 -75 -88
right_child=2 13 12 26 42 6 -8 59 49 -11 -12 -13 32 60 18 -17 -18 20 -20 -21 22 -23 24 61 25 -27 66 54 -30 52 -32 81 -34 -35 -36 37 -38 41 39 -41 -42 48 53 44 -46 -47 55 -49 -50 56 -52 58 -54 -55 -56 -57 65 -59 -60 69 75 -63 -64 79 -66 -67 76 68 -70 -71 -72 82 -74 86 -76 -77 -78 -79 -80 -81 -82 -83 -84 -85 -86 -87 88 -89 -90
leaf_value=-0.024106176038411423 0.00022603433769082028 -0.013717532470375464 0.001543272517111182 -0.022532633000147823 -0.014664290227474008 0.0062466803621589566 -0.016759278120227105 -0.015014126488842478 -0.0085287303097385716 0.017330920904358959 0.034889715629629899 0.038042289022348047 0.0052363631115506654 -0.017114074919918069 -0.023127152345303527 0.012741711282122817 0.0092982346259946023 -1.2638132550246085e-05 0.0099071504963156448 0.015893260794835922 0.027003172711555053 0.019520601553849052 -0.0083535128480531906 -0.013979344515905762 0.012322315298506949 0.0011357309187098813 -0.022426191222892886 -0.018480964726003142 -0.011347296403848899 -0.018577291363423454 -0.013491857911724019 -0.019132078116830431 0.0089476497689447397 -0.0099548509329526365 0.018166607778022884 -0.004168730080846359 0.021910841057935598 0.0040275061285301676 0.021339548539257278 0.0025710830446507705 0.0024097786715764798 0.0031007562761904673 -0.014148756130499164 -0.022063890127438725 0.011124663121516576 -0.0050842489076798631 -0.0088635951124377138 -0.0046136640476244061 0.0064508189908697167 -0.016255104135310647 0.0014264698748005964 -0.01884773963978285 -0.012273005097984322 -0.011517058696455815 -0.012023959309912957 0.00037160270623095426 -0.019207415325192007 -0.011394696279557288 -0.01125950018178525 -0.011393192115992918 -0.023248703551646391 -0.010390588103932008 -0.017012885604470004 -0.013205428245712088 -0.018564942449400379 -0.01648905087344299 -0.020068555696834592 -0.01315264584304251 -0.014074124462918173 -0.0087701391310848597 -0.010479835389718525 -0.0066844296486339595 -0.012113482713988951 -0.02481853204063246 -0.024707866723264513 -0.020730018635413541 -0.018041137306783649 -0.0067917286918553589 -0.022002644823128428 -0.011970996202483918 -0.021841465629062404 -0.017736134254425589 -0.0054252985186816908 -0.016134315558507428 -0.021464353191500713 -0.015231029833023586 -0.024829266683230114 -0.024796123037797185 -0.024829267069653556
leaf_weight=61.908728778362274 42.834638625383377 20.846315950155258 18.792782738804817 5.2668470330536366 3.3844650238752392 51.209143720567226 11.444411441683767 1.3303508311510079 4.4555961415171623 10.291433006525038 7.1347717046737662 6.9140960276126853 145.64218792319298 3.068587526679039 6.4035116732120514 22.952708214521408 8.1167378723621386 19.24320849776268 4.8172947764396659 22.887953788042068 17.146399557590485 9.8836402893066388 44.114171609282494 8.7820978760719282 16.724075123667717 943.23703511059284 3.6724425330758077 5.4476289153099042 13.756808795034884 7.8975057601928738 14.788797929883001 2.9696732759475699 22.368090987205505 7.1612163782119742 11.385940313339235 28.303123116493225 18.372553825378418 35.822703897953033 21.338353872299194 117.69073671102524 442.74936026334763 36.672133445739746 14.3475788012147 5.1615911871194822 8.5051078200340253 25.245795905590061 4.0383292064070728 41.197795122861862 57.659825444221497 7.9715522676706332 115.49721896648407 2.1946723796427294 8.9047779366373998 10.650645047426222 5.2619011402130127 2.018505059182643 7.5898829698562649 4.5524727702140808 2.0660848915576935 8.1582065001130086 2.7849522046744806 5.8025812804698935 9.1555019617080671 3.8529926836490613 7.7219912707805625 8.5704867094755155 2.9961788803339005 2.4302939251065236 3.4190110862255088 3.0977309122681609 5.838744081556797 5.9926015362143499 1.704310171306133 36.966975092887878 49.835907697677612 3.3594995886087418 2.7304163873195648 2.0482152327895164 5.2702227234840393 4.2861895263195038 2.596621036529541 2.3706424310803413 2.1837108731269836 1.3777184113860128 1.048607289791107 2.9084585681557655 10.617610227316618 3.7654273509979239 2.3882501907646629
leaf_count=1552 177 132 43 85 53 195 28 23 39 42 8 25 231 46 32 99 83 34 10 34 30 2 225 29 48 2318 86 72 185 17 61 56 10 19 19 16 8 24 21 118 473 20 62 86 59 122 48 206 33 46 79 32 41 43 75 15 26 34 11 86 20 28 26 21 23 38 64 34 25 22 72 65 27 944 1268 39 53 22 10 21 21 39 22 18 24 40 271 96 61
internal_value=0 -0.016244 0.00157041 -0.0205673 -0.00433055 -0.000798584 0.00526906 0.00845128 -0.0057667 -0.00170128 0.012747 0.010029 0.00232988 -0.00560786 -0.0033857 0.00157887 -0.00726749 0.00112151 -0.0126194 0.00942322 0.000820387 -0.00432886 0.00110765 0.01129 0.000687631 0.00133062 -0.00966223 -0.00461162 -0.00258733 -0.00896588 -0.00587011 -0.00737409 0.00371063 -0.017318 0.0234769 0.00359576 0.00400924 0.00247013 0.0035571 0.00545169 0.00310943 0.00323504 -0.0126037 -0.00602771 -0.00140987 -0.00809605 -0.00991773 -0.00654751 0.00514846 -0.0152853 0.00204223 -0.020627 -0.0152362 -0.0145352 -0.0153085 -0.00619477 -0.0163348 -0.0144883 -0.0151681 -0.011624 -0.0206288 -0.0125515 -0.0153518 -0.0148483 -0.0156939 -0.0177658 -0.0205075 -0.0129969 -0.012087 -0.0106713 -0.0112654 -0.00712406 -0.0143268 -0.024519 -0.0243745 -0.0218627 -0.0191019 -0.00816638 -0.0226195 -0.0125554 -0.0225697 -0.0185124 -0.00634814 -0.015584 -0.0222126 -0.0149262 -0.0248196 -0.0248165 -0.0248293
internal_weight=0 317.089 2520.29 225.45 287.38 201.399 90.6664 79.222 110.732 77.5924 65.258 58.1232 2232.91 91.6384 79.8288 51.9158 28.9631 1190.79 27.913 41.6807 1149.11 60.7179 1088.39 43.117 1045.27 959.961 59.9673 67.301 56.5914 50.8343 34.032 49.5197 1042.12 23.0957 28.5323 1019.75 745.793 273.955 727.421 139.029 588.392 245.652 85.9815 44.1793 13.6667 30.5126 35.9666 85.312 94.332 33.14 151.32 15.9345 16.8023 50.0149 10.7095 16.2814 28.6844 12.524 4.26076 13.964 11.8097 14.5847 39.3643 30.2088 22.0696 16.1604 10.4476 19.6853 11.688 11.2559 8.26904 14.2629 7.99723 165.483 111.745 8.74107 5.7266 6.08654 11.6737 8.13918 5.38157 5.34032 8.17631 2.70807 4.72105 6.29292 53.7383 40.7324 13.0059
internal_count=11346 5420 5926 4866 1758 1139 405 377 734 551 228 220 4168 554 428 314 215 3135 114 77 3058 155 2903 106 2797 2366 674 509 362 153 95 447 1033 104 49 1023 851 172 843 139 704 156 619 352 145 207 423 431 53 183 103 85 58 196 147 172 144 80 43 149 126 57 153 127 85 64 227 251 131 108 106 157 120 4192 2820 80 117 70 42 42 41 95 87 41 110 93 1372 1040 332
cat_boundaries=0 1 2 3 4 5 6 7 8 9 10 11 12 13 14 15 16 17 18 19 20 21
cat_threshold=1 2 1 2 2 1 1 1 2 1 1 1 2 2 2 1 1 1 1 1 1
is_linear=0
shrinkage=0.05


Tree=76
num_leaves=91
num_cat=19
split_feature=2 3 2 2 1 3 3 0 2 2 2 3 3 2 3 3 1 3 2 3 2 3 2 3 2 2 0 2 2 3 1 2 2 2 2 3 3 2 2 2 3 3 3 2 2 1 1 2 3 2 2 0 1 2 2 3 2 2 3 2 1 3 2 3 2 2 2 2 2 3 2 0 2 2 0 0 1 2 2 3 3 3 1 3 2 1 2 1 0 0
split_gain=34.533 5.78867 4.30077 3.90563 3.25118 2.31142 2.42504 2.57364 1.66788 1.61655 1.42981 1.40831 2.43059 1.19884 1.41246 1.93646 1.19123 1.1469 1.07249 0.786514 0.69425 2.53807 1.67794 4.66002 1.95572 0.746301 0.587941 0.573396 0.660078 0.386949 0.599221 0.375744 0.291734 0.23399 2.82527 0.224682 0.182859 1.36481 0.223607 0.176157 0.173111 0.360568 0.990821 0.381715 0.162943 1.36312 0.523293 0.161531 0.123319 0.116601 0.115604 0.0930967 0.0699318 0.0662962 0.0488952 0.03829 0.0302809 0.0271728 0.0244023 0.0208238 0.0206901 0.0177693 0.0131344 0.0238589 0.0496363 0.0153664 0.0119425 0.0101381 0.00942982 0.00753907 0.00606263 0.00541733 0.00483098 0.00448519 0.00420848 0.00294487 0.00409346 0.00284379 0.00236653 0.00227323 0.00148894 0.00108375 0.0010334 0.000983445 0.000338689 0.000306854 0.000199979 6.62804e-07 7.03683e-07 4.44089e-16
threshold=3.5000000000000004 1.0000000180025095e-35 21.500000000000004 1.0000000180025095e-35 0 1.0000000180025095e-35 7.5000000000000009 1 14.500000000000002 13.500000000000002 204.50000000000003 6.5000000000000009 3.5000000000000004 1.0000000180025095e-35 2.5000000000000004 1.5000000000000002 2 96.500000000000014 22.500000000000004 1.0000000180025095e-35 25.500000000000004 22.500000000000004 27.500000000000004 1.0000000180025095e-35 37.500000000000007 38.500000000000007 3 4.5000000000000009 7.5000000000000009 1.0000000180025095e-35 4 208.50000000000003 2.5000000000000004 314.50000000000006 318.50000000000006 31.500000000000004 1.0000000180025095e-35 471.50000000000006 783.00000000000011 13.500000000000002 16.500000000000004 1.5000000000000002 2.5000000000000004 248.50000000000003 1.5000000000000002 5 6 8.5000000000000018 66.500000000000014 241.50000000000003 32.500000000000007 7 8 23.500000000000004 19.500000000000004 3.5000000000000004 18.500000000000004 16.500000000000004 7.5000000000000009 6.5000000000000009 9 2.5000000000000004 18.500000000000004 1.0000000180025095e-35 15.500000000000002 15.500000000000002 19.500000000000004 1.5000000000000002 5.5000000000000009 1.5000000000000002 17.500000000000004 10 6.5000000000000009 10.500000000000002 11 12 13 1.5000000000000002 2.5000000000000004 1.0000000180025095e-35 7.5000000000000009 1.5000000000000002 14 1.0000000180025095e-35 4.5000000000000009 15 4.5000000000000009 16 17 18
decision_type=2 2 2 2 1 2 2 9 2 2 2 2 2 2 2 2 1 2 2 2 2 2 2 2 2 2 9 2 2 2 1 2 2 2 2 2 2 2 2 2 2 2 2 2 2 1 1 2 2 2 2 9 1 2 2 2 2 2 2 2 1 2 2 2 2 2 2 2 2 2 2 9 2 2 9 9 1 2 2 2 2 2 1 2 2 1 2 1 9 9
left_child=1 3 4 75 5 8 7 11 9 27 18 12 -7 14 15 16 -3 35 19 -4 21 29 23 -22 50 -26 32 71 -29 30 -20 -12 44 40 -35 52 37 -36 -38 47 41 43 -43 -33 46 -46 -5 68 49 -42 -24 -10 80 -31 62 73 57 -53 -54 84 -15 -25 63 64 -41 -65 -58 85 74 72 -61 -2 -70 79 86 76 -1 81 -69 -49 -16 -62 -34 -75 -9 -28 -6 88 -77 -89
right_child=2 13 10 26 39 6 -8 59 51 -11 31 -13 -14 60 17 -17 -18 -19 20 -21 22 -23 24 61 25 -27 67 28 -30 53 -32 33 82 34 36 -37 38 -39 -40 54 48 42 -44 -45 45 -47 -48 55 -50 -51 -52 56 58 -55 -56 -57 66 -59 -60 70 77 -63 -64 65 -66 -67 -68 78 69 -71 -72 -73 -74 83 -76 87 -78 -79 -80 -81 -82 -83 -84 -85 -86 -87 -88 89 -90 -91
leaf_value=-0.024088533916071485 -0.019734777664075196 -0.013564056819243678 0.0015026041012919066 -0.022480296014510976 -0.014514129675818508 0.013408149816162548 -0.016622891409522975 -0.014865648770977347 -0.0083891131174296859 0.016606540211076392 0.0096519624630500254 0.032842066487540948 -0.018075902326729589 -0.016980900124844441 -0.023087329075544602 0.01226602856456897 0.008982379315994219 0.0095647110635529581 -0.0013085333113945635 0.015251164700944753 0.022355595614619229 0.018663261553592794 -0.008215306023428506 -0.01382660499727467 0.011867331137360916 0.0012898257241364345 -0.02237169019399074 0.0003098348160249543 -0.011208832466593479 -0.018460061122270541 -0.015707980687706204 -0.0018636460349477431 -0.019022029335256728 0.024683831592082359 0.011636611992618208 -0.0098060390234612511 0.0025155965273701182 0.0011712705337022056 0.005574518623127289 -0.01043070998903086 0.0027693059630896542 0.014362785906276043 0.0029436463660286135 0.0041001419270045624 -0.022002196467214283 0.010726905758116759 -0.0049836044851482922 -0.0087214531542405965 0.0042700978262743489 -0.0014067573168798423 -0.0045201806223336685 -0.016114591132529985 -0.018733932146785159 -0.012117952357016451 -0.011362855282714687 0.00036223960161112993 -0.019098391212346553 -0.011240737616856046 -0.011105847734198912 -0.011239237189144585 -0.023211528741891713 -0.010239779716383702 -0.016878769621172112 -0.018004957033599438 -0.01583888174575019 -0.014488862855459217 -0.016350388068305056 -0.019972050286964138 -0.012998052432850616 -0.013921685001354132 -0.0086286791050176597 -0.016615645066087134 -0.010328665302981037 -0.0065627358344000396 -0.01195851367407476 -0.02481826283393055 -0.024704828822054804 -0.020644154774785713 -0.017917560935698903 -0.0066688055276335218 -0.02193976321191652 -0.021775490395240172 -0.017609207678374358 -0.0053197403142515648 -0.015992890842216216 -0.021391345769015638 -0.015083719734790325 -0.024829265706073442 -0.024795290800419732 -0.024829266693939537
leaf_weight=60.434188187122345 4.3657605201005927 20.562307357788086 18.821807458996773 5.1494982466101646 3.3351963758468655 51.758509211242199 11.254209563136099 1.3105260059237474 4.4177571013569832 10.471348032355307 26.854290246963501 7.3880954980850211 6.9537138864397994 3.0165183395147324 6.2571160346269608 23.247036546468735 8.1925613284111041 4.8652575612068167 23.376765862107277 23.254623651504517 29.210389077663422 10.07846939563751 43.747198238968849 8.660183832049368 16.93142919242382 1104.6082177758217 3.5910003334283811 43.101194888353348 17.482124872505665 7.7521459609270122 10.456809490919111 51.312319755554199 2.9133973717689505 16.455208659172058 51.101383626461029 7.0902810841798773 314.9190199971199 79.806160688400269 73.730548858642578 7.486252970993525 24.434483408927917 23.836217761039734 93.554507911205292 56.236573576927185 5.0489537566900236 8.6002523154020292 25.117765545845035 4.0026932060718563 20.55034601688385 52.908771514892578 41.008159637451172 7.8430214524269122 2.1536951586604163 8.7961575239896757 10.528684437274931 2.0192552953958502 7.4454916119575492 4.5008933246135712 2.042952299118042 8.0657858699560148 2.7209523320198041 5.7426011264324179 9.0010576099157316 6.659754849970339 9.7921306416392309 5.8254567459225655 8.430326431989668 2.9366491697728634 2.3985384702682477 3.3712285459041587 3.0706821009516707 2.0437164604663849 5.7778744995594025 5.9526780396699888 1.6837895885109899 36.060802042484283 48.619657635688782 3.2905739471316338 2.6815982349216938 2.0343514680862427 5.155530110001564 2.5405218526721001 2.3289670497179031 2.1718956530094147 1.3556682392954824 1.0263395011425016 2.8644954487681389 10.357229173183441 3.6732072830200186 2.329681791365144
leaf_count=1552 58 132 43 85 53 188 28 23 39 42 23 8 32 46 32 99 83 10 69 34 49 2 225 29 48 2575 86 172 239 17 26 64 56 10 42 19 244 44 38 45 32 22 113 69 86 59 122 48 21 54 206 46 32 41 43 15 26 34 11 86 20 28 26 17 41 24 38 64 34 25 22 40 72 65 27 944 1268 39 53 22 10 21 39 22 18 24 40 271 96 61
internal_value=0 -0.0161041 0.00152833 -0.0204789 -0.00424343 -0.000781867 0.00510702 0.00816765 -0.0056575 -0.00166299 0.00226629 0.0122682 0.00967927 -0.00550175 -0.00331509 0.00153512 -0.00714034 -0.0124652 0.00124359 0.0091011 0.000991286 -0.00424152 0.00124441 0.0108791 0.000896068 0.00144951 -0.00951593 -0.00451862 -0.00301403 -0.00882343 -0.00575891 0.00382794 -0.00724597 0.00364583 0.00428632 -0.0171869 0.0036403 0.00525655 0.0030959 -0.0124487 0.0025824 0.00334621 0.00526231 0.00125478 -0.00591517 -0.00137986 -0.00796039 -0.00976923 0.000827314 -8.74445e-05 -0.00642745 -0.0151383 -0.0205395 -0.0150889 -0.0143845 -0.00607905 -0.0161949 -0.0143375 -0.0150205 -0.0114697 -0.0205413 -0.0123965 -0.0152052 -0.014699 -0.0134957 -0.0163644 -0.0176392 -0.020418 -0.0128422 -0.0119321 -0.0105194 -0.0187402 -0.0111117 -0.00699749 -0.0141753 -0.0245113 -0.0243633 -0.0217971 -0.0189914 -0.00802976 -0.0225689 -0.0225181 -0.0183944 -0.00623045 -0.0154388 -0.0221538 -0.0147773 -0.0248193 -0.0248161 -0.0248293
internal_weight=0 312.004 2524.31 220.869 286.164 201.259 91.1572 79.903 110.102 77.4641 2238.14 66.1003 58.7122 91.1353 79.5667 52.0019 28.7549 27.5648 1352.44 42.0764 1310.37 60.4603 1249.91 43.6132 1206.3 1121.54 59.3944 66.9928 60.5833 50.3819 33.8336 885.7 49.1588 858.846 536.012 22.6996 519.557 130.908 388.65 84.9053 322.833 224.94 117.391 107.549 43.9165 13.6492 30.2673 35.612 97.8936 77.3433 84.7554 32.6375 15.6093 16.5483 49.2933 16.1809 28.2197 12.3439 4.19665 13.8027 11.5686 14.4028 38.7647 29.7636 17.2784 12.4852 15.8758 10.2356 19.4311 11.5476 11.1365 6.40948 8.17641 14.1616 7.88348 161.475 109.054 8.55205 5.61825 6.03704 11.4126 5.26147 5.24236 8.12457 2.66619 4.61734 6.19969 52.4209 39.734 12.6869
internal_count=11346 5420 5926 4866 1758 1139 405 377 734 551 4168 228 220 554 428 314 215 114 3392 77 3315 155 3160 106 3054 2623 674 509 411 153 95 776 447 753 378 104 368 86 282 619 375 268 135 133 352 145 207 423 107 86 431 183 85 58 196 172 144 80 43 149 126 57 153 127 86 41 64 227 251 131 108 98 106 157 120 4192 2820 80 117 70 42 41 95 87 41 110 93 1372 1040 332
cat_boundaries=0 1 2 3 4 5 6 7 8 9 10 11 12 13 14 15 16 17 18 19
cat_threshold=1 2 1 2 1 1 2 1 1 2 2 2 2 1 1 1 1 1 1
is_linear=0
shrinkage=0.05


Tree=77
num_leaves=91
num_cat=20
split_feature=2 3 2 2 1 3 3 0 2 2 2 3 3 2 3 3 1 3 2 2 3 2 2 3 3 0 2 0 0 2 2 3 3 3 2 2 2 3 0 2 3 3 3 2 3 2 2 2 2 1 1 3 0 2 1 2 2 3 2 2 3 1 2 2 2 2 2 2 2 3 2 2 2 0 0 1 2 2 3 3 2 3 1 3 2 1 2 1 0 0
split_gain=33.3508 5.7435 4.09407 3.92419 3.14608 2.20017 2.31399 2.42526 1.62251 1.52101 1.34966 1.26622 2.30055 1.17436 1.3627 1.82933 1.14638 1.11315 1.00804 0.750915 0.728504 0.674982 3.58576 1.11373 1.74612 1.73723 1.74952 0.580512 0.565131 0.547797 0.544926 0.408413 5.36331 0.850514 0.286414 0.25627 1.8519 0.22419 0.222526 0.173838 0.170636 0.34133 0.941097 0.37657 0.169511 1.27419 0.20925 0.158141 0.157259 1.3133 0.515861 0.125591 0.0921634 0.0833907 0.0705237 0.0484659 0.0450718 0.0368845 0.0302332 0.0269539 0.0242833 0.0208904 0.0205677 0.0130951 0.0237452 0.0394631 0.011983 0.0102593 0.009328 0.00744279 0.00594558 0.00475718 0.00435824 0.00417128 0.00301649 0.00419078 0.00288761 0.00238361 0.0022137 0.00151588 0.00123722 0.00110326 0.00103892 0.000952561 0.000337523 0.00031188 0.000198905 6.79501e-07 7.21216e-07 4.44089e-16
threshold=3.5000000000000004 1.0000000180025095e-35 21.500000000000004 1.0000000180025095e-35 0 1.0000000180025095e-35 7.5000000000000009 1 14.500000000000002 13.500000000000002 204.50000000000003 6.5000000000000009 3.5000000000000004 1.0000000180025095e-35 2.5000000000000004 1.5000000000000002 2 96.500000000000014 22.500000000000004 207.50000000000003 1.0000000180025095e-35 55.500000000000007 56.500000000000007 1.5000000000000002 22.500000000000004 3 47.500000000000007 4 5 4.5000000000000009 27.500000000000004 8.5000000000000018 9.5000000000000018 3.5000000000000004 2.5000000000000004 314.50000000000006 320.50000000000006 31.500000000000004 6 13.500000000000002 16.500000000000004 1.5000000000000002 2.5000000000000004 248.50000000000003 1.0000000180025095e-35 471.50000000000006 783.00000000000011 8.5000000000000018 1.5000000000000002 7 8 66.500000000000014 9 242.50000000000003 10 19.500000000000004 6.5000000000000009 3.5000000000000004 18.500000000000004 16.500000000000004 7.5000000000000009 11 6.5000000000000009 18.500000000000004 16.500000000000004 15.500000000000002 19.500000000000004 1.5000000000000002 5.5000000000000009 1.5000000000000002 17.500000000000004 6.5000000000000009 10.500000000000002 12 13 14 1.5000000000000002 2.5000000000000004 1.0000000180025095e-35 7.5000000000000009 17.500000000000004 1.5000000000000002 15 1.0000000180025095e-35 4.5000000000000009 16 4.5000000000000009 17 18 19
decision_type=2 2 2 2 1 2 2 9 2 2 2 2 2 2 2 2 1 2 2 2 2 2 2 2 2 9 2 9 9 2 2 2 2 2 2 2 2 2 9 2 2 2 2 2 2 2 2 2 2 1 1 2 9 2 1 2 2 2 2 2 2 1 2 2 2 2 2 2 2 2 2 2 2 9 9 1 2 2 2 2 2 2 1 2 2 1 2 1 9 9
left_child=1 3 4 74 5 8 7 11 9 28 18 12 -7 14 15 16 -3 37 20 -12 -4 23 -23 25 30 26 -20 34 29 -2 -25 33 -33 -24 48 40 -37 54 -27 47 41 43 -43 -21 45 -38 -46 68 50 -50 -5 53 -10 -42 79 63 -30 72 59 -54 -56 -15 84 64 65 -41 -60 85 73 71 -64 -70 78 86 75 -1 81 -69 -49 -16 -66 -63 -36 -74 -9 -29 -6 88 -76 -89
right_child=2 13 10 27 39 6 -8 62 52 -11 19 -13 -14 61 17 -17 -18 -19 21 35 -22 22 31 24 -26 38 -28 67 56 -31 -32 32 -34 -35 82 36 44 -39 -40 55 51 42 -44 -45 46 -47 -48 57 49 -51 -52 -53 58 -55 60 -57 -58 -59 66 -61 -62 76 70 -65 80 -67 -68 77 69 -71 -72 -73 83 -75 87 -77 -78 -79 -80 -81 -82 -83 -84 -85 -86 -87 -88 89 -90 -91
leaf_value=-0.02407047403186138 -0.019633240314646735 -0.013410214412913636 0.0014630681631783648 -0.0048844544663465784 -0.0143633228627846 0.012898878256350003 -0.016485337701271908 -0.014716426742656889 -0.0082506145790125947 0.015924118487013104 0.012948243935701088 0.030978783741630968 -0.017952719033645627 -0.016846490038932894 -0.023046643933811197 0.011813796157178062 0.0086800321223898299 0.0092373108357358125 0.0051914657893762555 -0.0018734566796234056 0.014644527985739345 0.028713725206972421 0.0016241614283937786 -0.014092361996501277 0.010234796027746303 -0.0056689465458613798 -0.0069284847149031622 -0.022316089630275107 -0.018322824558313751 -0.0010238910427946646 -0.0051347951110970076 0.023896954151630751 0.00043590067451449739 -0.0026611752822619846 -0.018910505656608238 0.018218099669127831 0.011214731296692804 -0.0096579957049773377 -0.013640021227853117 -0.013843958078341032 0.001954059941011832 0.013803901577533082 0.0027548745699793173 0.0039817700287645471 0.0024487340719507407 0.0011408347016718123 0.0054055037688587985 -0.0085803551907061605 -0.021939305141596404 0.010347536988246609 -0.022426892446388097 0.0041461054712509599 -0.015973021060415839 -0.0014293467483016608 -0.018618666418750259 -0.011208965891324359 -0.011761367063686275 0.00035311598117749492 -0.018987889875108511 -0.011087131136419208 -0.010952588277060957 -0.023173538572710407 -0.011085634021033838 -0.016743435435491477 -0.012868904980294511 -0.018348431311973539 -0.0162106150330012 -0.019874066608434604 -0.012843266080930782 -0.013768770538538254 -0.0084882846856820012 -0.010178117230989953 -0.0064424632042350428 -0.011803674298525083 -0.024817984771115593 -0.024701715577884212 -0.020556858710390952 -0.01779260432132956 -0.0065472920944082968 -0.021875666752342454 -0.011616904630830439 -0.021708262801230321 -0.017480941831407495 -0.0052156781774025532 -0.01585043571495616 -0.021317013061349671 -0.01493560594410223 -0.024829265168235734 -0.024794438166056025 -0.024829264219732153
leaf_weight=58.995811820030212 4.2804478257894507 20.285282108932734 18.850110322237015 24.992900222539902 3.2871384546160725 52.457168780267239 11.068678475916384 1.2911882810294621 4.380851149559021 10.646692179143427 21.502360045909882 7.6347641199827185 6.8291483595967284 2.9657275341451168 6.1143109351396561 23.533940970897675 8.2664814442396182 4.9120155572891226 165.92674785852432 53.454488396644592 23.612003013491631 12.106762290000914 537.38241055607796 20.695398852229118 17.434600457549095 22.184903018176556 36.287010088562965 3.5115556716918928 5.3152227103710157 51.940465040504932 94.533076867461205 27.462615489959717 215.62415324151516 147.58323675394058 2.8585025072097769 22.453961968421936 51.699504315853119 7.0210934728384009 14.46407403051853 13.949490994215017 28.202077388763428 24.181042492389679 94.929687917232513 56.467624664306641 310.12470602989197 79.899689555168152 74.142708539962769 3.9679356366395977 4.9390789195895177 8.693002834916113 5.0350274890661266 20.638285338878632 7.71764685213566 51.409851133823395 2.1137235388159796 10.40972565114498 5.1561664044857025 2.019986927509307 7.3046436905860892 4.4505831301212311 2.0203890800476074 2.6585222966968995 7.9756401777267438 8.8504060208797437 3.7445825263857833 7.464015081524848 8.2936083972454053 2.8785800561308861 2.3675638735294324 3.3246206417679778 3.0443001613020897 5.7185038179159164 5.9137400314211828 1.6637738868594167 35.176850855350494 47.433232814073563 3.2233391962945461 2.6339783407747746 2.0208298936486244 5.0436509996652603 4.171319492161274 2.4857987686991692 2.2883147746324539 2.1603724136948586 1.3341596126556394 1.0046178102493284 2.8216124400496483 10.1032335460186 3.5832488536834708 2.2725497931241962
leaf_count=1552 58 132 43 122 53 188 28 23 39 42 18 8 32 46 32 99 83 10 550 66 34 37 1196 79 22 117 126 86 72 304 399 35 399 314 56 15 42 19 41 62 36 22 114 69 239 44 38 48 86 59 85 21 46 52 32 43 75 15 26 34 11 20 86 26 21 23 38 64 34 25 22 72 65 27 944 1268 39 53 22 10 21 21 39 22 18 24 40 271 96 61
internal_value=0 -0.0159632 0.00148745 -0.0203891 -0.00415768 -0.000765433 0.00495091 0.00789595 -0.00554975 -0.0016255 0.00220459 0.0118132 0.0093451 -0.00539705 -0.00324568 0.0014927 -0.00701451 -0.0123109 0.00121082 0.00371815 0.00879291 0.000965371 0.00167838 -0.000838923 -0.0045123 0.00120125 0.00301656 -0.00937048 -0.00442711 -0.00244074 -0.0067436 0.0013257 0.0030864 0.000700839 -0.00711915 0.00348939 0.00416148 -0.0170545 -0.00881485 -0.0122937 0.00239066 0.00314369 0.00499797 0.00113441 0.00354964 0.00509842 0.00301923 -0.00962151 -0.00580406 -0.0013504 -0.00782594 0.000670268 -0.0149906 -0.000230794 -0.0204505 -0.0142332 -0.0150919 -0.00596478 -0.016054 -0.014186 -0.0148722 -0.0204523 -0.0113156 -0.0150577 -0.0145491 -0.0154141 -0.0175112 -0.020327 -0.0126872 -0.0117773 -0.0103681 -0.0109585 -0.00687229 -0.0140232 -0.0245034 -0.0243518 -0.0217303 -0.0188795 -0.00789432 -0.0225173 -0.0122092 -0.0224655 -0.0182749 -0.00611422 -0.0152927 -0.0220938 -0.0146277 -0.0248191 -0.0248158 -0.0248293
internal_weight=0 307.045 2528.23 216.4 284.977 201.121 91.635 80.5664 109.486 77.339 2243.25 66.9211 59.2863 90.6443 79.3109 52.0857 28.5518 27.2252 1354.15 889.106 42.4621 1311.68 940.159 371.526 132.663 238.863 202.214 58.8356 66.6923 56.2209 115.228 928.052 243.087 684.966 48.8068 867.604 538.321 22.3132 36.649 83.8556 329.283 229.033 119.111 109.922 515.867 131.599 384.267 35.2661 43.66 13.6321 30.0279 100.25 32.1473 79.6119 15.2921 48.5895 10.4714 16.0829 27.7665 12.1682 4.13411 11.3334 13.6453 38.1798 29.3294 21.4135 15.5983 10.0287 19.1832 11.4107 11.0199 8.08607 14.0629 7.77252 157.565 106.429 8.36766 5.51256 5.98877 11.158 7.9159 5.14432 5.14682 8.07411 2.62535 4.51617 6.10875 51.1359 38.7601 12.3758
internal_count=11346 5420 5926 4866 1758 1139 405 377 734 551 4168 228 220 554 428 314 215 114 3392 776 77 3315 1981 1334 500 834 676 674 509 362 478 1944 434 1510 447 758 378 104 158 619 380 271 136 135 363 86 277 423 352 145 207 109 183 88 85 196 147 172 144 80 43 126 149 153 127 85 64 227 251 131 108 106 157 120 4192 2820 80 117 70 42 42 41 95 87 41 110 93 1372 1040 332
cat_boundaries=0 1 2 3 4 5 6 7 8 9 10 11 12 13 14 15 16 17 18 19 20
cat_threshold=1 2 1 2 2 2 1 1 1 1 1 2 2 2 1 1 1 1 1 1
is_linear=0
shrinkage=0.05


Tree=78
num_leaves=89
num_cat=18
split_feature=2 3 2 2 1 3 3 0 2 2 2 2 2 2 3 3 1 3 2 3 2 3 2 3 2 2 0 0 2 3 2 2 2 3 3 3 2 2 2 2 2 2 1 1 2 0 1 1 2 3 2 2 2 2 3 2 2 3 1 2 3 2 3 2 2 2 3 2 2 3 2 2 2 0 0 1 2 2 3 3 3 1 3 2 1 2 1 0
split_gain=32.2053 5.69678 3.94187 3.89723 3.04363 2.0944 2.2087 2.28679 1.57792 1.43193 1.27466 1.16539 2.16511 1.15008 1.31447 1.72877 1.10325 1.08042 0.991914 0.675432 0.61863 2.3397 1.64588 4.25129 1.76157 0.712655 0.572969 0.54955 0.533365 0.364926 0.585345 0.28109 0.22816 0.223615 0.171806 2.52929 0.249564 3.18316 0.910391 0.171472 0.154757 0.151733 1.26567 0.508389 0.111459 0.0912002 0.0886999 0.0711 0.0663553 0.0511975 0.0855474 0.0480182 0.0469718 0.0448661 0.0355222 0.0301729 0.0267248 0.0241547 0.0210865 0.0203056 0.0184435 0.0130505 0.0241735 0.0495146 0.0156368 0.012019 0.0110236 0.0103793 0.00922299 0.00734434 0.00582818 0.00468234 0.00423328 0.00413251 0.00308983 0.00429029 0.0029315 0.0024 0.00215486 0.00154306 0.00112294 0.00104409 0.00092233 0.000336212 0.000316931 0.000197748 6.9644e-07 7.39337e-07
threshold=3.5000000000000004 1.0000000180025095e-35 1.0000000180025095e-35 21.500000000000004 0 1.0000000180025095e-35 7.5000000000000009 1 14.500000000000002 13.500000000000002 166.50000000000003 5.5000000000000009 14.500000000000002 1.0000000180025095e-35 2.5000000000000004 1.5000000000000002 2 96.500000000000014 22.500000000000004 1.0000000180025095e-35 25.500000000000004 22.500000000000004 27.500000000000004 1.0000000180025095e-35 37.500000000000007 38.500000000000007 3 4 4.5000000000000009 1.0000000180025095e-35 23.500000000000004 2.5000000000000004 1279.5000000000002 31.500000000000004 36.500000000000007 34.500000000000007 205.50000000000003 201.50000000000003 208.50000000000003 13.500000000000002 8.5000000000000018 1.5000000000000002 5 6 32.500000000000007 7 8 9 23.500000000000004 117.50000000000001 316.50000000000006 19.500000000000004 494.00000000000006 6.5000000000000009 3.5000000000000004 18.500000000000004 16.500000000000004 7.5000000000000009 10 6.5000000000000009 2.5000000000000004 18.500000000000004 1.0000000180025095e-35 15.500000000000002 15.500000000000002 19.500000000000004 72.500000000000014 1.5000000000000002 5.5000000000000009 1.5000000000000002 17.500000000000004 6.5000000000000009 10.500000000000002 11 12 13 1.5000000000000002 2.5000000000000004 1.0000000180025095e-35 7.5000000000000009 1.5000000000000002 14 1.0000000180025095e-35 4.5000000000000009 15 4.5000000000000009 16 17
decision_type=2 2 2 2 1 2 2 9 2 2 2 2 2 2 2 2 1 2 2 2 2 2 2 2 2 2 9 9 2 2 2 2 2 2 2 2 2 2 2 2 2 2 1 1 2 9 1 1 2 2 2 2 2 2 2 2 2 2 1 2 2 2 2 2 2 2 2 2 2 2 2 2 2 9 9 1 2 2 2 2 2 1 2 2 1 2 1 9
left_child=1 2 74 4 5 8 7 11 9 27 18 -7 -13 14 15 16 -3 33 19 -5 21 29 23 -22 44 -26 31 28 -2 30 -20 41 34 47 35 36 37 -12 -38 40 68 43 -43 -4 -24 -10 49 79 -31 50 -36 61 66 -29 72 56 -47 -49 -15 83 -25 62 63 -41 -64 -57 -48 84 73 71 -61 -70 78 85 75 -1 80 -69 -42 -16 -60 -33 -74 -9 -28 -6 87 -76
right_child=3 13 26 10 39 6 -8 59 45 -11 32 12 -14 58 17 -17 -18 -19 20 -21 22 -23 24 60 25 -27 67 53 -30 48 -32 81 -34 -35 46 -37 38 -39 -40 51 54 42 -44 -45 -46 55 52 57 -50 -51 -52 -53 -54 -55 -56 65 -58 -59 76 70 -62 -63 64 -65 -66 -67 -68 77 69 -71 -72 -73 82 -75 86 -77 -78 -79 -80 -81 -82 -83 -84 -85 -86 -87 -88 -89
leaf_value=-0.024051987054396085 -0.019530217599007957 -0.013256051729519398 -0.022372405228599269 0.0014246279284698495 -0.014211912203638511 0.024387797519274515 -0.016346645293652262 -0.014566501967781989 -0.0081132647103813703 0.015280295484277624 0.0024590823289969239 -0.0038733956911677103 0.01646481234080403 -0.016710869011260655 -0.023005083544951153 0.011383450794109776 0.0083904293921507576 0.0089240759948529015 9.1990908631098485e-06 0.014070665143496447 0.02113456717314683 0.017424398016771332 -0.0080758949609167786 -0.013613110687682173 0.011319282075409526 0.0010461427029042174 -0.022259376431436294 -0.018202509046659984 -0.00099950416412469866 -0.018278604034294817 -0.01328876589938623 -0.018797513956876205 0.0083645825273681862 -0.0095107618659442013 -0.00099582429655387648 0.018840591769780174 -0.0085225184568337928 0.026439567082481186 0.0030159672958800176 -0.010076913149627536 -0.0084403340171870355 -0.021875201904826488 0.0099854205537951435 -0.0047867978578518466 -0.0044363975065746866 -0.015830424223281524 0.0029978975147504318 -0.018501950043209005 -0.011855416998373232 0.0030251341554841495 0.0020100407873583533 -0.011055436955209835 0.0044804696477810961 -0.011606763722860042 0.0003442250212181308 -0.018875914951466965 -0.010933922449991744 -0.01079976780565226 -0.023134720739795622 -0.010932429471286432 -0.0099209171212520549 -0.016606911112669157 -0.017784112007623469 -0.015552785975933188 -0.014182869246151831 -0.016069763693666164 0.0015309051702988607 -0.01977460154644203 -0.012688334266107215 -0.013615428217164103 -0.008348987572320327 -0.010028234616805095 -0.006323624374447479 -0.01164901352124028 -0.024817702487537237 -0.024698525038243248 -0.020468122429195261 -0.01766628302078822 -0.0064272022909508944 -0.021810343629045183 -0.02163977074388285 -0.017351357347470071 -0.0051131126144980414 -0.015706983029123923 -0.021241337156790958 -0.014786729717820036 -0.024829264847319212 -0.024793564499014764
leaf_weight=57.592709302902222 4.1972283869981757 20.015067901462317 4.9233644641935825 18.877709552645683 3.2402617782354382 13.729042947292326 10.887703254818915 1.2723256871104234 4.3448551297187805 10.817589178681372 131.40558230876923 22.277756549417973 31.714012391865253 2.9161839745938778 5.975007951259613 23.813615456223488 8.3385472595691699 4.957599699497222 19.226290881633759 23.960333004593849 29.986362814903259 10.373967528343199 43.383162096142769 8.4953414648771268 17.188127011060715 946.50279723107815 3.4340592101216298 5.2187196612358075 51.88731062412262 7.5374072641134289 14.528541654348372 2.8049546778202048 22.760998129844666 6.9536100924015036 44.056610941886902 26.464874923229218 17.577578365802765 15.467150151729582 622.74625164270401 7.3067146241664949 3.9340349733829489 4.8318987563252431 8.7834209203720075 24.871119946241382 40.839680165052414 7.5953520536422783 24.00156307220459 2.0747329667210623 8.6181606352329236 28.79864627122879 51.154690384864807 10.293695226311682 41.213810801506042 5.0958779416978359 2.0207003206014624 7.1672524213790885 4.4015114903450012 1.9983813166618345 2.5976233743131143 7.8877134323120099 5.6197775006294242 8.703453600406645 6.4509910345077497 9.4901311844587308 5.6580240949988365 8.1602473855018598 27.453292071819305 2.8219357281923294 2.3373509831726533 3.2791583612561226 3.0185686051845551 5.6605954617261887 5.8757634535431844 1.6442507132887838 34.31457644701004 46.275905787944794 3.1577539034187794 2.5875274688005447 2.0076421350240707 4.9345156997442245 2.4324178732931614 2.24866047129035 2.1491339355707169 1.3131793588399885 0.98342907428741444 2.7797830253839493 12.072284601628779 3.4954966306686392
leaf_count=1552 58 132 85 43 53 34 28 23 39 42 212 113 81 46 32 99 83 10 34 34 49 2 225 29 48 2318 86 72 304 17 61 56 10 19 54 20 15 19 577 45 48 86 59 122 206 46 21 32 41 21 40 43 23 75 15 26 34 11 20 86 28 26 17 41 24 38 21 64 34 25 22 72 65 27 944 1268 39 53 22 10 21 39 22 18 24 40 332 96
internal_value=0 -0.0158212 -0.0202978 0.00144768 -0.00407326 -0.000749254 0.00480047 0.00763555 -0.00544345 -0.00158876 0.00214464 0.0113805 0.00807298 -0.00529377 -0.00317749 0.00145157 -0.00689001 -0.0121567 0.00102708 0.00849786 0.000749343 -0.00418142 0.00102155 0.0104837 0.000623329 0.00122937 -0.00922589 -0.00433703 -0.0023863 -0.00867223 -0.00571443 -0.00699366 0.00341294 -0.0169209 0.00330355 0.00363674 0.0031256 0.00498446 0.00269922 -0.0121388 -0.00947461 -0.00569441 -0.0013215 -0.00769272 -0.0063111 -0.014842 0.00205239 -0.0203601 -0.0148522 0.00117789 0.000619153 -0.0140813 0.00322266 -0.0149439 -0.00585199 -0.015912 -0.014034 -0.014723 -0.0203618 -0.0111618 -0.0121431 -0.0149095 -0.0143984 -0.0131708 -0.0161014 -0.0173819 0.0022152 -0.0202346 -0.0125322 -0.0116227 -0.0102174 -0.0108056 -0.00674847 -0.0138706 -0.0244954 -0.02434 -0.0216622 -0.0187661 -0.00776011 -0.0224647 -0.0224118 -0.018154 -0.00599944 -0.0151458 -0.0220327 -0.0144773 -0.0248188 -0.0248155
internal_weight=0 302.206 212.041 2532.06 283.818 200.986 92.1003 81.2126 108.886 77.2167 2248.24 67.7208 53.9918 90.1651 79.0611 52.1672 28.3536 26.8938 1195.14 42.838 1152.3 60.2844 1092.02 44.1015 1047.91 963.691 58.2904 66.3991 56.0845 49.9104 33.7548 48.4634 1053.1 21.9362 1030.34 813.661 787.197 146.873 640.324 82.8317 34.9287 43.4098 13.6153 29.7945 84.2228 31.6692 216.679 14.9826 16.1556 124.01 95.2113 47.903 92.6687 10.3146 15.9873 27.3244 11.9969 4.07311 11.104 13.4918 14.1151 37.6093 28.9059 16.7968 12.109 15.3275 51.4549 9.82695 18.9414 11.2771 10.9063 7.99795 13.9666 7.6643 153.751 103.869 8.1878 5.40946 5.94168 10.9095 5.03004 5.05362 8.0249 2.58551 4.41749 6.02004 49.8824 37.8101
internal_count=11346 5420 4866 5926 1758 1139 405 377 734 551 4168 228 194 554 428 314 215 114 3135 77 3058 155 2903 106 2797 2366 674 509 362 153 95 447 1033 104 1023 843 823 231 592 619 423 352 145 207 431 183 180 85 58 115 94 196 65 147 172 144 80 43 126 149 57 153 127 86 41 64 42 227 251 131 108 106 157 120 4192 2820 80 117 70 42 41 95 87 41 110 93 1372 1040
cat_boundaries=0 1 2 3 4 5 6 7 8 9 10 11 12 13 14 15 16 17 18
cat_threshold=1 2 1 2 2 1 2 1 1 1 2 2 2 1 1 1 1 1
is_linear=0
shrinkage=0.05


Tree=79
num_leaves=90
num_cat=17
split_feature=2 3 2 2 1 3 3 0 2 2 2 2 3 3 3 3 1 3 2 2 2 3 2 3 2 2 3 0 2 2 3 1 2 2 2 2 3 2 3 2 2 3 3 3 2 2 2 1 1 3 2 0 2 1 2 2 3 2 2 3 1 2 3 2 2 2 2 2 2 3 2 2 2 0 0 1 2 2 3 3 2 3 1 3 2 1 2 1 0
split_gain=31.0959 5.64856 3.95867 3.70994 2.9438 1.99381 2.1088 2.15742 1.53411 1.34877 1.21872 1.12602 1.26773 1.63432 1.10283 2.14243 1.06175 1.04869 0.892983 0.706305 0.630628 2.21463 1.48468 3.96449 1.76885 0.647107 0.626806 0.565319 0.538821 1.30223 0.357453 0.584552 0.275767 0.233609 1.70008 0.231638 0.222959 0.16906 0.160748 1.18975 0.188791 0.160107 0.319991 0.872182 0.354384 0.151381 0.146364 1.22011 0.500882 0.121426 0.108037 0.0902081 0.0801053 0.0716601 0.06604 0.0475531 0.0342023 0.0300998 0.0264856 0.0240167 0.0212782 0.0200377 0.0181844 0.0130001 0.0240375 0.0397176 0.0120504 0.0104978 0.00911491 0.00724382 0.00571054 0.00460655 0.00411034 0.00409221 0.00316484 0.00439195 0.00297542 0.00241567 0.00209676 0.00157049 0.00123592 0.00114279 0.0010489 0.000892753 0.000334759 0.000321998 0.000196507 7.14048e-07 7.57746e-07
threshold=3.5000000000000004 1.0000000180025095e-35 1.0000000180025095e-35 21.500000000000004 0 1.0000000180025095e-35 7.5000000000000009 1 14.500000000000002 13.500000000000002 204.50000000000003 1.0000000180025095e-35 2.5000000000000004 1.5000000000000002 6.5000000000000009 3.5000000000000004 2 96.500000000000014 22.500000000000004 207.50000000000003 25.500000000000004 22.500000000000004 27.500000000000004 1.0000000180025095e-35 37.500000000000007 38.500000000000007 1.0000000180025095e-35 3 5.5000000000000009 7.5000000000000009 1.0000000180025095e-35 4 2.5000000000000004 314.50000000000006 320.50000000000006 4.5000000000000009 31.500000000000004 13.500000000000002 1.0000000180025095e-35 471.50000000000006 783.00000000000011 16.500000000000004 1.5000000000000002 2.5000000000000004 248.50000000000003 8.5000000000000018 1.5000000000000002 5 6 66.500000000000014 32.500000000000007 7 242.50000000000003 8 23.500000000000004 19.500000000000004 3.5000000000000004 18.500000000000004 16.500000000000004 7.5000000000000009 9 6.5000000000000009 2.5000000000000004 18.500000000000004 16.500000000000004 15.500000000000002 19.500000000000004 1.5000000000000002 5.5000000000000009 1.5000000000000002 17.500000000000004 6.5000000000000009 10.500000000000002 10 11 12 1.5000000000000002 2.5000000000000004 1.0000000180025095e-35 7.5000000000000009 17.500000000000004 1.5000000000000002 13 1.0000000180025095e-35 4.5000000000000009 14 4.5000000000000009 15 16
decision_type=2 2 2 2 1 2 2 9 2 2 2 2 2 2 2 2 1 2 2 2 2 2 2 2 2 2 2 9 2 2 2 1 2 2 2 2 2 2 2 2 2 2 2 2 2 2 2 1 1 2 2 9 2 1 2 2 2 2 2 2 1 2 2 2 2 2 2 2 2 2 2 2 2 9 9 1 2 2 2 2 2 2 1 2 2 1 2 1 9
left_child=1 2 74 4 5 8 7 14 9 28 18 12 13 16 15 -7 -3 36 26 -12 21 30 23 -22 50 -26 -5 32 35 -30 31 -20 46 41 -35 -2 53 45 39 -36 -40 42 44 -44 -21 68 48 -48 -4 52 -24 -10 -43 79 -32 63 72 58 -53 -55 -13 84 -25 64 65 -39 -59 85 73 71 -63 -70 78 86 75 -1 81 -69 -47 -14 -66 -62 -34 -74 -9 -29 -6 88 -76
right_child=3 11 27 10 37 6 -8 61 51 -11 19 60 17 -15 -16 -17 -18 -19 20 33 22 -23 24 62 25 -27 -28 67 29 -31 54 -33 82 34 38 -37 -38 55 40 -41 -42 49 43 -45 -46 56 47 -49 -50 -51 -52 57 -54 59 -56 -57 -58 66 -60 -61 76 70 -64 -65 80 -67 -68 77 69 -71 -72 -73 83 -75 87 -77 -78 -79 -80 -81 -82 -83 -84 -85 -86 -87 -88 -89 -90
leaf_value=-0.024033068564985507 -0.018382678417603136 -0.013101613993352546 -0.022316820323432282 0.0013872526751062624 -0.014059941509249652 0.011997100684432237 -0.016206843201045495 -0.014415914714166972 -0.0079770918455277159 0.014672068334243914 0.012404775286149012 -0.016574063555398932 -0.022962631921835782 0.010973562400410784 0.028411622499873584 -0.017877767763207583 0.0081128668203719178 0.0086241989892397782 -0.0012236771675214675 -0.0018886518094892654 0.020173334878495416 0.016694532024379503 -0.0079400487051766236 -0.013459379423735887 0.010912411909673979 0.001190232246841634 0.013527150289515297 -0.022201529645838741 0.0072970682665769492 -0.010962401811442465 -0.018157766235531305 -0.015542508393176703 -0.01868306012126791 0.017245979872228312 0.01070543272089124 -0.0072358680898490894 -0.0093643761145762467 -0.013537360656818213 0.0022902395280014151 0.0010216970076981971 0.0050851277586956723 0.0018354390244501601 0.013159531076320063 0.002599793520970953 0.0037808618501049048 -0.0083014203924659438 -0.021809868167746729 0.0096395107233641242 -0.0046906281939936767 0.0039931755478613455 -0.0043457256637462012 -0.015686835364186143 -0.0014747617819630601 -0.018383792350114274 -0.011700691189941086 -0.010902316502599572 0.00033556142771311314 -0.01876247123099254 -0.010781157994776514 -0.010647431315407643 -0.023095061086104107 -0.010779669919421539 -0.0097722768698712652 -0.016469223376344759 -0.012530394831285638 -0.018127850475667506 -0.015927863162808555 -0.019673652538309851 -0.012533303857476931 -0.013461702821205346 -0.0082108177458982759 -0.0098790595919160187 -0.0062062306576122113 -0.01149457902579918 -0.024817410694989463 -0.024695255186740466 -0.020377938028953758 -0.017538615097307361 -0.0063085473306903079 -0.021743776596023272 -0.011261885783032227 -0.021569998300184523 -0.017220472937964509 -0.0050120436363858475 -0.015562568932197299 -0.021164310678571482 -0.014637129040492547 -0.024829264958754361 -0.02479266918808103
leaf_weight=56.224013388156891 6.053997308015826 19.751498959958553 4.8144398257136345 18.904622405767441 3.1945371627807644 53.741700679063797 10.711172685027121 1.2539267130196088 4.309746690094471 10.984154179692267 21.816208600997925 2.8678569495677948 5.8391213789582253 24.086244717240334 8.0028965026140195 6.7555160596966735 8.408805303275587 5.0020396113395682 23.292732715606689 53.489894926548004 30.626855254173279 10.556310892105101 43.034215047955513 8.3804772645235044 17.383789911866188 1108.8362703174353 24.299853950738907 3.3584638535976392 22.63714462146163 17.171447493135929 7.4008854255080214 10.270488575100897 2.7527209222316733 22.972745895385742 52.440483570098877 20.250595927238464 6.8877894282340995 13.570734992623334 311.93716841936111 80.267919063568115 74.936759233474731 28.327537477016449 24.591204226016998 95.466410517692566 56.86415559053421 3.9009701460599882 4.7273479104042035 8.8715663552284223 24.75235199928284 20.747791051864624 40.658900156617165 7.4760609567165428 51.509822309017181 2.0366993322968527 8.5165920406579954 10.180520780384539 2.021395966410636 7.0332333445549002 4.3536478877067566 1.9769153892993925 2.5382178835570794 7.801951125264166 5.5642996504902831 8.5601094514131528 3.6415179073810569 7.2183326929807654 8.0301623195409757 2.7666811868548393 2.3078814111649972 3.2348137870430946 2.9934715330600739 5.6041133850812912 5.8387246429920197 1.6252078898251054 33.473447799682617 45.146958559751511 3.0937776155769825 2.5422169752418995 1.9947799965739248 4.8280573040246964 4.0621680989861488 2.3803463540971279 2.2099797315895557 2.1381732523441315 1.2927143760025499 0.96275997161865223 2.7389817535877228 11.776229232549666 3.4098962545394889
leaf_count=1552 98 132 85 43 53 188 28 23 39 42 18 46 32 99 8 32 83 10 69 66 49 2 225 29 48 2575 34 86 116 239 17 26 56 15 42 56 19 62 239 44 38 36 22 114 69 48 86 59 122 21 206 46 52 32 41 43 15 26 34 11 20 86 28 26 21 23 38 64 34 25 22 72 65 27 944 1268 39 53 22 10 21 21 39 22 18 24 40 332 96
internal_value=0 -0.0156783 -0.020205 0.00140909 -0.00399018 -0.000733344 0.00465544 0.00738581 -0.0053386 -0.00155277 0.00208651 -0.00519191 -0.00311048 0.00141167 0.0109685 0.00866108 -0.00676687 -0.0120025 0.00114217 0.00351849 0.000909705 -0.00409635 0.00114928 0.0101112 0.000819138 0.0013403 0.0082152 -0.00908221 -0.00424839 -0.000579159 -0.00853192 -0.0056053 -0.00686951 0.00329657 0.00393521 -0.0098013 -0.0167861 -0.0119839 0.00334669 0.00484828 0.0028316 0.00224972 0.0029763 0.00476273 0.00103278 -0.00932856 -0.0055862 -0.00129314 -0.00756075 0.000585358 -0.00619389 -0.0146928 -0.000300251 -0.0202682 -0.0147029 -0.013929 -0.00574068 -0.015769 -0.0138814 -0.0145732 -0.02027 -0.0110085 -0.0119881 -0.0147605 -0.0142472 -0.0151313 -0.0172514 -0.0201406 -0.0123772 -0.0114683 -0.0100674 -0.0106533 -0.00662605 -0.0137175 -0.0244871 -0.024328 -0.0215928 -0.0186513 -0.00762715 -0.022411 -0.0118615 -0.022357 -0.0180317 -0.00588613 -0.014998 -0.0219704 -0.0143264 -0.0248185 -0.0248151
internal_weight=0 297.486 207.789 2535.78 282.687 200.854 92.5533 81.8422 108.3 77.0973 2253.09 89.6974 78.8172 52.2465 68.5001 60.4972 28.1603 26.5706 1357.73 895.368 1314.52 60.037 1254.48 44.5716 1209.91 1126.22 43.2045 57.7585 66.1132 39.8086 49.4807 33.5632 48.1284 873.552 542.555 26.3046 21.5686 81.833 519.582 132.708 386.874 330.997 230.412 120.058 110.354 34.5996 43.1657 13.5989 29.5668 100.585 83.6931 31.2029 79.8374 14.6808 15.9175 47.2334 15.894 26.8931 11.8297 4.01361 10.8802 13.3421 13.9448 37.0529 28.4928 20.7891 15.0634 9.63012 18.7055 11.1468 10.7954 7.91199 13.8726 7.55873 150.031 101.371 8.01234 5.3089 5.89575 10.6672 7.70369 4.91856 4.9627 7.9769 2.54664 4.32122 5.93352 48.6596 36.8833
internal_count=11346 5420 4866 5926 1758 1139 405 377 734 551 4168 554 428 314 228 220 215 114 3392 776 3315 155 3160 106 3054 2623 77 674 509 355 153 95 447 758 378 154 104 619 363 86 277 380 271 136 135 423 352 145 207 109 431 183 88 85 58 196 172 144 80 43 126 149 57 153 127 85 64 227 251 131 108 106 157 120 4192 2820 80 117 70 42 42 41 95 87 41 110 93 1372 1040
cat_boundaries=0 1 2 3 4 5 6 7 8 9 10 11 12 13 14 15 16 17
cat_threshold=1 2 1 2 1 1 2 1 1 2 2 2 1 1 1 1 1
is_linear=0
shrinkage=0.05


Tree=80
num_leaves=101
num_cat=23
split_feature=2 3 3 2 3 2 0 3 1 0 2 2 2 3 3 3 3 2 2 0 2 3 0 2 3 3 2 2 2 3 2 2 2 1 2 2 3 3 3 2 0 2 0 1 2 2 2 2 2 2 2 3 3 3 2 2 1 2 2 3 3 3 2 0 3 3 2 1 1 1 2 3 2 2 2 2 3 2 2 2 0 2 3 0 1 2 3 2 3 2 2 1 0 2 3 1 0 0 1 2
split_gain=27.6817 8.06866 3.55923 6.31088 2.23346 2.37953 1.84349 1.43026 1.3828 1.18682 3.07882 2.0539 3.44819 2.78288 7.51564 2.85445 2.58659 1.98827 1.83968 3.46291 1.14109 1.13406 1.05343 0.741522 0.629056 2.64159 0.555807 0.401204 0.281141 0.280169 0.989348 4.43961 0.393763 0.260575 0.309544 0.259438 0.223855 0.209349 0.195523 0.174474 0.157627 0.123412 0.117283 0.111793 0.0978189 0.0921793 0.0919433 0.107576 0.125981 0.0989283 0.124884 0.0775772 0.0755817 0.0647276 0.0624043 0.0620994 0.0573583 1.39378 1.1827 0.0368149 0.0321014 0.0317153 0.0313955 0.0311075 0.0304874 0.0288522 0.0276814 0.0224609 0.0223732 0.0214144 0.0207776 0.0197387 0.0193136 0.0184074 0.0106471 0.0106664 0.0102058 0.0546106 0.0353753 0.00899009 0.00665136 0.00336888 0.00308312 0.00307323 0.00453274 0.00224554 0.00186165 0.00112148 0.000930977 0.000503542 0.000427184 0.000356022 0.000193773 0.000165637 0.000113316 1.38709e-06 2.21195e-06 1.53889e-06 8.4248e-07 2.45712e-07
threshold=4.5000000000000009 28.500000000000004 1.0000000180025095e-35 1.0000000180025095e-35 2.5000000000000004 1.0000000180025095e-35 0 1.5000000000000002 1 2 42.500000000000007 93.500000000000014 92.500000000000014 9.5000000000000018 8.5000000000000018 4.5000000000000009 2.5000000000000004 19.500000000000004 48.500000000000007 3 2.5000000000000004 22.500000000000004 4 28.500000000000004 35.500000000000007 32.500000000000007 23.500000000000004 94.500000000000014 23.500000000000004 1.5000000000000002 120.50000000000001 117.50000000000001 155.50000000000003 5 208.50000000000003 72.500000000000014 2.5000000000000004 196.50000000000003 10.500000000000002 192.50000000000003 6 417.50000000000006 7 8 5.5000000000000009 490.00000000000006 154.50000000000003 193.50000000000003 334.50000000000006 118.50000000000001 124.50000000000001 25.500000000000004 8.5000000000000018 54.500000000000007 116.50000000000001 291.50000000000006 9 1.5000000000000002 1.5000000000000002 1.0000000180025095e-35 1.5000000000000002 2.5000000000000004 14.500000000000002 10 8.5000000000000018 1.5000000000000002 110.50000000000001 11 12 13 7.5000000000000009 29.500000000000004 176.50000000000003 64.500000000000014 37.500000000000007 27.500000000000004 4.5000000000000009 73.500000000000014 69.500000000000014 36.500000000000007 14 1.5000000000000002 4.5000000000000009 15 16 2.5000000000000004 3.5000000000000004 3.5000000000000004 1.5000000000000002 3.5000000000000004 28.500000000000004 17 18 3.5000000000000004 8.5000000000000018 19 20 21 22 3.5000000000000004
decision_type=2 2 2 2 2 2 9 2 1 9 2 2 2 2 2 2 2 2 2 9 2 2 9 2 2 2 2 2 2 2 2 2 2 1 2 2 2 2 2 2 9 2 9 1 2 2 2 2 2 2 2 2 2 2 2 2 1 2 2 2 2 2 2 9 2 2 2 1 1 1 2 2 2 2 2 2 2 2 2 2 9 2 2 9 1 2 2 2 2 2 2 1 9 2 2 1 9 9 1 2
left_child=1 2 3 83 5 6 7 8 -4 11 28 12 13 14 15 16 -2 -15 19 -12 22 29 56 -19 25 51 -17 65 40 30 31 59 38 41 -35 -25 -34 39 52 53 44 -32 60 86 -11 -38 49 72 -49 66 -51 -23 -31 -26 -40 -41 58 -58 -5 -13 74 70 -42 68 -45 67 -29 73 89 92 -46 -53 -48 -20 75 -30 78 -78 -67 90 93 91 -63 84 -1 -65 -6 -82 98 -7 -62 -24 -22 -71 -88 96 -85 -97 -8 -94
right_child=9 -3 4 20 43 63 88 -9 -10 10 18 21 -14 17 -16 26 -18 23 27 -21 69 24 81 35 37 -27 -28 46 42 32 33 -33 36 34 -36 -37 45 -39 54 55 62 -43 -44 64 61 -47 47 48 -50 50 -52 71 -54 -55 -56 -57 57 -59 -60 -61 79 82 -64 85 -66 76 -68 -69 -70 80 -72 -73 -74 -75 -76 -77 77 -79 -80 -81 87 -83 -84 95 -86 -87 94 -89 -90 -91 -92 -93 99 -95 -96 97 -98 -99 -100 -101
leaf_value=-0.024018922823176126 0.0043781726133493197 0.023818956417379539 0.018044287420160298 0.0065129825322093162 -0.022802911359763634 -0.022767497777490164 -0.022689714015790067 0.016267645951330897 -0.009315450541770489 -0.01790281939138667 -0.0047464691078732447 0.0023604670283571111 0.030853456331998215 0.012874779185886878 0.03752107374659238 -0.017442623327565666 0.014730476641349841 -0.019855651961541529 -0.00026187834144701536 0.044587104064084671 -0.015396483735313602 0.0047666549169888932 -0.022265334984736027 -0.0023769883431357455 0.0031976635430752695 0.0222417079520403 -0.0042434186547179202 0.0014615448859811612 -0.0063496955683688648 -0.0029638992518565693 3.3017904926788626e-05 0.038905316095488078 -0.0026944542057135098 -0.00056412648106000853 0.0036720996964659243 -0.0090576151920920573 0.00091196310500015788 0.0070553622920204104 0.0032849168007813784 -8.4598939007196508e-05 -0.012740021790498299 -0.00270950155557624 -0.010413324318433566 -0.017266286596062538 -0.013232560489088944 0.0035392336880275006 0.0040204205338453727 0.00052647543630042514 0.0029541314523053048 -0.0052846908569299271 0.00051221549734278685 0.00038920975848485376 -0.0065660103529551483 0.008112566845140631 -0.00085952854974808465 0.00208405381988069 -0.022222421295594898 0.010517015428596047 -0.021352498476206152 -0.00080189304279682308 -0.00096269397255979044 -0.0065183201674350504 -0.018690306751101764 -0.017466269043902891 -0.0092735524398715827 -0.0056360698776884467 0.0044167323106067014 0.0008256574660306129 -0.017886355101627369 -0.019204577649243756 -0.0091088720649133079 0.0025856074184074339 0.0063762069919627963 -0.0030903371521345427 -0.0070988463149430775 -0.003204820693009191 0.00070254567862097013 -0.0047780171912751362 -0.0013562387462542869 -0.003638153264584248 -0.017737248273707169 -0.01961819324947222 -0.0040944104401635434 -0.024817114377759474 -0.02470133897048914 -0.014608480445458065 -0.021562820078924461 -0.015923868777909394 -0.021441749393082868 -0.023565075950119415 -0.00013930075033666148 -0.021096213217641747 -0.014653003155244105 -0.019695941065096187 -0.021886245630545524 -0.024783944121516518 -0.024775287578556401 -0.024829265528555376 -0.02263674918828712 -0.014676161026212001
leaf_weight=55.242551237344742 604.35073347389698 13.839887678623198 6.3667464628815651 24.232642650604252 6.5704768188297775 3.7241591587662688 2.651810646057128 20.75701442360878 16.8162134885788 3.4031716957688323 7.2373051643371582 41.1066515147686 12.459254562854765 13.963035203516482 17.691711202263832 9.8264709860086423 67.030601866543293 10.786151319742201 9.6309980601072329 6.9952234625816327 1.1245159618556499 26.434003740549088 3.0937499664723864 30.282309785485268 12.427584856748583 22.964100122451782 42.346072934567928 21.178479194641113 4.3622749000787788 90.545503556728363 143.83637738227844 9.4201473295688611 39.619692325592041 74.67618727684021 102.05540025234222 27.94162255525589 189.5962700843811 23.961136758327484 13.576837182044981 44.612056255340576 3.1702957190573198 57.386174082756042 9.4432386159896833 2.5429184399545219 3.5862770192325177 40.521357893943787 29.529039829969406 91.16485184431076 129.14585208892822 12.399691343307493 37.056752443313599 24.414802730083466 17.353790760040283 14.532062441110609 27.44021674990654 126.93152225017548 5.2067006528377506 8.6538540422916412 4.5177944898605338 11.85813072323799 3.1184549406170827 3.0072062462568274 7.3710083961486816 1.2653769366443148 2.2476016506552696 11.787648499011995 12.66185489296913 10.470691651105879 2.6503113843500605 2.9429984986782074 20.607234641909599 17.60503301024437 12.334335923194883 14.2825920432806 5.4087025374174109 7.0594038963317871 8.4424810558557528 9.8466865718364698 8.1778573691844922 3.7521312683820724 1.6538087725639361 2.3292923420667648 2.3270726799964905 32.652944445610046 43.489915087819099 1.504875935614109 5.016092222183941 1.759948767721653 2.6120889112353325 4.2228382378816605 3.1830804497003555 0.82477315887808833 2.3860651403665543 4.1107515022158623 5.886235274374485 9.2049845457077026 3.4996452778577796 2.3514883667230579 1.0473283380270006 2.2029661387205124
leaf_count=1562 2268 29 51 120 35 31 64 59 72 37 29 98 18 24 25 37 240 14 42 12 21 29 81 93 21 23 155 54 30 173 227 12 39 103 80 49 237 14 34 52 40 36 34 38 54 27 52 109 96 19 73 33 27 23 49 84 94 57 84 28 25 30 25 29 15 39 28 30 39 61 210 19 21 41 24 43 30 22 24 19 36 55 21 944 1252 29 28 37 44 14 20 21 43 59 13 266 101 68 20 38
internal_value=0 -0.0134997 -0.0152366 -0.0187225 -0.00665261 -0.0018827 0.00310472 0.0067342 -0.00180163 0.00230598 0.000157309 0.00285358 0.00474617 0.00435152 0.00532356 0.00453629 0.00541174 -0.00433225 0.00182284 0.0195008 -0.00576205 0.00150349 -0.00195076 -0.0078138 0.0040755 0.00756728 -0.00672943 0.00122108 -0.00886631 0.000563653 0.00144413 0.00727765 -0.000362433 0.000481254 0.00188212 -0.00558302 0.000776926 0.00264062 -0.00242619 0.00210772 -0.0115793 -0.000749115 -0.00561976 -0.0202829 -0.00987583 0.0013746 0.00193129 0.00239107 0.00194956 0.00048417 -0.000941182 0.00264447 -0.00354324 0.00584694 0.000512302 0.00152007 0.000860524 -0.00178151 0.00213425 0.00165246 -0.00393598 -0.00895069 -0.0169008 -0.0206314 -0.0135163 -0.00215667 0.00256727 -0.00110559 -0.0218646 -0.0172703 -0.00972014 0.00130943 0.00471451 -0.0019512 -0.00527135 -0.00440594 -0.00310141 -0.00224813 -0.00388305 -0.00170051 -0.0186141 -0.0211241 -0.00546089 -0.0244787 -0.0243195 -0.0159138 -0.0221381 -0.0168024 -0.0221644 -0.0231913 -0.000546775 -0.0220193 -0.0148083 -0.0194909 -0.0217374 -0.0248082 -0.0248131 -0.0247932 -0.0226747 -0.0146641
internal_weight=0 311.203 297.363 211.481 85.8821 63.6188 50.2512 43.94 23.183 2521.69 512.142 2009.55 836.678 824.219 741.246 723.554 671.381 82.9731 432.342 14.2325 65.0399 1172.88 48.8588 69.0101 313.882 91.4179 52.1725 418.11 79.7996 858.993 440.339 62.3849 418.654 377.954 176.732 58.2239 269.737 222.464 148.916 198.503 43.4723 201.223 36.3273 22.2633 32.931 230.118 345.471 262.174 220.311 83.2968 49.4564 68.4538 107.899 26.9596 41.0171 171.544 42.611 13.8606 28.7504 52.9648 26.884 29.5278 10.5413 13.3676 4.79052 72.639 33.8403 34.3843 10.5973 16.1811 24.1935 42.0198 41.8634 23.9136 16.8304 11.4217 38.2547 18.2892 19.9655 10.0537 10.4675 6.24782 5.33428 146.442 98.7325 2.77025 17.4728 3.41376 6.31123 7.947 6.30154 3.91852 5.71355 7.05375 10.9023 47.7091 36.1526 11.5565 3.69914 4.58903
internal_count=11334 5610 5581 5000 581 452 310 182 123 5724 1333 4391 2923 2905 2725 2700 2508 180 721 41 807 1468 512 156 298 104 192 680 612 1170 584 138 586 446 183 142 303 194 283 180 417 263 195 129 352 264 452 278 205 174 92 81 200 44 83 136 355 151 204 126 161 315 65 142 53 228 82 113 84 295 264 52 73 83 97 73 115 52 63 64 193 157 51 4193 2814 58 76 73 128 45 45 102 102 120 41 1379 1045 334 84 81
cat_boundaries=0 1 2 3 4 5 6 7 8 9 10 11 12 13 14 15 16 17 18 19 20 21 22 23
cat_threshold=2 2 2 1 2 1 1 1 1 1 2 1 1 2 2 2 1 1 1 1 1 1 1
is_linear=0
shrinkage=0.05


Tree=81
num_leaves=97
num_cat=22
split_feature=2 3 3 2 3 2 0 3 1 0 2 2 2 2 3 3 3 3 2 3 0 2 3 3 2 2 3 2 2 2 1 2 3 3 3 3 2 0 2 0 1 2 2 2 2 2 2 2 3 3 2 3 2 2 1 2 2 3 0 2 3 3 3 3 2 1 2 1 1 2 3 2 0 3 2 2 2 0 2 0 1 3 2 3 2 3 2 2 1 2 2 3 1 0 0 1
split_gain=26.6194 7.71214 3.52591 6.30542 2.18643 2.30769 1.77541 1.33139 1.30575 1.12256 2.94848 1.96499 1.9344 3.14757 2.65292 3.25186 2.74132 6.80777 1.11277 1.07162 1.02461 0.611161 0.589291 2.43005 0.38984 0.274517 0.265869 0.931291 4.01984 0.375229 0.247382 0.292875 0.212999 0.209652 0.196701 0.186964 0.164314 0.155834 0.117771 0.113815 0.112491 0.0965505 0.0871392 0.0870146 0.10136 0.119143 0.0938773 0.119455 0.0731209 0.072837 0.0711987 0.0604869 0.0591662 0.0588434 0.0545277 1.34397 1.13961 0.0348958 0.03138 0.0313514 0.0309068 0.0308672 0.0301922 0.0280257 0.0260983 0.0226721 0.0217318 0.0264396 0.0214353 0.0204114 0.0186889 0.0180857 0.0142446 0.0147256 0.0102987 0.0102882 0.00860054 0.00668605 0.00341326 0.00314771 0.00464001 0.00298014 0.00224162 0.00189359 0.00112231 0.000946572 0.000513644 0.000406916 0.00036166 0.000196031 0.000167083 0.000115088 1.42177e-06 2.2674e-06 1.57732e-06 8.57988e-07
threshold=4.5000000000000009 28.500000000000004 1.0000000180025095e-35 1.0000000180025095e-35 2.5000000000000004 1.0000000180025095e-35 0 1.5000000000000002 1 2 42.500000000000007 47.500000000000007 93.500000000000014 92.500000000000014 18.500000000000004 17.500000000000004 9.5000000000000018 8.5000000000000018 2.5000000000000004 22.500000000000004 3 30.500000000000004 35.500000000000007 32.500000000000007 94.500000000000014 23.500000000000004 1.5000000000000002 120.50000000000001 117.50000000000001 155.50000000000003 4 208.50000000000003 2.5000000000000004 26.500000000000004 196.50000000000003 10.500000000000002 192.50000000000003 5 417.50000000000006 6 7 5.5000000000000009 490.00000000000006 154.50000000000003 193.50000000000003 334.50000000000006 118.50000000000001 124.50000000000001 25.500000000000004 8.5000000000000018 40.500000000000007 54.500000000000007 116.50000000000001 291.50000000000006 8 1.5000000000000002 1.5000000000000002 1.0000000180025095e-35 9 14.500000000000002 2.5000000000000004 1.5000000000000002 8.5000000000000018 1.5000000000000002 110.50000000000001 10 81.500000000000014 11 12 7.5000000000000009 29.500000000000004 176.50000000000003 13 7.5000000000000009 37.500000000000007 27.500000000000004 36.500000000000007 14 1.5000000000000002 15 16 4.5000000000000009 2.5000000000000004 3.5000000000000004 3.5000000000000004 1.5000000000000002 3.5000000000000004 28.500000000000004 17 3.5000000000000004 3.5000000000000004 8.5000000000000018 18 19 20 21
decision_type=2 2 2 2 2 2 9 2 1 9 2 2 2 2 2 2 2 2 2 2 9 2 2 2 2 2 2 2 2 2 1 2 2 2 2 2 2 9 2 9 1 2 2 2 2 2 2 2 2 2 2 2 2 2 1 2 2 2 9 2 2 2 2 2 2 1 2 1 1 2 2 2 9 2 2 2 2 9 2 9 1 2 2 2 2 2 2 2 1 2 2 2 1 9 9 1
left_child=1 2 3 79 5 6 7 8 -4 12 25 -12 13 14 15 16 17 -2 20 26 54 -16 23 48 63 37 27 28 57 35 38 -32 -31 -23 36 49 51 41 -29 61 83 -11 -34 46 71 -46 64 -48 -21 -28 -18 -24 -37 -38 56 -56 -5 -14 65 -39 69 74 -42 66 -26 -7 67 -13 89 -43 -50 -45 73 -65 75 -27 87 90 88 80 -1 -62 -60 -6 -79 95 -67 -63 -22 -20 -70 -85 93 -81 -94 -8
right_child=9 -3 4 18 40 58 85 -9 -10 10 11 24 19 -15 21 -17 50 -19 68 22 78 33 34 -25 43 39 29 30 -30 32 31 -33 42 -35 -36 52 53 59 -40 -41 62 60 -44 44 45 -47 47 -49 70 -51 -52 -53 -54 -55 55 -57 -58 -59 82 -61 81 76 -64 72 -66 86 -68 -69 77 -71 -72 -73 -74 -75 -76 -77 -78 84 -80 92 -82 -83 -84 91 -86 -87 -88 -89 -90 -91 -92 -93 94 -95 -96 -97
leaf_value=-0.023999221688502728 0.0044030823100335553 0.022673897523520354 0.017277599968499795 0.0063095148921413283 -0.022756174146148739 -0.017761054328103303 -0.022640611529102059 0.015604503769566382 -0.0091702574530195483 -0.01777769996172146 0.020753870556634434 -0.0027763850447131509 0.0022963622125778266 0.02916168347961411 -0.017309361739494575 0.035668231924662681 -0.012847888841524817 0.03522496850233011 -0.014954819382607962 0.0046259171763088384 -0.022207607985899436 -0.008935264094157477 0.0031081860565316385 0.021206325785289235 0.0014231477703924873 -0.0062319826102597078 -0.0028989963625251809 3.2197010446697486e-05 0.036473316350891051 -0.0026347325565179414 -0.00055043401592696454 0.0035676317370325916 0.00088849875662945488 0.00017079080596487078 0.006831196641707925 0.003192715530068291 -8.2505457476891625e-05 -0.012585019288011616 -0.0026494866824022818 -0.010262422284648085 -0.01713456829773782 -0.013078086402282186 0.003439008385789942 0.0039046655016741413 0.00051312978302296306 0.0028721768291127751 -0.0051811306100319789 0.00049923847386367296 0.00037939649075985739 -0.0064456990446043029 -0.0077317204380816171 0.0078464052865124187 -0.00083891695770885427 0.0020280234268578463 -0.022163841846669773 0.010147227800394183 -0.02127746201330161 -0.0007826179635688819 -0.017336535430332572 -0.018574489125818813 -0.0063985739005742309 -0.00093970672021442044 -0.0091286245641059149 -0.0019822956908874664 0.0042878453510535866 -0.022720017702379268 0.0014550904346552198 0.00053196718977737193 -0.019095514527144877 -0.0089650228374699419 0.0025148149698229105 0.0061778674231199376 -0.0050988245535421731 -0.0044394079287790695 -0.0069725328442224871 -0.0031354070080588953 -0.0035609163294618505 -0.017610333377860714 -0.019514952176566517 -0.024816808128324399 -0.024698140411125988 -0.0040093393774239339 -0.014458074069848479 -0.021491621819290832 -0.015780924620323208 -0.02136833106619522 -0.02353493134836648 -0.00013586115380837533 -0.021016623571151201 -0.014364716710064796 -0.019593831605530548 -0.021821124177401004 -0.024782806930780232 -0.024773932376698046 -0.024829263686707265 -0.02258655265262792
leaf_weight=53.931494101881981 726.85110870748758 14.173496901988981 6.4826725423336029 24.39098417758942 6.4223460443317917 2.6033284068107605 2.5923194885253897 21.097444169223309 16.660290241241459 3.3427874222397795 13.220337271690367 18.622230425477028 41.203796952962875 12.84965720772743 13.183897897601126 8.4678304567933065 9.1619672849774343 18.368133828043938 2.8052009083330631 26.56030610203743 3.0256278254091731 11.765979349613191 12.467387586832048 23.480583250522614 21.209455192089081 4.3346635252237373 90.277533739805222 143.84112673997879 9.7938640713691694 39.513082385063171 74.634072959423065 102.43084752559662 189.76925355195999 13.658426433801649 24.130788743495941 13.621509462594984 44.608282506465912 3.1301622800528985 57.230896830558777 9.3454133123159391 2.499388579279187 3.5391339994967046 40.665026783943176 29.647997796535492 91.212860345840454 129.52792996168137 12.334335654973982 37.075738608837128 24.424306988716125 17.240218937397003 26.380059882998466 14.650434225797651 27.416641145944595 127.19632971286774 5.0922714695334408 8.7453469187021255 4.4223509877920142 11.848625332117079 1.2434674128890031 7.2345213443040848 2.9876680225133887 3.1154542788863164 2.2268547713756561 24.418818280100822 12.717902719974516 3.6403273716568929 6.7866311967372885 8.9374774098396319 2.8870186209678632 20.420378301292658 17.650611788034439 12.413233399391173 6.8872968405485144 8.1270993202924711 5.3704430162906638 7.0368159711360931 3.7385052144527435 1.6247333586215973 2.2840411439538002 31.8525670170784 42.42881266772747 2.3175641372799873 1.4830518141388891 4.9090888276696187 1.732145644724369 2.556677334010601 4.1244900971651077 3.1826371103525162 0.80755582451820407 2.8243621177971363 4.0305788069963455 5.7588072270154953 8.9796526506543159 3.4140056557953349 2.2938216477632496 1.0238865017890932
leaf_count=1562 2700 29 51 120 35 39 64 59 72 37 35 67 98 18 17 8 31 25 52 29 81 23 21 23 54 30 173 227 12 39 103 80 237 32 14 34 52 40 36 34 38 54 27 52 109 96 19 73 33 27 69 23 49 84 94 57 84 28 29 25 30 25 15 80 28 31 20 26 61 210 19 21 21 20 24 43 19 36 55 944 1252 21 29 28 37 44 14 20 21 50 59 13 266 101 68 20
internal_value=0 -0.0133472 -0.0150903 -0.0186075 -0.00653381 -0.00184267 0.00301491 0.00651985 -0.00176184 0.00224282 0.000152743 0.0017738 0.00277405 0.00460513 0.00422396 0.00485 0.00451576 0.00516278 -0.00565365 0.00146357 -0.00190824 -0.0085734 0.0039575 0.00732184 0.00117625 -0.00872435 0.000549065 0.00140575 0.00704195 -0.00035364 0.000469018 0.00183184 0.000757002 -0.00404334 0.0025681 -0.00237184 0.00205095 -0.0114251 -0.000731088 -0.00551162 -0.0201898 -0.00972751 0.00133859 0.0018796 0.00232602 0.00189739 0.000471822 -0.000918763 0.00257186 -0.0034677 -0.00905056 0.00566801 0.000499275 0.00148003 0.000836455 -0.00174331 0.00207539 0.00160871 -0.0205439 -0.0167657 -0.00880797 -0.00385365 -0.0133624 -0.00212355 0.002497 -0.0217991 -0.00107938 -0.0017035 -0.0171386 -0.00957258 0.00127521 0.00457554 -0.00303303 -0.00259587 -0.00516801 -0.00431578 -0.00166117 -0.0184973 -0.021045 -0.0244701 -0.024307 -0.00535485 -0.0157708 -0.0220779 -0.0166664 -0.0221047 -0.0231529 -0.000533497 -0.0219567 -0.0146588 -0.0193859 -0.0216695 -0.0248077 -0.0248127 -0.0247923 -0.0226253
internal_weight=0 307.071 292.897 207.573 85.3244 63.508 50.4133 44.2404 23.143 2527.58 512.235 433.139 2015.34 840.687 827.837 789.229 780.761 745.219 64.6722 1174.66 48.7682 38.6083 315.169 92.1158 419.919 79.0961 859.486 440.983 62.8463 418.503 378.137 177.065 269.947 25.4244 223.053 148.556 198.922 42.9722 201.072 36.1239 21.8165 32.6075 230.434 346.139 262.802 220.741 83.3374 49.4101 68.6352 107.518 35.542 27.1178 41.0382 171.805 42.651 13.8376 28.8133 53.0524 13.0947 10.3647 29.2647 26.7785 4.72624 73.7796 33.9274 10.3681 34.3463 27.5597 15.904 23.9595 42.0749 42.0612 39.4332 32.5459 16.7419 11.3715 10.0366 10.2745 6.11722 142.9 96.3603 5.30523 2.72652 17.0902 3.35688 6.17288 7.76482 6.29809 3.83318 5.62956 6.9176 10.6679 46.54 35.2666 11.2735 3.61621
internal_count=11334 5610 5581 5000 581 452 310 182 123 5724 1333 721 4391 2923 2905 2833 2825 2725 807 1468 512 72 298 104 686 612 1170 584 138 586 446 183 303 55 194 283 180 417 263 195 129 352 264 452 278 205 174 92 81 200 100 44 83 136 355 151 204 126 142 65 315 161 53 234 82 84 113 93 295 264 52 73 121 100 97 73 64 193 157 4193 2814 51 58 76 73 128 45 45 102 102 120 41 1379 1045 334 84
cat_boundaries=0 1 2 3 4 5 6 7 8 9 10 11 12 13 14 15 16 17 18 19 20 21 22
cat_threshold=2 2 2 2 1 1 1 1 1 2 2 1 2 1 2 2 1 1 1 1 1 1
is_linear=0
shrinkage=0.05


Tree=82
num_leaves=100
num_cat=23
split_feature=2 3 3 2 3 2 0 3 1 2 0 2 2 2 3 3 3 3 2 0 3 0 2 3 3 2 2 3 2 2 2 1 2 3 3 3 3 2 0 1 2 0 2 2 2 2 2 2 2 3 2 3 3 2 2 1 2 2 3 0 2 3 3 3 3 2 1 1 2 1 2 3 2 3 2 2 2 2 2 0 2 0 1 3 2 3 2 3 2 2 1 0 2 3 1 0 0 1 2
split_gain=25.5962 7.37766 3.49159 6.29852 2.13987 2.23796 1.71029 1.24041 1.23371 1.08486 1.06182 2.82355 1.82245 2.87895 2.52188 2.95274 2.60551 6.18294 1.58811 3.03803 1.0128 0.996489 0.599096 0.552301 2.23856 0.362128 0.26794 0.252318 0.87695 3.64994 0.357552 0.234867 0.277143 0.202668 0.201983 0.184884 0.178758 0.15479 0.153994 0.113159 0.112378 0.110411 0.0952585 0.0823882 0.0823608 0.0955281 0.112693 0.0890897 0.114248 0.0701733 0.0697723 0.0689379 0.0565549 0.0561009 0.0557635 0.0518389 1.2963 1.0983 0.0330798 0.0316455 0.0312946 0.0301069 0.0298869 0.0296736 0.0264311 0.0246118 0.0229696 0.0214475 0.020694 0.0252439 0.0200427 0.0176971 0.0169436 0.0101548 0.0522741 0.0340419 0.00995852 0.00992056 0.00822678 0.00671852 0.00345738 0.00322392 0.00474962 0.0028797 0.00223676 0.00192575 0.00112268 0.000962254 0.00052389 0.000387594 0.000367314 0.00019602 0.000168491 0.000116865 1.45759e-06 2.32395e-06 1.61709e-06 8.7377e-07 3.946e-07
threshold=4.5000000000000009 28.500000000000004 1.0000000180025095e-35 1.0000000180025095e-35 2.5000000000000004 1.0000000180025095e-35 0 1.5000000000000002 1 2.5000000000000004 2 42.500000000000007 93.500000000000014 92.500000000000014 18.500000000000004 17.500000000000004 9.5000000000000018 8.5000000000000018 48.500000000000007 3 22.500000000000004 4 30.500000000000004 35.500000000000007 32.500000000000007 94.500000000000014 23.500000000000004 1.5000000000000002 120.50000000000001 117.50000000000001 155.50000000000003 5 208.50000000000003 2.5000000000000004 26.500000000000004 196.50000000000003 10.500000000000002 192.50000000000003 6 7 417.50000000000006 8 5.5000000000000009 490.00000000000006 154.50000000000003 193.50000000000003 334.50000000000006 118.50000000000001 124.50000000000001 8.5000000000000018 40.500000000000007 25.500000000000004 54.500000000000007 116.50000000000001 291.50000000000006 9 1.5000000000000002 1.5000000000000002 1.0000000180025095e-35 10 14.500000000000002 2.5000000000000004 8.5000000000000018 1.5000000000000002 1.5000000000000002 110.50000000000001 11 12 81.500000000000014 13 7.5000000000000009 29.500000000000004 176.50000000000003 4.5000000000000009 73.500000000000014 69.500000000000014 37.500000000000007 27.500000000000004 36.500000000000007 14 1.5000000000000002 15 16 4.5000000000000009 2.5000000000000004 3.5000000000000004 3.5000000000000004 1.5000000000000002 3.5000000000000004 28.500000000000004 17 18 3.5000000000000004 8.5000000000000018 19 20 21 22 3.5000000000000004
decision_type=2 2 2 2 2 2 9 2 1 2 9 2 2 2 2 2 2 2 2 9 2 9 2 2 2 2 2 2 2 2 2 1 2 2 2 2 2 2 9 1 2 9 2 2 2 2 2 2 2 2 2 2 2 2 2 1 2 2 2 9 2 2 2 2 2 2 1 1 2 1 2 2 2 2 2 2 2 2 2 9 2 9 1 2 2 2 2 2 2 2 1 9 2 2 1 9 9 1 2
left_child=1 2 3 81 5 6 7 8 -4 21 12 26 13 14 15 16 17 -2 19 -13 27 55 -16 24 51 64 38 28 29 58 36 40 -33 -32 -24 37 49 52 42 85 -30 63 -12 -35 47 72 -47 65 -49 -29 -18 -22 -25 -38 -39 57 -57 -5 -14 66 -40 70 -41 76 68 -27 88 79 69 -20 -44 -53 -46 75 -75 -66 77 -28 89 92 90 82 -1 -63 -61 -6 -81 97 -7 -65 -23 -69 -11 -87 95 -83 -96 -8 -93
right_child=10 -3 4 9 39 59 87 -9 -10 67 11 18 20 -15 22 -17 50 -19 25 -21 23 80 34 35 -26 44 41 30 31 -31 33 32 -34 43 -36 -37 53 54 60 62 -42 -43 61 -45 45 46 -48 48 -50 -51 -52 71 -54 -55 -56 56 -58 -59 -60 84 -62 83 -64 78 73 -67 -68 91 -70 -71 -72 -73 -74 74 -76 -77 -78 -79 -80 86 -82 94 -84 -85 -86 93 -88 -89 -90 -91 -92 98 -94 -95 96 -97 -98 -99 -100
leaf_value=-0.02397906033374694 0.0042746527420351264 0.021608936244115556 0.016556342142468445 0.0061136620734743687 -0.022708458170366475 -0.022671546686072304 -0.022590493877292884 0.014978451503655611 -0.0090259998700614949 -0.018984973289837857 -0.017651218195552487 -0.0050154826887838337 0.0022341433830787606 0.027609952412770745 -0.017178063954776421 0.033548423987177424 -0.012692960309992172 0.033146384538440446 -0.0027150727063448774 0.040307723782651253 0.0044899746105629759 -0.022148735764115163 -0.0087926103992284326 0.0030214860344225645 0.020240358918877908 0.001385813256624457 -0.0061157227890934005 -0.0028353283931951425 3.139662039312741e-05 0.034277693324958884 -0.0025761788019591806 -0.0005370664585858621 0.0034665025783159904 0.000865658714045154 0.00016652145122097092 0.0066156548864288196 0.0031033920552958586 -8.0463627192574696e-05 -0.012429951485732874 -0.017001587001602907 -0.0025906437338481573 -0.010112161384183213 -0.012923394186619567 0.0033419604971871766 0.0037926879057973862 0.00050012918893335939 0.0027927275051807137 -0.0050790666945030212 0.00048659666400553903 -0.0063268215627576979 -0.0075990144681409343 0.00036983414389383699 0.0075910218028377944 -0.00081878263786851809 0.0019736113997988708 -0.022104106782445388 0.0097941069158679478 -0.021201079419776923 -0.00076379119210080596 -0.017205504785350094 -0.018457224087384882 -0.0062802656066057814 -0.0089846432327496863 -0.00091724695906243877 -0.0054790848771730542 0.004163262926442886 -0.017634394221565149 -0.015109183645358643 0.0014168720638129703 0.00051847934422603371 -0.0088221601670616188 0.0024461360407894775 0.0059869000216356697 0.00077256727659370133 -0.0046041464042523269 -0.001269064585250244 -0.006847591367910493 -0.0030672811605311746 -0.003485046549695859 -0.017482078304651032 -0.019410225420119814 -0.024816494494452584 -0.024694862622974743 -0.0039256978261174988 -0.01430703731568982 -0.021419113771042136 -0.015637001764186167 -0.021293581011294083 -0.02350410917572858 -0.00013250607160417255 -0.020935645913266354 -0.014347202201039697 -0.019490238920126333 -0.021754762931522509 -0.02478163869789976 -0.024772546326044941 -0.024829264926695793 -0.022535320062381167 -0.014376982515435482
leaf_weight=52.652586407959461 730.05855274200439 14.498536154627798 6.5956511199474335 24.545366764068607 6.2778482213616398 3.5585515946149817 2.5342872142791739 21.429241426289082 16.508208990097049 2.8324126526713362 3.2838855087757102 7.3355668783187866 41.298524498939514 13.229892164468763 12.957656577229498 8.7753140255808812 9.0450083166360837 19.026681251823902 18.570599526166916 7.4547965526580793 26.683456599712372 2.959176465868949 11.661315709352495 12.50619873404503 23.983837187290192 21.239660948514938 4.3077339828014427 90.016197919845581 143.84575805068016 10.157673031091688 39.409112691879272 74.593002557754517 102.79693567752838 189.93793845176697 13.660759299993513 24.296195149421692 13.665068477392195 44.604601800441742 3.0910159982740861 2.456927407532933 57.079465389251709 9.2499971836805326 3.4931502379477086 40.805115222930908 29.76398977637291 91.259676396846771 129.90049189329147 12.270595163106917 37.094252914190292 17.129450857639313 26.176883459091187 24.433575421571732 14.765839666128157 27.393650710582733 127.4545487165451 4.9806486070156071 8.8345397114753723 4.3292484730482093 11.839356124401091 1.2220958061516278 7.1013841480016708 2.9686122238636008 2.20661910623312 3.1125280261039716 11.692017525434496 12.772552341222761 2.5574987418949595 1.0912781953811646 6.7965136766433707 8.9422330558300036 20.238127272576094 17.695055693387985 12.49015814065933 8.4193906188011187 9.7620369493961316 8.1475988328456861 5.3331276029348365 7.0147873014211655 3.7252164036035538 1.596371814608573 2.2399002499878407 31.071816146373749 41.393735721707344 2.3082908615469933 1.461764011532068 4.8047102354466897 1.7050252221524715 2.5026249438524246 4.0285537391901016 3.1822047680616379 0.79076085984706912 2.3164544217288485 3.9523728117346764 5.6345043703913689 8.7598471567034721 3.3304662853479376 2.2375689595937702 1.0010197013616564 2.1399101130664349
leaf_count=1562 2700 29 51 120 35 31 64 59 72 61 37 29 98 18 17 8 31 25 67 12 29 81 23 21 23 54 30 173 227 12 39 103 80 237 32 14 34 52 40 38 36 34 54 27 52 109 96 19 73 27 69 33 23 49 84 94 57 84 28 29 25 30 15 25 39 28 39 21 20 26 210 19 21 30 22 24 24 43 19 36 55 944 1252 21 29 28 37 44 14 20 21 43 59 13 266 101 68 20 38
internal_value=0 -0.0131944 -0.0149432 -0.0184911 -0.00641635 -0.00180334 0.00292805 0.00631381 -0.0017228 -0.00554669 0.00218162 0.000148516 0.00269702 0.00446904 0.00410079 0.0047058 0.00438309 0.00500799 0.00172642 0.0178288 0.00142479 -0.00186655 -0.00843386 0.00384339 0.0070862 0.00115819 -0.00858343 0.000534878 0.00136848 0.00681573 -0.000345056 0.000457101 0.00178299 0.000737605 -0.00395934 0.00249776 -0.00231857 0.00199583 -0.0112712 -0.0200952 -0.000713481 -0.00540498 -0.00957998 0.00130357 0.00182939 0.0022629 0.00184671 0.000459796 -0.000896857 -0.00339352 -0.00890714 0.00250143 0.00549556 0.000486587 0.00144111 0.000813098 -0.00170583 0.00201829 0.00156619 -0.020455 -0.0166294 -0.00866627 -0.0132083 -0.00377272 -0.00205995 0.00242882 -0.0217323 -0.0170057 -0.00105378 -0.0016641 -0.00942585 0.00124193 0.00444129 -0.0029679 -0.00211432 -0.00375014 -0.00506617 -0.00422708 -0.00162268 -0.0183791 -0.0209645 -0.0244612 -0.0242941 -0.0052503 -0.0156269 -0.0220164 -0.0165292 -0.0220438 -0.0231136 -0.000520533 -0.0218929 -0.0145086 -0.0192793 -0.0216003 -0.0248072 -0.0248122 -0.0247913 -0.0225749 -0.0143615
internal_weight=0 303.038 288.54 203.759 84.7801 63.3995 50.571 44.5331 23.1039 64.3135 2533.3 512.322 2020.98 844.592 831.362 793.082 784.307 749.085 433.912 14.7904 1176.39 48.6796 38.2797 316.423 92.7959 419.122 78.4101 859.967 441.611 63.2956 418.357 378.315 177.39 270.152 25.3221 223.627 148.204 199.331 42.4845 21.3806 200.925 35.9256 32.2921 230.743 346.791 263.414 221.16 83.3771 49.3648 107.146 35.2219 68.8121 27.272 41.0587 172.059 42.6898 13.8152 28.8746 53.1379 12.8285 10.1924 29.0082 4.66355 26.6756 72.3304 34.0122 10.1446 15.6338 34.3093 27.5128 23.7313 42.1286 42.2541 38.021 18.1814 19.8396 16.6556 11.3225 10.0199 10.0862 5.98984 139.446 94.0463 5.2769 2.68386 16.7171 3.3014 6.03793 7.58711 6.29473 3.74994 5.54764 6.78479 10.4392 45.3997 34.4023 10.9974 3.53531 4.45636
internal_count=11334 5610 5581 5000 581 452 310 182 123 807 5724 1333 4391 2923 2905 2833 2825 2725 721 41 1468 512 72 298 104 680 612 1170 584 138 586 446 183 303 55 194 283 180 417 129 263 195 352 264 452 278 205 174 92 200 100 81 44 83 136 355 151 204 126 142 65 315 53 161 228 82 84 295 113 93 264 52 73 115 52 63 97 73 64 193 157 4193 2814 51 58 76 73 128 45 45 102 102 120 41 1379 1045 334 84 81
cat_boundaries=0 1 2 3 4 5 6 7 8 9 10 11 12 13 14 15 16 17 18 19 20 21 22 23
cat_threshold=2 2 2 1 2 1 1 1 1 1 2 1 1 1 2 2 1 1 1 1 1 1 1
is_linear=0
shrinkage=0.05


Tree=83
num_leaves=99
num_cat=22
split_feature=2 3 3 2 3 2 0 3 1 2 0 2 2 2 3 3 3 3 2 0 0 3 2 3 3 2 2 3 2 2 2 1 2 3 3 3 3 0 2 1 2 0 2 2 2 2 2 2 2 2 3 3 3 3 2 1 2 2 0 3 2 3 3 3 3 1 2 1 2 1 2 3 2 3 2 2 2 2 2 0 2 0 1 3 2 3 2 3 2 1 2 2 2 3 1 0 0 1
split_gain=24.6105 7.06314 3.45631 6.29017 2.0938 2.17026 1.64795 1.15658 1.16629 1.05735 1.00466 2.70355 1.71745 2.63816 2.39765 2.68775 2.47679 5.62915 1.4769 2.73695 0.969047 0.957375 0.587059 0.517868 2.06485 0.344055 0.261415 0.239475 0.826057 3.3225 0.340692 0.222996 0.262293 0.194551 0.192837 0.173837 0.170892 0.152108 0.145858 0.113795 0.107224 0.107073 0.0939446 0.0779658 0.0900547 0.106608 0.0845512 0.109256 0.0779085 0.0683447 0.0675894 0.0650101 0.05485 0.0529062 0.0528496 0.0492847 1.25064 1.05867 0.0319037 0.031361 0.031225 0.0295719 0.029316 0.0285198 0.0252916 0.0232657 0.0232153 0.0214512 0.0197053 0.0241001 0.0196717 0.0167598 0.0158808 0.00974341 0.0500118 0.0327194 0.00962648 0.00956343 0.00786825 0.00674868 0.00350119 0.00330195 0.00486162 0.00278178 0.00223095 0.00195809 0.00112259 0.000978016 0.000534272 0.00037298 0.000369174 0.000198271 0.000169855 0.000118644 1.49441e-06 2.3825e-06 1.65748e-06 8.89683e-07
threshold=4.5000000000000009 28.500000000000004 1.0000000180025095e-35 1.0000000180025095e-35 2.5000000000000004 1.0000000180025095e-35 0 1.5000000000000002 1 2.5000000000000004 2 42.500000000000007 93.500000000000014 92.500000000000014 18.500000000000004 17.500000000000004 9.5000000000000018 8.5000000000000018 48.500000000000007 3 4 22.500000000000004 30.500000000000004 35.500000000000007 32.500000000000007 94.500000000000014 23.500000000000004 1.5000000000000002 120.50000000000001 117.50000000000001 155.50000000000003 5 208.50000000000003 26.500000000000004 2.5000000000000004 196.50000000000003 10.500000000000002 6 192.50000000000003 7 417.50000000000006 8 5.5000000000000009 154.50000000000003 193.50000000000003 334.50000000000006 118.50000000000001 124.50000000000001 490.00000000000006 40.500000000000007 8.5000000000000018 25.500000000000004 15.500000000000002 54.500000000000007 291.50000000000006 9 1.5000000000000002 1.5000000000000002 10 1.0000000180025095e-35 14.500000000000002 8.5000000000000018 2.5000000000000004 1.5000000000000002 1.5000000000000002 11 110.50000000000001 12 81.500000000000014 13 7.5000000000000009 29.500000000000004 176.50000000000003 4.5000000000000009 73.500000000000014 69.500000000000014 37.500000000000007 27.500000000000004 36.500000000000007 14 1.5000000000000002 15 16 4.5000000000000009 2.5000000000000004 3.5000000000000004 3.5000000000000004 1.5000000000000002 3.5000000000000004 17 28.500000000000004 3.5000000000000004 3.5000000000000004 8.5000000000000018 18 19 20 21
decision_type=2 2 2 2 2 2 9 2 1 2 9 2 2 2 2 2 2 2 2 9 9 2 2 2 2 2 2 2 2 2 2 1 2 2 2 2 2 9 2 1 2 9 2 2 2 2 2 2 2 2 2 2 2 2 2 1 2 2 9 2 2 2 2 2 2 1 2 1 2 1 2 2 2 2 2 2 2 2 2 9 2 9 1 2 2 2 2 2 2 1 2 2 2 2 1 9 9 1
left_child=1 2 3 81 5 6 7 8 -4 20 12 26 13 14 15 16 17 -2 19 -13 55 27 -16 24 51 64 37 28 29 59 36 40 -33 -24 -32 38 50 42 53 85 -30 63 -12 46 72 -46 66 -48 -36 -18 -29 -23 -38 -25 -40 57 -57 -5 65 -14 -39 -41 70 76 68 88 -27 91 69 -20 -44 -53 -45 75 -75 -66 77 -28 90 92 89 82 -1 -64 -60 -6 -81 97 -7 -22 -65 -11 -69 -87 95 -83 -96 -8
right_child=10 -3 4 9 39 58 87 -9 -10 67 11 18 21 -15 22 -17 49 -19 25 -21 80 23 33 35 -26 43 41 30 31 -31 34 32 -34 -35 48 -37 52 60 54 61 -42 -43 62 44 45 -47 47 -49 -50 -51 -52 71 -54 -55 -56 56 -58 -59 84 -61 -62 -63 83 78 73 -67 -68 79 -70 -71 -72 -73 -74 74 -76 -77 -78 -79 -80 86 -82 94 -84 -85 -86 93 -88 -89 -90 -91 -92 -93 -94 -95 96 -97 -98 -99
leaf_value=-0.023958426387447541 0.0041505089788304531 0.020616220248581743 -0.0088827145606721943 0.0059250657835938428 -0.022659745927514303 -0.022622069840453295 -0.022539344883775087 0.014386639167894051 0.015876790093805156 -0.01465994347226573 -0.017523392071784116 -0.0049158573957393337 0.0021737473494081575 0.026181912865170867 -0.017045495789538356 0.031622431470989122 -0.012537932898789196 0.031256201146681782 -0.0026549494389149528 0.03773441067926487 -0.022088701544838527 0.0043586269559786001 -0.0086509846687969332 0.00293746239159603 0.019337303646405127 0.0013495092087931135 -0.006000925284103494 -0.0027728798328937967 3.06160424953814e-05 0.032285973000507978 -0.0025187769444861337 -0.00052401640797918459 0.0033685850560480702 0.00016235936932394303 0.00084342529036001616 0.0064083125995619307 0.0021323678693508917 -0.012274866753806636 -7.8472207387523336e-05 -0.016867366232131639 -0.0025329566895232361 -0.0099625845400244072 -0.012768531322359361 0.0036843393332017041 0.00048746440382425101 0.0027156944023519008 -0.0049784990445537461 0.00047428105513488549 0.0032479705269856012 -0.0074675828434363663 -0.0062093888135913789 0.00036051637037469398 -0.0015389314529200924 0.0073458503849800801 0.0019207650869082521 -0.022043198512715551 0.0094566563868844593 -0.0211233361415024 -0.017073199226644825 -0.00074540317258919061 -0.018338521729527404 -0.008841643436717209 -0.0061634063185551325 -0.0008953036991694584 -0.0053727726704436993 -0.0175063920538043 0.0040428104108355704 -0.018872960102246931 0.0013797109807430104 0.0005053404402184941 -0.0086803181660690901 0.002379498167966663 0.0058029577881963407 0.00075279574441919155 -0.0045108123930145778 -0.0012391461897474857 -0.0067240376048397794 -0.0030004285917438235 -0.0034105312604607238 -0.017352505243763302 -0.019304013342386041 -0.024816176380126204 -0.024691500934257482 -0.0038434753377323753 -0.014155413417818775 -0.021345283264303423 -0.015492132279897068 -0.021217486640562576 -0.023472592510342102 -0.020853271229852456 -0.00012923338551998844 -0.014057760190661163 -0.019385158901113884 -0.021687145022270992 -0.024780444450230421 -0.024771123337625749 -0.024829263888132919 -0.022483039640769295
leaf_weight=51.405048422515392 733.18597996979952 14.815243437886236 16.359876394271851 24.695886969566349 6.1368946656584766 3.4787813052535048 2.4776780605316153 21.752632960677147 6.7057600915432003 2.7238598205149174 3.2264294959604767 7.2988675534725189 41.390894532203674 13.600258260965346 12.736970260739325 9.0747057572007161 8.9309259206056577 19.667915590107441 18.520247429609299 7.7614206373691541 2.8943551518023005 26.803534120321274 11.559231698513033 12.544043362140657 24.474225103855133 21.269115328788757 4.2814695164561325 89.761333644390106 143.85027438402176 10.511890798807142 39.307718992233276 74.552952885627747 103.15390008687973 13.663034498691557 190.10243093967438 24.457463443279266 22.525571286678314 3.0528326109051687 44.60101318359375 2.4155088402330902 56.931784152984619 9.156931057572363 3.448297366499907 29.877089589834213 91.305329084396362 130.2637757062912 12.208429872989653 37.112306982278824 40.941712379455566 25.97871869802475 17.02141797542572 24.442613333463669 18.553201228380203 14.878354072570799 127.70634293556213 4.8717637807130787 8.9214910268783569 4.2384299933910361 1.2012488842010491 11.830316931009291 6.9715145081281662 2.1868821978569031 2.9500270038843146 3.1096743643283826 11.628131002187731 2.5127940997481337 12.825838476419447 2.7791465073823911 6.8061501979827872 8.9468705952167529 20.060368448495865 17.738393247127533 12.565159916877745 8.4258976876735705 9.7171942889690381 8.1372655332088453 5.2967333346605292 6.9933038651943207 3.7122564166784286 1.5687064379453659 2.1968424841761589 30.310210049152374 40.384040609002113 2.2992469891905785 1.4409993961453436 4.7028919346630556 1.6785710975527763 2.449898399412632 3.9349704086780548 0.77437786012887988 3.181783139705658 2.743875827640295 3.8760860413312912 5.5132508277893066 8.5454313158988953 3.2489756196737281 2.1826958507299397 0.97871363162994418
leaf_count=1562 2700 29 72 120 35 31 64 59 51 52 37 29 98 18 17 8 31 25 67 12 81 29 23 21 23 54 30 173 227 12 39 103 80 32 237 14 46 40 52 38 36 34 54 52 109 96 19 73 27 69 27 33 37 23 84 94 57 84 29 28 25 15 30 25 39 39 28 61 20 26 210 19 21 30 22 24 24 43 19 36 55 944 1252 21 29 28 37 44 14 21 20 50 59 13 266 101 68 20
internal_value=0 -0.0130414 -0.0147954 -0.0183732 -0.00630022 -0.00176473 0.00284404 0.00611566 -0.0016845 -0.00544116 0.00212221 0.000144237 0.00262236 0.00433761 0.00398173 0.00456659 0.00425491 0.00485863 0.00168018 0.0170642 -0.00182568 0.00138711 -0.00829544 0.00373302 0.00685984 0.00112802 -0.00844359 0.000521078 0.00133226 0.00659848 -0.000336675 0.000445493 0.00173553 -0.00387675 0.00071872 0.00242952 -0.00226637 -0.0111176 0.0019423 -0.0199991 -0.000696285 -0.00529982 -0.00943328 0.00178062 0.00220164 0.00179747 0.000448085 -0.000875453 0.00126952 -0.00876473 -0.00332067 0.00243311 0.000474228 0.00532929 0.00140327 0.000790431 -0.00166906 0.00196289 -0.0203646 0.00152486 -0.0164919 -0.0130538 -0.00852562 -0.00369318 -0.00201307 -0.0216642 0.00236268 -0.0168715 -0.00102875 -0.00162555 -0.00927999 0.00120956 0.00431156 -0.00290299 -0.00206632 -0.00367099 -0.00496582 -0.00413983 -0.00158502 -0.0182595 -0.0208826 -0.024452 -0.024281 -0.00514725 -0.0154819 -0.0219538 -0.0163908 -0.0219817 -0.0230735 -0.0218279 -0.000507878 -0.0143577 -0.0191713 -0.0215298 -0.0248066 -0.0248118 -0.0247904 -0.0225234
internal_weight=0 299.104 284.289 200.04 84.2488 63.2934 50.7246 44.8183 23.0656 63.9634 2538.89 512.41 2026.48 848.398 834.797 796.838 787.764 752.854 434.669 15.0603 48.5931 1178.08 37.9592 317.646 93.4588 419.609 77.7409 860.435 442.222 63.7331 418.213 378.489 177.707 25.2223 270.352 224.187 147.862 42.0087 199.73 20.9554 200.782 35.7322 31.9844 347.427 264.011 221.569 83.4157 49.3207 231.044 34.9096 106.783 68.9845 41.0788 27.4224 172.307 42.7276 13.7933 28.9343 12.5688 53.2212 10.0243 4.60239 28.7579 26.5752 72.1818 9.92655 34.095 15.3702 34.2733 27.4671 23.5087 42.181 42.4422 37.9085 18.1431 19.7654 16.5715 11.2748 10.0037 9.90251 5.86558 136.076 91.7891 5.24927 2.64225 16.353 3.24728 5.90629 7.41375 3.66873 6.29146 5.46774 6.65523 10.2161 44.2873 33.5592 10.7281 3.45639
internal_count=11334 5610 5581 5000 581 452 310 182 123 807 5724 1333 4391 2923 2905 2833 2825 2725 721 41 512 1468 72 298 104 680 612 1170 584 138 586 446 183 55 303 194 283 417 180 129 263 195 352 452 278 205 174 92 264 100 200 81 83 44 136 355 151 204 142 126 65 53 315 161 228 84 82 295 113 93 264 52 73 115 52 63 97 73 64 193 157 4193 2814 51 58 76 73 128 45 102 45 102 120 41 1379 1045 334 84
cat_boundaries=0 1 2 3 4 5 6 7 8 9 10 11 12 13 14 15 16 17 18 19 20 21 22
cat_threshold=2 1 2 1 2 1 1 1 1 1 2 1 2 1 2 2 1 1 1 1 1 1
is_linear=0
shrinkage=0.05


Tree=84
num_leaves=103
num_cat=22
split_feature=2 3 3 2 3 2 0 3 1 2 0 2 2 3 3 3 3 2 2 2 2 0 3 2 3 3 2 2 2 2 3 2 2 2 1 2 3 3 3 3 0 2 1 0 2 2 2 2 2 2 2 2 2 3 3 2 2 3 2 1 2 2 0 2 3 3 3 3 3 1 2 1 2 2 1 3 2 3 2 2 2 2 0 2 0 1 3 2 3 2 3 2 1 2 0 2 3 1 0 0 1 2
split_gain=23.6608 6.76676 3.4201 6.28039 2.04822 2.10455 1.58824 1.07924 1.10311 1.03025 0.950726 2.58843 1.61893 2.42926 4.98388 3.35897 6.05832 5.77427 1.77993 1.44129 1.37479 0.94227 0.905137 0.698509 0.485794 1.90697 0.473747 0.326896 0.254946 0.254515 0.227301 0.778365 3.03144 0.324614 0.211734 0.248272 0.208471 0.183483 0.163505 0.163354 0.15018 0.137478 0.114399 0.1038 0.102299 0.101667 0.09261 0.0738143 0.0849157 0.100866 0.0802486 0.10447 0.0736836 0.065084 0.0613207 0.053305 0.0500926 0.049518 0.0475896 0.0468581 1.20689 1.02064 0.0321542 0.0311427 0.029734 0.0292474 0.0285347 0.0274048 0.0241978 0.02356 0.0219031 0.0214461 0.019299 0.0187633 0.0230061 0.0158739 0.0148911 0.00957328 0.0348416 0.00930258 0.00921665 0.00752439 0.00677649 0.00354466 0.00338172 0.00497613 0.00268636 0.0022242 0.00199063 0.00112204 0.000993846 0.000544795 0.000378655 0.000351617 0.000198066 0.000171175 0.000120424 1.53152e-06 2.44205e-06 1.69909e-06 9.05772e-07 5.85984e-07
threshold=4.5000000000000009 28.500000000000004 1.0000000180025095e-35 1.0000000180025095e-35 2.5000000000000004 1.0000000180025095e-35 0 1.5000000000000002 1 2.5000000000000004 2 42.500000000000007 93.500000000000014 9.5000000000000018 8.5000000000000018 4.5000000000000009 2.5000000000000004 90.500000000000014 19.500000000000004 79.500000000000014 48.500000000000007 3 22.500000000000004 28.500000000000004 35.500000000000007 32.500000000000007 23.500000000000004 94.500000000000014 23.500000000000004 72.500000000000014 1.5000000000000002 120.50000000000001 117.50000000000001 155.50000000000003 4 208.50000000000003 22.500000000000004 2.5000000000000004 196.50000000000003 10.500000000000002 5 192.50000000000003 6 7 417.50000000000006 78.500000000000014 5.5000000000000009 154.50000000000003 193.50000000000003 334.50000000000006 118.50000000000001 124.50000000000001 490.00000000000006 8.5000000000000018 25.500000000000004 116.50000000000001 291.50000000000006 54.500000000000007 82.500000000000014 8 1.5000000000000002 1.5000000000000002 9 14.500000000000002 1.0000000180025095e-35 8.5000000000000018 2.5000000000000004 1.5000000000000002 1.5000000000000002 10 110.50000000000001 11 7.5000000000000009 81.500000000000014 12 29.500000000000004 176.50000000000003 8.5000000000000018 81.500000000000014 37.500000000000007 27.500000000000004 36.500000000000007 13 1.5000000000000002 14 15 4.5000000000000009 2.5000000000000004 3.5000000000000004 3.5000000000000004 1.5000000000000002 3.5000000000000004 16 28.500000000000004 17 3.5000000000000004 8.5000000000000018 18 19 20 21 3.5000000000000004
decision_type=2 2 2 2 2 2 9 2 1 2 9 2 2 2 2 2 2 2 2 2 2 9 2 2 2 2 2 2 2 2 2 2 2 2 1 2 2 2 2 2 9 2 1 9 2 2 2 2 2 2 2 2 2 2 2 2 2 2 2 1 2 2 9 2 2 2 2 2 2 1 2 1 2 2 1 2 2 2 2 2 2 2 9 2 9 1 2 2 2 2 2 2 1 2 9 2 2 1 9 9 1 2
left_child=1 2 3 84 5 6 7 8 -4 21 12 28 13 14 15 16 19 -18 -15 -2 -13 59 30 -20 25 54 -17 68 40 36 31 32 64 39 44 -36 -25 -35 41 53 46 57 88 67 -33 -28 -12 50 76 -50 70 -52 -39 -32 -24 -41 -43 -26 -31 61 -61 -5 69 -42 -14 -44 72 79 73 -7 -29 94 -48 74 -22 -56 -49 78 -70 80 -30 93 95 92 85 -1 -68 -64 -6 -84 100 -71 -23 -69 -11 -73 -90 98 -86 -99 -8 -96
right_child=10 -3 4 9 42 62 90 -9 -10 71 11 20 22 18 -16 26 17 -19 23 -21 27 83 24 29 38 -27 45 47 43 58 33 34 -34 37 35 -37 -38 52 -40 55 63 56 65 -45 -46 -47 66 48 49 -51 51 -53 -54 -55 75 -57 -58 -59 -60 60 -62 -63 87 -65 -66 -67 86 81 77 91 -72 82 -74 -75 -76 -77 -78 -79 -80 -81 -82 -83 89 -85 97 -87 -88 -89 96 -91 -92 -93 -94 -95 101 -97 -98 99 -100 -101 -102 -103
leaf_value=-0.023937309705076914 0.0045525621732047661 0.019688898123884264 -0.0087404341423747006 0.0057433818511196692 -0.022610023797996585 -0.017377065574516209 -0.022487145761960287 0.013826491466087311 0.01523561383292215 -0.014819034832377002 -0.017394240066595356 0.016346078829720161 0.0021151134184303638 0.012043699097383198 0.029530294152369005 -0.017408459647558574 0.014795691626588118 0.065626406908781451 -0.019516509977434721 -0.0036984893800208595 -0.0025959995321561727 -0.022027493334462005 0.0042316846856590238 -0.0050293136597221576 0.0028560183428587116 0.018491445495817549 -0.0040355547211096141 0.0013142045766265339 -0.0058875980485085418 -0.011003912702630427 -0.002711635263734889 2.9854976354403087e-05 0.030471402525835408 -0.0024625109539707902 -0.00051127674087534508 0.0032737579501662334 0.0038183697759193538 0.00082178143442667513 0.0062087724466788749 0.0030069610153998705 -0.012119813464440221 -7.652985884649651e-05 -0.016731931012867626 -0.0098137339031459034 -0.0024764095319195793 -0.0097399487384861594 -0.012613546450898648 0.0035794789143948364 0.00047512638069356741 0.0026409922157223128 -0.0048794256212091273 0.00046228289810211308 0.0031569243949501613 -0.0060934109260895068 0.00035143673937959184 -0.00081200422155259524 0.0018694338698451623 0.0071103627581532228 -0.0068199127388242761 -0.021981103119728618 0.0091339566533763725 -0.021044221771715735 -0.01693964165434662 -0.018218393183214231 -0.00072744431394319593 -0.0086996598062099948 -0.0060480058623234509 -0.00087386597506824114 -0.0033000948790701634 -0.02257156975387823 0.0039263216303650553 -0.018759478969984991 -0.0085395300341512149 0.0013435751729823067 0.00049254102485530476 0.0023148319618383913 0.0056257150717478168 -0.0043336391755584474 0.00092848672116817603 -0.006601886992461406 -0.002934834364942946 -0.0033373572438493513 -0.01722163329239795 -0.019196317296891058 -0.024815845234839467 -0.024688059358633874 -0.0037626617524274147 -0.014003246560686498 -0.021270117077844399 -0.015346354158425571 -0.021140034249991734 -0.023440370607948874 -0.020769488832807211 -0.00012604107771768254 -0.014038694091665077 -0.019278594668112846 -0.021618255875559805 -0.024779219546753981 -0.024769664048540193 -0.02482926511080288 -0.022429690967686201 -0.014075509344033217
leaf_weight=50.188100412487984 564.57529053092003 15.123848035931585 16.215200185775757 24.842646718025211 5.9993978925049314 2.4691870398819447 2.4224574565887442 22.067842803895473 6.8130754530429867 1.0596472062170506 3.170384023338559 15.322964385151861 41.480965614318848 14.277748368680475 20.292368076741695 9.7812324166297895 65.63891589641571 6.1068801283836356 10.097612619400023 58.401412844657898 18.471142321825027 2.8311234489083281 26.920615673065186 19.841563582420353 12.580945104360582 24.95209601521492 35.693715035915375 21.297837615013123 4.2558536604046875 12.53159222006798 89.512781411409378 143.85467889904976 10.856815695762633 39.208835959434509 74.513895869255066 103.50196903944016 10.019842922687529 190.26283556222916 24.614697873592377 13.71240723133087 3.0155885331332666 44.597513198852539 2.3751072548329839 9.0661572813987714 56.787761092185974 9.9989899694919568 3.4045474715530935 29.987370043992996 91.349848210811615 130.61801314353943 12.147801280021666 37.129913002252579 41.07490599155426 16.916052937507629 24.451426893472672 27.38591930270195 127.95187246799469 14.98805049061775 14.849607467651365 4.7655494064092609 9.0062586218118668 4.149839222431182 1.1809137798845761 6.8448323458433151 11.821501731872557 2.1676318123936653 2.9319006949663153 3.1068915054202062 23.28870797157288 3.4009675085544568 12.8777959048748 2.727187689393757 19.886991683393717 6.8155471682548514 8.9513930380344409 17.780652076005936 12.638286828994749 8.3502076268196088 6.1597999334335318 5.2612373530864707 6.9723524451255798 3.6996172219514847 1.5417201966047287 2.1548413559794426 29.567284524440765 39.39910700917244 2.2904268279671669 1.420745115727186 4.6035711988806707 1.6527668684720993 2.3984653800725937 3.8436821401119232 0.75839673355221782 3.1813719868659973 2.2502259761095047 3.8016710206866264 5.3949716165661812 8.3362743258476257 3.1694836169481269 2.1291683763265583 0.95695473253726993 2.0799191780388355
leaf_count=1562 2142 29 72 120 35 39 64 59 51 21 37 41 98 24 25 37 235 7 14 139 67 81 29 66 21 23 141 54 30 23 173 227 12 39 103 80 27 237 14 34 40 52 38 34 36 17 54 52 109 96 19 73 27 27 33 49 84 23 26 94 57 84 29 25 28 15 30 25 78 31 28 61 210 20 26 19 21 20 17 24 43 19 36 55 944 1252 21 29 28 37 44 14 21 20 43 59 13 266 101 68 20 38
internal_value=0 -0.0128881 -0.0146469 -0.018254 -0.00618546 -0.00172682 0.00276275 0.005925 -0.00164695 -0.00533706 0.00206457 0.000140104 0.00254998 0.00421066 0.00507956 0.00441818 0.0053636 0.0191223 -0.00399193 0.00377906 0.00163527 -0.00178561 0.0013505 -0.00739186 0.00362625 0.0066423 -0.00742168 0.00109868 -0.00830485 -0.00525307 0.000507652 0.00129708 0.00638972 -0.000328494 0.000434186 0.00168942 -0.00206052 0.000700333 0.00236331 -0.00221523 -0.0109645 0.00189031 -0.0199016 -0.00519615 -0.000679492 -0.00528385 -0.00928744 0.00173323 0.00214216 0.00174964 0.000436679 -0.00085454 0.0012364 -0.00324914 0.00236682 0.000462189 0.00136648 0.00516892 -0.00873481 0.000768431 -0.00163299 0.00190914 -0.0202728 -0.0163533 0.00148469 -0.0128992 -0.00838607 -0.00361504 -0.00196715 -0.0215949 0.00229848 -0.0167361 -0.00913503 -0.00100429 -0.00158782 0.00117807 0.00418618 -0.00283931 -0.00241559 -0.00486697 -0.00405403 -0.00154817 -0.0181384 -0.0207994 -0.0244427 -0.0242675 -0.00504569 -0.0153361 -0.02189 -0.0162514 -0.0219184 -0.0230325 -0.0217617 -0.000495525 -0.0142063 -0.0190618 -0.021458 -0.0248061 -0.0248114 -0.0247894 -0.0224709 -0.0140564
internal_weight=0 295.265 280.141 196.411 83.7302 63.1895 50.874 45.0961 23.0283 63.6218 2544.33 512.495 2031.84 852.107 770.489 750.196 694.722 71.7458 81.618 622.977 435.407 48.5087 1179.73 67.3402 318.838 94.1048 55.4739 420.084 77.0882 57.2426 860.891 442.818 64.1593 418.074 378.658 178.016 29.8614 270.547 224.733 147.527 41.5447 200.118 20.5407 35.5435 200.642 45.6927 31.6843 348.047 264.594 221.968 83.4533 49.2777 231.338 106.429 69.1527 41.0983 172.549 27.569 27.3812 42.7643 13.7718 28.9925 12.3155 9.86042 53.3025 4.54274 28.5139 26.4773 72.0368 9.71384 34.1756 15.1131 23.2915 34.2381 27.4225 42.2321 42.6257 37.7987 29.4485 16.4894 11.2282 9.98788 9.72335 5.74436 132.789 89.5872 5.22233 2.60166 15.9979 3.19449 5.77788 7.24465 3.58952 6.28826 5.38979 6.52886 9.99854 43.2022 32.7368 10.4654 3.37941 4.33015
internal_count=11334 5610 5581 5000 581 452 310 182 123 807 5724 1333 4391 2923 2743 2718 2523 242 180 2281 721 512 1468 156 298 104 195 680 612 142 1170 584 138 586 446 183 93 303 194 283 417 180 129 195 263 158 352 452 278 205 174 92 264 200 81 83 136 44 49 355 151 204 142 65 126 53 315 161 228 84 82 295 264 113 93 52 73 115 95 97 73 64 193 157 4193 2814 51 58 76 73 128 45 102 45 102 120 41 1379 1045 334 84 81
cat_boundaries=0 1 2 3 4 5 6 7 8 9 10 11 12 13 14 15 16 17 18 19 20 21 22
cat_threshold=2 1 2 2 1 1 1 1 1 2 2 2 1 2 2 1 1 1 1 1 1 1
is_linear=0
shrinkage=0.05


Tree=85
num_leaves=89
num_cat=21
split_feature=2 3 2 3 3 2 0 3 1 2 0 0 2 2 2 3 3 3 3 2 3 3 2 2 2 2 2 2 2 3 3 3 0 2 1 0 2 3 1 2 2 2 2 2 2 3 1 2 2 2 0 2 3 3 3 1 3 3 1 2 1 2 2 3 2 2 2 2 2 0 2 0 1 3 2 3 2 3 2 1 2 2 2 3 1 0 0 1
split_gain=22.7456 6.64448 6.26917 3.22542 2.00315 2.04074 1.53104 1.00779 1.04384 1.00356 0.916143 0.899526 2.47809 1.5259 2.36326 2.20897 2.43533 2.24452 4.70003 1.28207 0.865895 1.99411 0.576743 0.310598 0.248538 0.187115 0.225056 2.60337 0.624509 0.213576 0.184786 0.152641 0.14821 0.14141 0.114969 0.100594 0.0912563 0.0769494 0.0710901 0.0698922 0.080089 0.0954458 0.0761691 0.0998828 0.0672475 0.054562 0.0445525 1.16493 0.984127 0.042059 0.0323966 0.0310477 0.0289139 0.0277633 0.0263277 0.0238523 0.0231473 0.021435 0.0214322 0.018925 0.0179251 0.0195677 0.0139689 0.00952853 0.04846 0.0309202 0.00898678 0.00888006 0.00719466 0.00680188 0.00358774 0.00346338 0.00509307 0.00259344 0.0022165 0.00202332 0.00112101 0.00100974 0.000555459 0.000384335 0.000334882 0.000200346 0.000172448 0.000122204 1.56986e-06 2.50309e-06 1.74153e-06 9.21934e-07
threshold=4.5000000000000009 1.0000000180025095e-35 1.0000000180025095e-35 28.500000000000004 2.5000000000000004 1.0000000180025095e-35 0 1.5000000000000002 1 2.5000000000000004 2 3 42.500000000000007 93.500000000000014 92.500000000000014 18.500000000000004 17.500000000000004 9.5000000000000018 8.5000000000000018 48.500000000000007 34.500000000000007 37.500000000000007 30.500000000000004 94.500000000000014 23.500000000000004 574.00000000000011 120.50000000000001 119.50000000000001 123.50000000000001 11.500000000000002 26.500000000000004 196.50000000000003 4 192.50000000000003 5 6 5.5000000000000009 1.0000000180025095e-35 7 154.50000000000003 193.50000000000003 334.50000000000006 118.50000000000001 124.50000000000001 40.500000000000007 47.500000000000007 8 1.5000000000000002 1.5000000000000002 156.50000000000003 9 14.500000000000002 8.5000000000000018 2.5000000000000004 1.5000000000000002 10 1.5000000000000002 2.5000000000000004 11 7.5000000000000009 12 64.500000000000014 176.50000000000003 4.5000000000000009 72.500000000000014 69.500000000000014 37.500000000000007 27.500000000000004 36.500000000000007 13 1.5000000000000002 14 15 4.5000000000000009 2.5000000000000004 3.5000000000000004 3.5000000000000004 1.5000000000000002 3.5000000000000004 16 28.500000000000004 3.5000000000000004 3.5000000000000004 8.5000000000000018 17 18 19 20
decision_type=2 2 2 2 2 2 9 2 1 2 9 9 2 2 2 2 2 2 2 2 2 2 2 2 2 2 2 2 2 2 2 2 9 2 1 9 2 2 1 2 2 2 2 2 2 2 1 2 2 2 9 2 2 2 2 1 2 2 1 2 1 2 2 2 2 2 2 2 2 9 2 9 1 2 2 2 2 2 2 1 2 2 2 2 1 9 9 1
left_child=1 2 71 4 5 6 7 8 -3 10 46 13 24 14 15 16 17 18 -2 -14 25 -22 -17 56 32 26 27 37 -28 -30 -24 33 36 49 75 54 -13 -15 -27 42 62 -42 57 -44 -19 -35 48 -48 -4 -23 55 -34 -36 59 66 -7 60 -25 81 -38 61 -21 -41 65 -65 -58 67 -26 80 82 79 72 -1 -55 -52 -6 -71 87 -57 -12 -56 -11 -60 -77 85 -73 -86 -8
right_child=11 3 9 -5 34 50 77 -9 -10 58 70 12 19 20 -16 22 -18 44 -20 23 21 31 30 39 35 38 28 -29 29 -31 -32 -33 51 45 52 -37 53 -39 -40 40 41 -43 43 -45 -46 -47 47 -49 -50 -51 74 -53 -54 73 68 78 63 -59 69 -61 -62 -63 -64 64 -66 -67 -68 -69 -70 76 -72 84 -74 -75 -76 83 -78 -79 -80 -81 -82 -83 -84 -85 86 -87 -88 -89
leaf_value=-0.023915701822576626 0.003905202072140622 -0.0085991947536515588 0.005568294036462698 0.018820955905592171 -0.022559275273747705 -0.017246436816835582 -0.022433880683021507 0.013295695962219049 0.014629826629663842 -0.014362549260927684 -0.021965092479509972 -0.017263782740980255 0.015678493797125312 0.0019217582963334545 0.024391798865677911 -0.016888051477306064 0.029580824404238655 -0.012284977239397112 0.027948511101720887 9.9611699854690448e-06 0.01649611145998401 0.0072814789576422789 -0.0084308248424027604 0.0034183369886318597 -0.0057757483373382127 0.0016352652840540848 -0.008185053902023719 0.025518127516707317 -0.00014792174404505319 0.0020136217434207019 0.00019245789617918399 0.0060166614060077174 -0.011964840207067718 -0.00090763465757185378 -0.016595307065369987 -0.0096656499535028358 -0.012458486663583502 -0.00065132947621647248 0.0044331772199785119 0.0034779721518103535 0.00046310645411975766 0.0025685391870800198 -0.0047818440121288617 0.00045059377157995065 -0.0072075720484010772 0.0016664494564325408 -0.021917803709679728 0.0088251495042614893 -0.020963725267508615 0.0032863369055884115 -0.016804855420773059 -0.018096849797155052 -0.0085587257523167207 -0.0059340725110827259 -0.00085292295936186197 -0.022520030163508419 -0.0052032952352599159 0.00091283745899037403 -0.018644538607941002 -0.0083998276816955996 0.00073866459058283913 -0.0029204683757387598 0.005454864976058578 0.0011900205602654458 -0.0040868694723176311 -0.0011744960908564896 -0.0064811538132495787 -0.0028704834020940977 -0.0032655111482609253 -0.017089482380787679 -0.019087140509467415 -0.024815508390966218 -0.024684528879842956 -0.0036832459993095591 -0.013850580282576143 -0.021193603051280246 -0.015199703921762814 -0.021061213755334211 -0.023407430336731063 -0.020684286843797233 -0.00012292728448503541 -0.013748514545480954 -0.019170547851257266 -0.021548083517020162 -0.024777965032978532 -0.024768170863532599 -0.024829264535505279 -0.022375261343364983
leaf_weight=49.000997558236122 739.44521449506283 16.074089169502258 24.985738992691044 15.42457093298435 5.8652733489871034 2.4266504272818565 2.3685913085937491 22.375082567334175 6.9176716804504421 2.646466039121151 2.7694427333772174 3.1157143712043789 15.575493350625036 44.320430397987366 14.094884037971495 12.484443813562391 9.4152122437953931 8.7508335635066015 20.900543570518494 9.5255968272686022 28.201811373233795 12.795825690031053 11.404041469097139 18.092264175415039 4.2308704853057915 57.429870367050171 22.351277887821198 11.056206703186033 542.3847624361515 144.78351649641991 13.646599203348158 24.768000185489655 2.9792607277631742 24.342878103256226 2.3356977589428434 8.977619603276251 3.361873831599957 84.364414721727371 37.544972062110901 30.094901472330093 91.393261611461639 130.96343016624451 12.088671386241911 37.14708137512207 25.595398738980293 133.41296195983887 4.6619403511285755 9.088898554444313 4.0634213984012595 13.57822662591934 1.1610780358314507 6.7212596088647842 2.1488559544086456 2.9142220318317404 3.1041777282953245 3.325062267482279 11.527717724442484 16.162039160728455 2.6765039302408677 19.717889189720154 10.506317406892775 14.171852767467497 12.709586679935454 7.3175013214349773 10.731355577707289 8.1150258928537351 5.2266176939010611 6.9519197195768356 3.6872908622026443 1.5153965950012207 2.1138708740472794 28.842577129602432 38.438328593969345 2.2818249091506004 1.4009887427091596 4.5066867023706418 1.6275965459644794 2.3482939042150974 3.7546324580907822 0.74280770123004947 3.1809709668159485 2.6672989241778851 3.7290820330381393 5.2795934155583382 8.1322458796203136 3.0919407997280386 2.0769536048173878 0.93572944402694735
leaf_count=1562 2700 72 120 29 35 39 64 59 51 52 81 37 41 103 18 17 8 31 25 42 21 21 23 45 30 34 30 9 694 188 32 14 40 22 38 34 54 189 19 52 109 96 19 73 69 103 94 57 84 21 29 25 15 30 25 31 39 37 61 210 30 41 21 28 24 24 24 43 19 36 55 944 1252 21 29 28 37 44 14 21 20 50 59 13 266 101 68 20
internal_value=0 -0.0127347 -0.0181333 -0.00217982 -0.00607206 -0.0016896 0.00268409 0.00574147 -0.00161014 -0.0052344 -0.00174634 0.00200851 0.000136264 0.0024796 0.00408746 0.00374742 0.00430085 0.00400135 0.00456611 0.00159186 0.00131491 0.00401632 -0.0081086 0.00107014 -0.00816724 0.000636575 0.000401196 0.00223526 3.9974e-05 0.000307507 -0.0037332 0.00233151 -0.0108118 0.00183581 -0.0198026 -0.00509398 -0.00914251 0.000234869 0.00274132 0.00168718 0.00208442 0.00170316 0.00042557 -0.000834107 -0.00850121 0.00126925 0.000747077 -0.00159762 0.00185697 0.00522465 -0.0201795 -0.0162136 -0.0127444 -0.00824763 -0.00353826 -0.0215243 -0.00192218 0.00223618 -0.0165996 -0.00899103 -0.000980387 -0.00174253 0.00406495 -0.00277682 -0.00194747 -0.00353887 -0.0047696 -0.00396965 -0.00151212 -0.018016 -0.0207147 -0.0244331 -0.0242537 -0.00494563 -0.0151894 -0.0218249 -0.0161109 -0.0218539 -0.0229907 -0.0216942 -0.000483466 -0.0140543 -0.0189508 -0.0213848 -0.0248055 -0.0248109 -0.0247884 -0.0224173
internal_weight=0 291.52 192.872 98.6485 83.224 63.0879 51.0195 45.3668 22.9918 63.2885 48.4261 2549.65 512.574 2037.07 855.737 841.642 804.107 794.692 760.346 436.122 1181.34 237.1 37.5351 420.547 76.4515 944.235 849.261 139.741 709.52 687.168 25.0506 208.898 41.092 184.13 20.1361 35.3595 31.3915 128.685 94.9748 348.651 265.161 222.357 83.4901 49.2358 34.3462 157.756 42.8 13.7508 29.0492 26.3741 12.0684 9.70052 4.48455 28.2758 26.3818 9.50635 71.8954 34.2543 14.8623 23.0798 34.2038 23.6974 42.8045 37.6916 18.0489 19.6427 16.4094 11.1828 9.97244 9.54858 5.62612 129.583 87.4393 5.19605 2.56207 15.6516 3.14299 5.65261 7.07969 3.51225 6.28515 5.31376 6.40559 9.78628 42.1437 31.9345 10.2092 3.30432
internal_count=11334 5610 5000 610 581 452 310 182 123 807 512 5724 1333 4391 2923 2905 2833 2825 2725 721 1468 202 72 680 612 1266 1213 301 912 882 55 181 417 167 129 195 352 292 53 452 278 205 174 92 100 125 355 151 204 42 142 65 53 315 161 84 228 82 295 264 113 83 73 115 52 63 97 73 64 193 157 4193 2814 51 58 76 73 128 45 102 45 102 120 41 1379 1045 334 84
cat_boundaries=0 1 2 3 4 5 6 7 8 9 10 11 12 13 14 15 16 17 18 19 20 21
cat_threshold=2 1 2 2 1 1 1 1 1 2 2 2 1 2 2 1 1 1 1 1 1
is_linear=0
shrinkage=0.05


Tree=86
num_leaves=90
num_cat=23
split_feature=2 3 2 3 3 2 0 2 3 1 0 0 2 2 3 3 3 3 3 2 3 3 2 2 2 2 2 3 2 3 3 0 3 2 1 0 2 2 2 2 2 2 2 2 1 3 1 2 2 2 0 2 3 3 3 1 3 1 2 2 2 1 2 2 3 2 2 2 1 0 2 2 0 1 3 2 3 2 3 2 1 0 2 3 1 0 0 1 2
split_gain=21.8646 6.53236 6.25653 3.03485 1.9586 1.97878 1.47619 0.9773 0.941724 0.988192 0.890653 0.851369 2.37224 1.43904 2.22005 2.1651 2.25416 4.16848 3.18254 1.19651 0.818326 1.85252 0.564677 0.295125 0.242195 0.177916 0.28285 0.268078 0.626625 0.528534 0.177876 0.146202 0.143657 0.133333 0.115506 0.0974543 0.0898848 0.0661862 0.0755541 0.0903291 0.0723009 0.0954867 0.0657914 0.0531202 0.05281 0.0517801 0.042362 1.12467 0.949062 0.039358 0.0326308 0.03094 0.0285718 0.0270023 0.0252875 0.0241423 0.0221404 0.0214095 0.0206083 0.01855 0.018314 0.021239 0.0140613 0.0136629 0.00924804 0.0332158 0.00867905 0.0085535 0.00698167 0.00682481 0.0053339 0.0036304 0.00354692 0.00521256 0.00250298 0.00220786 0.00205617 0.00111952 0.00102568 0.000566258 0.000390017 0.000199903 0.000173672 0.000123984 1.60908e-06 2.56597e-06 1.78515e-06 9.38238e-07 8.23491e-07
threshold=4.5000000000000009 1.0000000180025095e-35 1.0000000180025095e-35 28.500000000000004 2.5000000000000004 1.0000000180025095e-35 0 2.5000000000000004 1.5000000000000002 1 2 3 42.500000000000007 93.500000000000014 18.500000000000004 17.500000000000004 9.5000000000000018 8.5000000000000018 4.5000000000000009 48.500000000000007 34.500000000000007 37.500000000000007 30.500000000000004 94.500000000000014 23.500000000000004 522.50000000000011 456.50000000000006 1.5000000000000002 120.50000000000001 11.500000000000002 26.500000000000004 4 196.50000000000003 192.50000000000003 5 6 5.5000000000000009 154.50000000000003 193.50000000000003 334.50000000000006 118.50000000000001 124.50000000000001 40.500000000000007 78.500000000000014 7 47.500000000000007 8 1.5000000000000002 1.5000000000000002 156.50000000000003 9 14.500000000000002 8.5000000000000018 2.5000000000000004 1.5000000000000002 10 1.5000000000000002 11 110.50000000000001 7.5000000000000009 81.500000000000014 12 763.50000000000011 163.50000000000003 8.5000000000000018 81.500000000000014 37.500000000000007 27.500000000000004 13 14 35.500000000000007 1.5000000000000002 15 16 4.5000000000000009 2.5000000000000004 3.5000000000000004 3.5000000000000004 1.5000000000000002 3.5000000000000004 17 18 3.5000000000000004 8.5000000000000018 19 20 21 22 3.5000000000000004
decision_type=2 2 2 2 2 2 9 2 2 1 9 9 2 2 2 2 2 2 2 2 2 2 2 2 2 2 2 2 2 2 2 9 2 2 1 9 2 2 2 2 2 2 2 2 1 2 1 2 2 2 9 2 2 2 2 1 2 1 2 2 2 1 2 2 2 2 2 2 1 9 2 2 9 1 2 2 2 2 2 2 1 9 2 2 1 9 9 1 2
left_child=1 2 72 4 5 6 8 10 9 -3 46 13 24 14 15 16 17 18 -2 -14 25 -22 -16 56 31 26 27 28 -15 -29 -24 36 33 49 76 54 -13 40 63 -40 58 -42 -18 -44 62 -35 48 -48 -4 -23 55 -33 -36 59 66 -7 60 81 -25 -38 61 -21 -27 -39 65 -58 67 -26 70 82 -56 80 73 -1 -55 -52 -6 -71 87 -57 -12 -9 -59 -78 85 -74 -86 -8 -83
right_child=11 3 7 -5 34 50 78 57 -10 -11 71 12 19 20 22 -17 42 -19 -20 23 21 32 30 37 35 44 -28 29 -30 -31 -32 51 -34 45 52 -37 53 38 39 -41 41 -43 43 -45 -46 -47 47 -49 -50 -51 75 -53 -54 74 68 79 64 69 -60 -61 -62 -63 -64 -65 -66 -67 -68 -69 -70 77 -72 -73 84 -75 -76 -77 83 -79 -80 -81 -82 88 -84 -85 86 -87 -88 -89 -90
leaf_value=-0.02389359118303996 0.0050744424684321414 0.014056747796798247 0.0053995039947517124 0.018007100584380056 -0.02250748475856201 -0.017114525605462075 -0.022379535480146748 -0.014526353451241862 0.012792154401870502 -0.0084590271580826798 -0.021901486192004039 -0.017132039361863177 0.015048345763420229 0.006063079074791357 -0.016752800873035 0.027994903856427153 -0.012129920118266614 0.026493872933569664 -0.0073799504432535204 -0.0025068829957421274 0.015819996542299226 0.0070485144459273494 -0.0082919879149301878 0.0012218638143601742 -0.005665381498163086 0.002433961089118739 -0.0031860441809449303 -0.0015951662372134254 0.00062542005740438941 0.0020649442787568305 0.0001876427912089652 -0.011809994796545837 0.0058316290937026885 -0.00088591265875424992 -0.016457521777206097 -0.0095183731764909366 -0.012303401434298688 0.005277233956087553 0.00045139609859294513 0.0024982571781376733 -0.0046857508000166404 0.00043920537492138362 -0.00511578769718394 -0.0097405623165811722 0.0037496260841866046 0.001622332437382781 -0.021853286258707187 0.0085294510379976037 -0.020881833655999549 0.0031940912551460874 -0.016668867118413755 -0.017973905599275457 -0.0084188730737752328 -0.0058216137191786929 -0.0010169154839268458 -0.022467436290061614 -0.0031662090936869489 -0.018528145116621857 0.0037490328293287752 -0.0082612419796474264 0.0013630652957384764 0.00046138406279328718 0.00096159389548701891 0.0033499547026838387 -0.0041897243914714557 0.00096770527351168359 -0.0063618508765564026 -0.0028073606217220055 0.00050062459680484184 -0.01695607705494126 -0.0038038129659832042 -0.018976487664488225 -0.024815163138413046 -0.024680910665416222 -0.0036052164545916803 -0.013697461596691494 -0.021115728189088998 -0.015052218808885546 -0.020981013090950677 -0.02337375613507368 -0.020597658058406788 -0.013727834701715595 -0.019061020130177353 -0.02147661401627032 -0.024776679092239854 -0.024766637369581509 -0.024829265554150125 -0.022319734308076326 -0.013772095225765835
leaf_weight=47.843003768473864 701.440180785954 7.0196202099323273 25.125254988670353 15.717625409364699 5.7344382256269464 2.3851581998169422 2.3160462379455558 1.0295450761914253 22.674561910331249 15.93645751476288 2.709274683147668 3.0623870380222824 15.821617871522902 64.837673306465149 12.275376319885252 9.6978818848729116 8.6439874842762929 21.492922067642212 55.341274946928024 18.397400885820389 28.670889794826508 12.889338195323946 11.308300137519838 21.373329877853394 4.2065044939518028 27.53956413269043 52.50927734375 267.13435277342796 289.73764470219612 156.36972698569298 13.64922586083412 2.9438267834484559 24.917470097541809 24.320794224739075 2.2972560040652761 8.8912630528211576 3.3202498368918958 13.330503880977629 91.43559604883194 131.30024695396423 12.031003177165983 37.163823485374451 14.618325635790827 10.793255686759947 47.277603507041931 133.63547337055206 4.5608725324273083 9.1694643348455429 3.9791236370801917 13.622922599315642 1.1417293101549142 6.6007198691368103 2.1305429488420486 2.8969800285994998 3.5538598895072919 3.2510185539722425 23.144774943590168 2.6270640976726991 12.957684844732283 19.552956074476242 6.8104756772518149 8.9624208211898821 39.435908198356628 29.648354291915894 8.291983559727667 6.150435358285903 5.1928527057170859 6.9319929331541061 3.0819651931524277 1.4897192716598511 3.3215557634830475 2.0739056803286076 28.135641247034073 37.501113027334213 2.2734358161687851 1.3817179687321184 4.4121787473559362 1.6030446924269199 2.2993531078100204 3.6677668690681458 0.72760106250643763 2.1872157715260983 3.6582744605839252 5.1670451164245605 7.9332211203873158 3.0162997599691179 2.0260192379355413 0.91502472758293185 2.0228451564908028
leaf_count=1562 2523 51 120 29 35 39 64 21 59 72 81 37 41 138 17 8 31 25 195 67 21 21 23 54 30 20 34 400 396 232 32 40 14 22 38 34 54 23 109 96 19 73 50 19 25 103 94 57 84 21 29 25 15 30 28 31 78 61 28 210 20 26 21 50 20 17 24 43 18 36 18 55 944 1252 21 29 28 37 44 14 21 43 59 13 266 101 68 20 38
internal_value=0 -0.0125812 -0.0180112 -0.00213357 -0.00596004 -0.00165308 0.00260793 -0.00513317 0.00556474 -0.00157404 -0.00170784 0.00195426 0.000132534 0.00241158 0.00396888 0.00450977 0.0042294 0.00478036 0.00416369 0.00154966 0.00128035 0.00390033 -0.0079729 0.00104237 -0.0080308 0.000620234 0.000365762 0.000605458 0.00161975 -0.00024375 -0.00365449 -0.0106595 0.00226819 0.00178686 -0.0197021 -0.0049933 -0.00899853 0.00164244 0.00202836 0.001658 0.00041475 -0.000814145 -0.00836185 -0.0070801 0.00247017 0.00123613 0.000726349 -0.00156293 0.00180634 0.00506798 -0.0200847 -0.0160728 -0.0125895 -0.00811034 -0.00346285 -0.0214525 -0.00187816 -0.0164618 0.0021757 -0.008848 -0.000957027 -0.00153455 0.00156701 0.00394773 -0.00271557 -0.00229831 -0.00467372 -0.00388671 -0.00147686 -0.0178921 -0.00236328 -0.0206286 -0.0244233 -0.0242395 -0.00484706 -0.0150419 -0.0217587 -0.0159693 -0.0217882 -0.0229479 -0.0216255 -0.0139018 -0.0188383 -0.0213104 -0.0248049 -0.0248105 -0.0247874 -0.0223626 -0.0137491
internal_weight=0 287.866 189.419 98.4475 82.7299 62.9885 51.1611 62.9632 45.6306 22.9561 48.3455 2554.81 512.65 2042.16 859.261 822.028 812.33 778.274 756.781 436.82 1182.9 238.057 37.2329 420.998 75.8305 944.842 830.589 778.079 354.575 423.504 24.9575 40.6506 209.386 184.469 19.7415 35.18 31.106 349.241 265.715 222.736 83.5258 49.1948 34.0556 25.4116 114.253 157.956 42.8347 13.7303 29.1044 26.5123 11.8274 9.54455 4.4278 28.0436 26.2887 9.30394 71.7575 14.6177 34.331 22.8732 34.1703 27.3598 66.9755 42.9789 37.5872 29.2952 16.3314 11.1385 9.95738 9.3781 6.87542 5.51078 126.455 85.3441 5.17042 2.52345 15.3137 3.09276 5.53042 6.91879 3.43688 5.23961 6.28534 9.57922 41.1112 31.1519 9.95924 3.23107 4.21006
internal_count=11334 5610 5000 610 581 452 310 807 182 123 512 5724 1333 4391 2923 2851 2843 2743 2718 721 1468 202 72 680 612 1266 1200 1166 534 632 55 417 181 167 129 195 352 452 278 205 174 92 100 69 66 125 355 151 204 42 142 65 53 315 161 84 228 295 82 264 113 93 41 73 115 95 97 73 64 193 46 157 4193 2814 51 58 76 73 128 45 102 102 120 41 1379 1045 334 84 81
cat_boundaries=0 1 2 3 4 5 6 7 8 9 10 11 12 13 14 15 16 17 18 19 20 21 22 23
cat_threshold=2 2 2 2 1 1 1 1 1 2 2 2 1 1 2 2 1 1 1 1 1 1 1
is_linear=0
shrinkage=0.05


Tree=87
num_leaves=88
num_cat=23
split_feature=2 3 2 3 3 2 0 2 3 1 0 0 2 2 2 3 3 3 3 2 3 3 2 2 2 3 2 2 2 2 3 0 3 2 1 0 2 3 1 2 2 2 2 2 2 3 1 2 2 2 0 2 3 3 1 3 3 1 3 2 2 1 0 2 3 2 2 0 1 2 2 0 1 3 2 3 2 3 2 1 2 2 3 1 0 0 1
split_gain=21.0159 6.42011 6.24247 2.85746 1.91458 1.91861 1.42359 0.951462 0.880562 0.935885 0.865784 0.805907 2.2707 1.35735 2.17881 1.99506 2.04349 2.02647 3.95558 1.31796 0.773478 2.70957 0.552668 0.293206 0.235922 0.171187 0.16938 0.200585 2.3904 0.599071 0.191964 0.144157 0.141902 0.131741 0.116007 0.0943817 0.0884971 0.0648297 0.0636972 0.0627701 0.0626837 0.0712918 0.0856818 0.0686326 0.0912744 0.0563729 0.0402804 1.08601 0.915372 0.0368486 0.0328562 0.0308197 0.0282214 0.0262522 0.0244298 0.0242831 0.0231655 0.0213779 0.0201895 0.0181744 0.0174359 0.0202709 0.0160792 0.0133989 0.0132637 0.00837932 0.0082368 0.0068452 0.00666191 0.00510949 0.00367258 0.00363237 0.00533469 0.00241498 0.0021983 0.00208914 0.00111756 0.00104166 0.000577194 0.000395694 0.000202252 0.000174846 0.00012576 1.64937e-06 2.63009e-06 1.82976e-06 9.54779e-07
threshold=4.5000000000000009 1.0000000180025095e-35 1.0000000180025095e-35 28.500000000000004 2.5000000000000004 1.0000000180025095e-35 0 2.5000000000000004 1.5000000000000002 1 2 3 42.500000000000007 93.500000000000014 92.500000000000014 18.500000000000004 17.500000000000004 9.5000000000000018 8.5000000000000018 47.500000000000007 34.500000000000007 36.500000000000007 30.500000000000004 94.500000000000014 23.500000000000004 26.500000000000004 574.00000000000011 120.50000000000001 119.50000000000001 123.50000000000001 11.500000000000002 4 196.50000000000003 192.50000000000003 5 6 5.5000000000000009 1.0000000180025095e-35 7 41.500000000000007 154.50000000000003 193.50000000000003 248.50000000000003 118.50000000000001 124.50000000000001 47.500000000000007 8 1.5000000000000002 1.5000000000000002 156.50000000000003 9 14.500000000000002 8.5000000000000018 2.5000000000000004 10 1.5000000000000002 1.5000000000000002 11 2.5000000000000004 7.5000000000000009 81.500000000000014 12 13 176.50000000000003 7.5000000000000009 37.500000000000007 27.500000000000004 14 15 35.500000000000007 1.5000000000000002 16 17 4.5000000000000009 2.5000000000000004 3.5000000000000004 3.5000000000000004 1.5000000000000002 3.5000000000000004 18 3.5000000000000004 3.5000000000000004 8.5000000000000018 19 20 21 22
decision_type=2 2 2 2 2 2 9 2 2 1 9 9 2 2 2 2 2 2 2 2 2 2 2 2 2 2 2 2 2 2 2 9 2 2 1 9 2 2 1 2 2 2 2 2 2 2 1 2 2 2 9 2 2 2 1 2 2 1 2 2 2 1 9 2 2 2 2 9 1 2 2 9 1 2 2 2 2 2 2 1 2 2 2 1 9 9 1
left_child=1 2 71 4 5 6 8 10 9 -3 46 13 24 14 15 16 17 18 -2 -14 26 -22 -17 56 31 -24 27 28 37 -29 -31 36 33 49 75 55 -13 -15 -28 -19 43 63 -43 58 -45 -35 48 -48 -4 -23 54 -33 -36 59 -7 65 60 67 -25 -38 61 -21 64 -42 -58 66 -26 81 69 -57 79 72 -1 -55 -52 -6 -69 86 -56 -12 -59 -9 -77 84 -73 -85 -8
right_child=11 3 7 -5 34 50 77 57 -10 -11 70 12 19 20 -16 22 -18 39 -20 23 21 32 25 40 35 -27 38 29 -30 30 -32 51 -34 45 52 -37 53 -39 -40 -41 41 42 -44 44 -46 -47 47 -49 -50 -51 74 -53 -54 73 78 68 62 80 -60 -61 -62 -63 -64 -65 -66 -67 -68 76 -70 -71 -72 83 -74 -75 -76 82 -78 -79 -80 -81 -82 -83 -84 85 -86 -87 -88
leaf_value=-0.023870964574347748 0.0036731934284773208 0.013513962415033585 0.0052367223019151908 0.017242645638328669 -0.022454634604236589 -0.016981355483370136 -0.022324094148858532 -0.01841030777998259 0.012313959288366911 -0.0083199643662942649 -0.021836654702217503 -0.016999034469377308 0.016240231138573397 0.0017090062518593269 0.023086837411448735 -0.016616357748891003 0.02653660204720909 -0.011874842015455016 0.025151978999857667 -0.0024508532269554382 0.020723673297693181 0.0068246134491959948 -0.0081542910362858816 0.0032603105788146314 -0.0055565025813944999 0.00018294895589090435 0.0015544058160421542 -0.0080508260578980775 0.02407062226882388 -0.00013328488828791648 0.0019130789318645572 -0.011655325922737395 0.0056533464703956158 -0.00075853908622278317 -0.016318603687657408 -0.0093719426219203393 -0.012148338676973488 -0.00064668547861274127 0.0041947054398160013 -0.0069510252606209107 0.0032614303343507 -0.00031716827759435722 0.0021112398317933287 -0.0045911417489129715 0.00042810975889097375 0.0015794539142294048 -0.021787535662941965 0.0082461295449683392 -0.020798536345964729 0.0031047248024437422 -0.016531702606491578 -0.017849573274194681 -0.0082801328318148487 -0.0057106356880817864 -0.022413771659323522 -0.00099268802538143397 -0.0016650013842564885 -0.014062978542789973 0.00083387439747807538 -0.0081238025520712649 0.0013273877988147923 0.0004497180309349421 -0.004922536676081949 0.0051893891763221426 -0.0040189381270114817 -0.0062439894569318311 -0.0027454502429008409 -0.016821440967556618 0.00048794701109733439 -0.0037236838495515443 -0.018864362208398391 -0.024814808167544528 -0.024677204618447624 -0.003528560937336249 -0.013543935146047166 -0.021036480519764436 -0.014903939219761714 -0.020899418924583066 -0.023339335628222324 -0.020509592456143921 -0.013437345687128129 -0.018950017115483664 -0.021403830827846658 -0.024775359828093646 -0.024765067556522042 -0.024829263994078254 -0.022263090606408183
leaf_weight=46.713412046432495 745.4642573967576 7.1189894378185272 25.261285901069645 16.003217622637749 5.6068121008574971 2.3446846231818199 2.2647898197174063 2.5788377411663523 22.966480024158955 15.802219390869142 2.6505827866494647 3.0103689320385483 14.673285394906996 44.675737947225571 14.478748619556425 12.071442216634749 9.9732092991471273 8.7288199588656408 22.069963097572327 18.351338595151901 21.493934214115143 12.980509728193285 11.214919388294222 18.194047629833221 4.182740427553659 13.65178734064102 57.605879306793213 22.172466695308685 11.383485674858091 542.06330168247223 145.32785624265671 2.9092646650969964 25.063204407691956 31.933393001556396 2.259758275002242 8.8070341646671277 3.2796497344970765 84.348213106393814 37.853455424308777 25.043315857648849 30.326893001794815 45.673390328884125 177.43216741085052 11.974760890007017 37.180149555206299 133.85245048999786 4.4622836187481854 9.2480094730854034 3.8968939930200568 13.666504979133604 1.1228557154536241 6.4831391274929047 2.1126814782619476 2.8801639713346949 3.178790941834448 3.5502476990222913 24.084339663386345 2.5728283226490012 16.211768329143524 19.392089799046516 6.8197650313377371 8.9665569663047808 6.8263049721717826 12.821986496448515 7.9628924280405036 5.1599213331937781 6.9125597178936005 1.4646724015474311 3.0835084542632103 3.3089451342821121 2.034921295940876 27.446042567491531 36.586879633367062 2.2652543857693672 1.3629209697246549 4.3199891634285432 1.579096008092165 2.251613013446331 3.5830314457416534 0.71276750788092647 2.5944419242441654 3.5892043448984623 5.0572577863931656 7.7390771731734276 2.9425136540085104 1.9763341173529605 0.89482791721820865
leaf_count=1562 2700 51 120 29 35 39 64 61 59 72 81 37 35 103 18 17 8 32 25 67 16 21 23 45 30 32 34 30 9 694 188 40 14 27 38 34 54 189 19 68 52 59 146 19 73 103 94 57 84 21 29 25 15 30 31 28 80 52 37 210 20 26 21 21 20 24 43 36 18 18 55 944 1252 21 29 28 37 44 14 21 50 59 13 266 101 68 20
internal_value=0 -0.0124276 -0.0178878 -0.00208815 -0.00584941 -0.00161725 0.0025342 -0.00503338 0.00539448 -0.00153867 -0.00167012 0.00190162 0.000128915 0.00234561 0.00385419 0.0035259 0.00404332 0.00376336 0.0042908 0.00150866 0.0012468 0.00378816 -0.00783839 0.000997436 -0.00789555 -0.00357716 0.000604388 0.000380107 0.00210681 3.84295e-05 0.000299356 -0.0105078 0.00211452 0.00165361 -0.0196002 -0.00489411 -0.00885552 0.000168995 0.00260139 -0.00822365 0.00159896 0.00197391 0.0016141 0.000404211 -0.000794644 0.00112911 0.000706225 -0.00152892 0.0017572 0.00491679 -0.0199885 -0.0159309 -0.0124346 -0.00797423 -0.0213792 -0.00338879 -0.0018846 -0.016323 0.00211699 -0.00870598 -0.000934204 -0.0014988 -0.00271922 0.00383434 -0.00224989 -0.00457933 -0.00380517 -0.0177669 -0.00144238 -0.00231015 -0.020541 -0.0244133 -0.0242251 -0.00474998 -0.0148935 -0.0216911 -0.0158266 -0.0217212 -0.0229042 -0.0215554 -0.0137489 -0.0187244 -0.0212346 -0.0248043 -0.02481 -0.0247863 -0.0223068
internal_weight=0 284.301 186.05 98.2509 82.2477 62.8912 51.2989 62.6458 45.8877 22.9212 48.2667 2559.84 512.725 2047.12 862.696 848.218 811.28 801.306 767.534 437.5 1184.42 238.99 36.9381 422.826 75.2249 24.8667 945.43 849.971 140.407 709.564 687.391 40.2199 217.496 192.433 19.3565 35.005 30.8275 129.024 95.4593 33.7721 349.815 266.254 223.106 83.5607 49.1549 165.786 42.8685 13.7103 29.1582 26.647 11.5923 9.3924 4.37244 27.8172 9.10651 26.1979 73.0112 14.3791 34.4058 22.6717 34.1377 27.3179 38.8735 43.1489 32.0472 16.2552 11.0953 9.21181 9.9427 6.85919 5.39827 123.404 83.3003 5.14542 2.48578 14.9841 3.04377 5.41123 6.76182 3.36335 5.16727 6.16804 9.37725 40.104 30.3886 9.71541 3.15962
internal_count=11334 5610 5000 610 581 452 310 807 182 123 512 5724 1333 4391 2923 2905 2833 2825 2725 721 1468 202 72 686 612 55 1266 1213 301 912 882 417 186 172 129 195 352 292 53 100 452 278 205 174 92 130 355 151 204 42 142 65 53 315 84 161 234 295 82 264 113 93 121 73 100 97 73 193 64 46 157 4193 2814 51 58 76 73 128 45 102 102 120 41 1379 1045 334 84
cat_boundaries=0 1 2 3 4 5 6 7 8 9 10 11 12 13 14 15 16 17 18 19 20 21 22 23
cat_threshold=2 2 2 2 1 1 1 1 1 2 2 1 1 1 2 1 2 1 1 1 1 1 1
is_linear=0
shrinkage=0.05


Tree=88
num_leaves=89
num_cat=23
split_feature=2 3 2 3 3 2 0 2 0 3 1 0 2 2 2 3 3 3 3 2 3 3 2 2 2 2 2 2 3 2 3 0 3 2 1 0 2 2 2 2 2 2 2 3 1 1 2 2 2 0 2 3 3 1 3 3 1 2 2 2 1 0 2 2 3 2 2 0 2 0 1 2 3 2 3 2 3 2 1 2 0 2 3 1 0 0 2 1
split_gain=20.1983 6.30781 6.22699 2.69211 1.87109 1.86018 1.37311 0.926054 0.841523 0.823884 0.886679 0.76296 2.1733 1.28072 2.00834 1.89803 1.87605 1.92763 3.636 1.22949 0.731175 2.50739 0.540725 0.27863 0.229721 0.165747 0.160592 0.268927 0.254353 0.564509 0.491415 0.142079 0.133653 0.124297 0.116473 0.0913764 0.0870947 0.0613523 0.059373 0.0672845 0.082671 0.0651537 0.0872387 0.0535027 0.0473618 0.0383024 1.04888 0.882991 0.0345155 0.0330727 0.0306869 0.0278632 0.0255132 0.0247145 0.0233139 0.0221534 0.0213374 0.0194001 0.0177985 0.0165995 0.0193454 0.0154451 0.0133826 0.0131114 0.0127154 0.00808753 0.0079298 0.00686303 0.00641009 0.00371982 0.00545941 0.00371425 0.00232939 0.0021878 0.00212223 0.00111511 0.00105768 0.000588262 0.000401365 0.000342164 0.000201522 0.000175966 0.000127535 1.69097e-06 2.69632e-06 1.8757e-06 1.11072e-06 9.71324e-07
threshold=4.5000000000000009 1.0000000180025095e-35 1.0000000180025095e-35 28.500000000000004 2.5000000000000004 1.0000000180025095e-35 0 2.5000000000000004 1 1.5000000000000002 2 3 42.500000000000007 93.500000000000014 92.500000000000014 18.500000000000004 17.500000000000004 9.5000000000000018 8.5000000000000018 47.500000000000007 34.500000000000007 36.500000000000007 30.500000000000004 94.500000000000014 23.500000000000004 72.500000000000014 522.50000000000011 456.50000000000006 1.5000000000000002 120.50000000000001 11.500000000000002 4 196.50000000000003 192.50000000000003 5 6 5.5000000000000009 41.500000000000007 154.50000000000003 193.50000000000003 329.50000000000006 118.50000000000001 124.50000000000001 47.500000000000007 7 8 1.5000000000000002 1.5000000000000002 156.50000000000003 9 14.500000000000002 8.5000000000000018 2.5000000000000004 10 1.5000000000000002 1.5000000000000002 11 110.50000000000001 7.5000000000000009 81.500000000000014 12 13 763.50000000000011 163.50000000000003 7.5000000000000009 37.500000000000007 27.500000000000004 14 36.500000000000007 15 16 1.5000000000000002 4.5000000000000009 2.5000000000000004 3.5000000000000004 3.5000000000000004 1.5000000000000002 3.5000000000000004 17 28.500000000000004 18 3.5000000000000004 8.5000000000000018 19 20 21 3.5000000000000004 22
decision_type=2 2 2 2 2 2 9 2 9 2 1 9 2 2 2 2 2 2 2 2 2 2 2 2 2 2 2 2 2 2 2 9 2 2 1 9 2 2 2 2 2 2 2 2 1 1 2 2 2 9 2 2 2 1 2 2 1 2 2 2 1 9 2 2 2 2 2 9 2 9 1 2 2 2 2 2 2 2 1 2 9 2 2 1 9 9 2 1
left_child=1 2 69 4 5 6 9 8 45 10 -3 13 24 14 15 16 17 18 -2 -14 26 -22 -17 55 31 -24 27 28 29 -15 -30 36 33 48 74 54 -13 -19 41 63 -41 57 -43 -35 62 47 -47 -4 -23 53 -33 -36 58 -7 65 59 80 -25 -38 60 -21 64 -28 -40 -57 66 -26 81 79 70 -1 78 -54 -51 -6 -69 87 -55 -10 -56 -9 -58 -76 84 -71 -85 -82 -8
right_child=11 3 7 -5 34 49 76 56 71 -11 -12 12 19 20 -16 22 -18 37 -20 23 21 32 25 38 35 -27 44 -29 30 -31 -32 50 -34 43 51 -37 52 -39 39 40 -42 42 -44 -45 -46 46 -48 -49 -50 73 -52 -53 72 77 68 61 67 -59 -60 -61 -62 -63 -64 -65 -66 -67 -68 75 -70 83 -72 -73 -74 -75 82 -77 -78 -79 -80 -81 86 -83 -84 85 -86 -87 -88 -89
leaf_value=-0.023847814555940667 0.0035686903923403215 0.012999277645058772 0.0050796871580420615 0.016523432508166673 -0.022400710196162056 -0.016846949567907304 -0.022267539690119388 -0.014231465606747826 -0.021770587932085098 0.011859382130122529 -0.0081820340406829062 -0.016864790405243298 0.015578639161599192 0.0057594158747400854 0.021993279433566541 -0.016478748909232732 0.02519145480853793 -0.011720093430177153 0.023910529902037743 -0.00239593976331615 0.019789363433249049 0.0066093233931138404 7.1555392292676183e-05 0.0011353320694153022 -0.0054491154594954391 -0.0081819410710703214 0.0023308391318397196 -0.0031220335949323648 -0.0015539574531046954 0.00061918502811664396 0.0019726197338944657 -0.011500880965618708 0.0054815038232758793 -0.00074027353125472213 -0.016178582219079262 -0.0092263965844167403 -0.01199334730230414 -0.0068263202132686392 0.0050212589944161994 0.00040435535470152321 0.0023639043400960381 -0.0044980121424139357 0.0004172991765452547 0.0015377755227095878 0.003548281745168465 -0.021720537876688897 0.0079745072474819677 -0.020713826490220306 0.0030181319128457329 -0.016393389723594221 -0.017723870169434261 -0.0081425346953700774 -0.0056011438488737962 -0.022359020151582764 -0.00081271952803161187 -0.0016264007217920693 -0.018291038638129285 0.0035812798715730296 -0.0079875379784546206 0.0012926907709505159 0.00043835208890297475 -0.0048243034701084689 0.00089678565495821059 0.0031410000102717844 -0.0039351344945898186 -0.0061275800566572185 -0.0026847370171450124 -0.016685598165085719 -0.0030732146592140552 -0.024814447017983278 -0.024673404383517138 -0.018750770072705862 -0.003453267366614643 -0.013390047279703304 -0.020955847948185485 -0.01475490490713981 -0.020816423245730784 -0.023304152698374245 -0.020420083282879274 -7.4156947468084444e-05 -0.013414990522651139 -0.018837543006142651 -0.0213297243731808 -0.024774006935461522 -0.024763456422214624 -0.024829265134300907 -0.013467105120592468 -0.022205320572629361
leaf_weight=45.61152121424675 748.20752767473459 7.21584852039814 25.393917560577396 16.28154818713665 5.4823160879313955 2.305204838514328 2.2147905826568595 1.0008976757526398 2.5933302305638781 23.251038365066051 15.671291112899782 2.9596280381083515 14.91352842748165 65.481336921453476 14.816905647516249 11.87251630425453 10.241406887769697 8.6257794946432096 22.63210591673851 18.306417137384415 21.944015264511108 13.069399774074556 14.052276134490969 21.444560468196869 4.1595634296536499 10.725850433111189 27.644127011299133 52.35443639755249 266.66139313578606 289.80863183736801 156.90837398171425 2.8755530938506109 25.205296039581299 31.90917980670929 2.2231814004480848 8.7248807400464994 3.2400483787059846 24.869843006134033 13.444815784692763 90.371813297271729 133.09425818920135 11.919908970594404 37.196070283651352 134.06403082609177 47.61304759979248 4.3661126792430851 9.3245849311351776 3.8166811466217032 13.709001719951628 1.1044455803930753 6.3684445917606354 2.0952604413032532 2.8637632615864268 3.1083347797393781 3.0989813283085805 24.044272825121883 2.5317948646843416 13.034194916486738 19.235190398991108 6.8288235068321219 8.9705902338027972 6.7927847951650611 39.535253882408142 29.869845300912857 7.9309542328119269 5.1278032064437857 6.8936076164245605 1.4402405619621277 3.6546997576951981 26.773353815078735 35.695066392421722 1.9968936145305631 2.2572753801941872 1.3445861004292963 4.230061072856186 1.555735744535923 2.2050439342856407 3.5003740936517715 0.69829780608415637 3.1747041344642639 2.1272680386900902 3.5218292661011219 4.9501630812883377 7.5496946312487125 2.8705371432006386 1.9278673380613307 1.9685468003153799 0.87512634694576297
leaf_count=1562 2700 51 120 29 35 39 64 21 81 59 72 37 35 138 18 17 8 32 25 67 16 21 37 54 30 18 20 34 400 396 232 40 14 27 38 34 54 68 23 108 97 19 73 103 25 94 57 84 21 29 25 15 30 31 25 80 61 28 210 20 26 21 21 50 20 24 43 36 19 944 1252 55 21 29 28 37 44 14 21 20 43 59 13 266 101 68 38 20
internal_value=0 -0.012274 -0.017763 -0.00204356 -0.00574018 -0.00158208 0.00246279 -0.00493504 -0.00163315 0.00523039 -0.001504 0.00185047 0.000125389 0.00228158 0.00374331 0.00342564 0.00392645 0.00365569 0.00416593 0.0014688 0.0012141 0.0036795 -0.0077051 0.000971627 -0.00776151 -0.00350118 0.000588897 0.000346803 0.000579975 0.00156655 -0.000247562 -0.0103567 0.00205755 0.00160981 -0.0194967 -0.00479641 -0.00871353 -0.00808656 0.00155669 0.00192104 0.00157144 0.000393946 -0.000775593 0.00109981 0.00234191 0.000686686 -0.00149557 0.00170949 0.00477084 -0.0198908 -0.0157881 -0.0122796 -0.00783932 -0.0213047 -0.00331606 -0.00184136 -0.016183 0.00205999 -0.00856502 -0.000911904 -0.00146383 -0.00265903 0.00148689 0.00372463 -0.00219905 -0.00448641 -0.00372504 -0.0176403 -0.00140866 -0.024403 -0.0242103 -0.020452 -0.00465439 -0.0147445 -0.0216223 -0.015683 -0.021653 -0.0228596 -0.0214841 -0.000438981 -0.0135955 -0.018609 -0.0211574 -0.0248036 -0.0248095 -0.0247852 -0.01344 -0.0222499
internal_weight=0 280.823 182.764 98.0586 81.7771 62.7961 51.4331 62.3361 48.1898 46.1382 22.8871 2564.75 512.797 2051.95 866.044 851.227 814.577 804.335 770.84 438.163 1185.91 239.901 36.6506 423.249 74.6341 24.7781 946.007 831.214 778.86 355.29 423.57 39.7999 217.957 192.752 18.981 34.8342 30.5559 33.4956 350.375 266.781 223.466 83.5947 49.116 165.973 114.792 42.9013 13.6907 29.2106 26.7784 11.3629 9.244 4.31844 27.5963 8.91391 26.1094 72.8738 14.1463 34.4788 22.4752 34.1058 27.277 38.768 67.1794 43.3147 31.9752 16.181 11.0532 9.0496 9.92839 120.428 81.3066 5.28852 5.12104 2.44903 14.6625 2.99598 5.29496 6.60871 3.29163 6.27369 5.09671 6.05362 9.18022 39.1215 29.6439 9.47756 4.09581 3.08992
internal_count=11334 5610 5000 610 581 452 310 807 512 182 123 5724 1333 4391 2923 2905 2833 2825 2725 721 1468 202 72 686 612 55 1266 1200 1166 534 632 417 186 172 129 195 352 100 452 278 205 174 92 130 66 355 151 204 42 142 65 53 315 84 161 234 295 82 264 113 93 121 41 73 100 97 73 193 64 4193 2814 157 51 58 76 73 128 45 102 45 102 120 41 1379 1045 334 81 84
cat_boundaries=0 1 2 3 4 5 6 7 8 9 10 11 12 13 14 15 16 17 18 19 20 21 22 23
cat_threshold=2 2 2 2 1 1 1 1 1 2 2 2 1 1 2 2 1 1 1 1 1 1 1
is_linear=0
shrinkage=0.05


Tree=89
num_leaves=88
num_cat=22
split_feature=2 3 2 3 3 2 0 2 0 3 1 0 2 2 3 2 3 3 3 2 3 3 2 2 2 3 2 2 2 2 3 0 3 2 1 0 2 2 1 2 2 2 2 2 3 3 1 2 2 0 2 2 3 1 3 2 3 1 3 3 2 2 2 0 3 2 2 0 1 2 0 1 2 3 2 3 2 3 2 1 2 2 3 1 0 0 1
split_gain=19.4108 6.19552 6.21012 2.5378 1.82815 1.80343 1.32466 0.901078 0.817857 0.77131 0.840352 0.722413 2.07989 1.20863 1.9077 1.75186 1.72512 1.83379 3.3473 1.14781 0.691279 2.32291 0.528854 0.264786 0.223597 0.164784 0.153397 0.17872 2.19896 0.575659 0.163319 0.139969 0.12592 0.1173 0.116902 0.0884386 0.085679 0.0599413 0.0571157 0.0562432 0.0636937 0.0958052 0.0618542 0.0833728 0.0553077 0.0512519 0.0364226 1.0132 0.851857 0.0332799 0.0323449 0.0305416 0.0274975 0.0249962 0.0247856 0.0235869 0.0223789 0.021288 0.0211829 0.0190256 0.0174229 0.0158029 0.0191785 0.0148329 0.0121877 0.00780362 0.00763232 0.00687824 0.0063267 0.00472258 0.00380924 0.00558685 0.00375536 0.0022462 0.00217639 0.00215541 0.0011122 0.00107372 0.000599462 0.000407025 0.000203984 0.000177031 0.000129302 1.73305e-06 2.76368e-06 1.92269e-06 9.88044e-07
threshold=4.5000000000000009 1.0000000180025095e-35 1.0000000180025095e-35 28.500000000000004 2.5000000000000004 1.0000000180025095e-35 0 2.5000000000000004 1 1.5000000000000002 2 3 42.500000000000007 93.500000000000014 18.500000000000004 92.500000000000014 17.500000000000004 9.5000000000000018 8.5000000000000018 47.500000000000007 34.500000000000007 36.500000000000007 30.500000000000004 94.500000000000014 23.500000000000004 26.500000000000004 574.00000000000011 120.50000000000001 119.50000000000001 124.50000000000001 12.500000000000002 4 196.50000000000003 192.50000000000003 5 6 5.5000000000000009 41.500000000000007 7 154.50000000000003 201.50000000000003 248.50000000000003 118.50000000000001 124.50000000000001 10.500000000000002 73.500000000000014 8 1.5000000000000002 1.5000000000000002 9 156.50000000000003 14.500000000000002 8.5000000000000018 10 2.5000000000000004 186.50000000000003 1.5000000000000002 11 1.5000000000000002 2.5000000000000004 7.5000000000000009 81.500000000000014 64.500000000000014 12 7.5000000000000009 37.500000000000007 27.500000000000004 13 14 35.500000000000007 15 16 1.5000000000000002 4.5000000000000009 2.5000000000000004 3.5000000000000004 3.5000000000000004 1.5000000000000002 3.5000000000000004 17 3.5000000000000004 3.5000000000000004 8.5000000000000018 18 19 20 21
decision_type=2 2 2 2 2 2 9 2 9 2 1 9 2 2 2 2 2 2 2 2 2 2 2 2 2 2 2 2 2 2 2 9 2 2 1 9 2 2 1 2 2 2 2 2 2 2 1 2 2 9 2 2 2 1 2 2 2 1 2 2 2 2 2 9 2 2 2 9 1 2 9 1 2 2 2 2 2 2 2 1 2 2 2 1 9 9 1
left_child=1 2 70 4 5 6 9 8 46 10 -3 13 24 14 15 16 17 18 -2 -14 26 -22 -16 58 31 -24 27 28 44 -29 -31 36 33 50 75 56 -13 -19 -28 42 55 -42 59 -44 -15 -35 48 -48 -4 53 -23 -33 -36 -7 60 -41 65 80 61 -25 -38 62 -21 64 -60 66 -26 81 69 -58 71 -1 79 -56 -51 -6 -69 86 -55 -10 -9 -59 -77 84 -72 -85 -8
right_child=11 3 7 -5 34 49 77 57 72 -11 -12 12 19 20 22 -17 -18 37 -20 23 21 32 25 39 35 -27 38 29 -30 30 -32 51 -34 45 52 -37 54 -39 -40 40 41 -43 43 -45 -46 -47 47 -49 -50 74 -52 -53 -54 78 73 -57 68 67 63 -61 -62 -63 -64 -65 -66 -67 -68 76 -70 -71 83 -73 -74 -75 -76 82 -78 -79 -80 -81 -82 -83 -84 85 -86 -87 -88
leaf_value=-0.023824127700331529 0.003467527702714978 -0.0080452672285633575 0.0049281450011898391 0.015845758464603961 -0.022345694990833231 -0.016711332979741873 -0.022209855660322686 -0.01376158227985059 -0.021703268758480665 0.011426848098893369 0.01251071668087312 -0.016729331896399666 0.014954016398383589 -0.00036519615521616363 -0.016340002902204605 0.020974737659513257 0.023947098062558306 -0.011565548402632556 0.022758957187435758 -0.00016312156498102221 0.018915068557495193 0.0064022208291867142 -0.007953340936514534 0.00311083091866902 -0.0053432224365752498 0.00025909182123202669 0.0014779304351982014 -0.0072092904661735782 0.022742201506091436 -6.8627401861152176e-05 0.0018670033811915778 -0.011346708001293337 0.0053158098740443104 0.00021570858006248058 -0.016037488487846287 -0.0090817722940480169 -0.011838474618554844 -0.0067030059475466242 0.003970840992345767 0.0028661131528164843 -0.00069133686165423751 0.0020041561634163443 -0.0044063557951385512 0.00040676596812816315 0.0023675136316328826 0.0019725969287466096 -0.021652276038807674 0.0077139539762088559 -0.020627690640139924 -0.016253957399019952 0.0029342115692077464 -0.01759681292107353 -0.0080061078230383199 -0.022303165832680712 -0.0054931422427474709 0.0054004081744380254 -0.00095794819251717909 -0.018170348135043181 -0.0015886329515633398 0.00076012269492674832 -0.0078524753547416816 0.0012589448887450137 -0.0028195360377536414 -0.0047275602862163783 -0.0038527512173311806 -0.0060126321973984062 -0.0026252048245913239 -0.016548575672546192 0.00050519577056643515 -0.003588769858138002 -0.024814073623902214 -0.024669511521778809 -0.018635717994780924 -0.0033793227034035985 -0.013235845413973114 -0.020873821395701334 -0.014605156124859653 -0.020732014834209632 -0.023268193344886542 -0.020329121879113683 -0.013124626647996233 -0.018723603230563352 -0.021254277760606569 -0.024772621864293361 -0.024761806696331351 -0.024829266479129603 -0.022146402175733465
leaf_weight=44.536653369665146 750.88242095708847 15.543591141700745 25.52323937416077 16.55281001329422 5.3608736246824273 2.2666944563388824 2.166017770767211 2.5027648136019707 2.537482012063264 23.52842190861702 7.3102612942457208 2.9101331122219589 15.147680148482321 106.94758594036102 11.67847518622875 15.146388232707976 10.502680219709871 8.5252748504281026 23.179773017764091 14.251299917697908 22.382598757743835 13.156065583229067 11.081377804279329 18.291386038064957 4.1369591802358681 13.610354304313658 57.773340463638306 26.388364434242249 11.701367378234862 547.13520956039429 136.08016097545624 2.8426711410284025 25.343838572502136 85.239479541778564 2.187502872198821 8.644751623272894 3.2014215104281964 24.70065139234066 38.147692203521729 36.428577542304993 40.450324356555939 178.14024418592453 11.866413503885267 37.211595326662064 22.392399489879608 80.916437447071075 4.2723008841276142 9.3992408215999603 3.7384362816810599 1.0864875763654702 13.750439882278441 6.2565653771162033 2.0782689899206161 3.0396066382527334 2.8477677479386321 12.274780154228209 3.5450811535119993 2.4859066084027273 24.005198746919636 16.25849261879921 19.082160569727421 6.8376569151878348 12.985832050442694 6.7600932866334906 7.8998062312602988 5.0964782983064643 6.8751249462366104 1.4164087325334549 3.0814091041684151 3.2879275977611542 26.1171635389328 34.825122945010662 1.9597992189228532 2.2494938597083092 1.3267020508646963 4.1423387601971609 1.5329495668411255 2.1596172526478767 3.4197440892457962 0.6841831170022491 2.5251247361302376 3.4561076834797859 4.8456956446170807 7.3649560697376728 2.8003256414085653 1.880589134991167 0.85590809583663974
leaf_count=1562 2700 72 120 29 35 39 64 52 81 59 51 37 35 239 17 18 8 32 25 58 16 21 23 45 30 32 34 37 9 701 174 40 14 71 38 34 54 68 19 61 51 146 19 73 53 59 94 57 84 29 21 25 15 31 30 20 28 61 80 37 210 20 35 21 20 24 43 36 18 18 944 1252 55 21 29 28 37 44 14 21 50 59 13 266 101 68 20
internal_value=0 -0.0121205 -0.0176369 -0.00199977 -0.00563236 -0.00154759 0.00239363 -0.00483813 -0.00159693 0.0050722 -0.00147003 0.00180083 0.000121966 0.00221948 0.00363606 0.0041255 0.00381344 0.0035515 0.00404522 0.00143005 0.00118236 0.00357437 -0.00757307 0.000946513 -0.00762872 -0.00342656 0.000573872 0.000360132 0.00198575 3.70239e-05 0.000316904 -0.0102061 0.00200223 0.00156725 -0.0193918 -0.0047002 -0.00857258 -0.00795066 0.00246936 0.00151561 0.00186968 0.00150535 0.000383946 -0.000756983 0.000107913 0.0010713 0.000667716 -0.00146287 0.00166316 -0.0197916 0.00462991 -0.0156442 -0.0121246 -0.0212288 -0.00770565 0.00350484 -0.00324465 -0.016042 -0.00179902 0.00200463 -0.00842513 -0.000890115 -0.00142962 -0.00260002 -0.00214924 -0.00439496 -0.00364629 -0.0175124 -0.00137566 -0.00222385 -0.0243925 -0.0241951 -0.0203616 -0.00456028 -0.0145947 -0.0215522 -0.0155385 -0.0215834 -0.0228141 -0.0214114 -0.0134417 -0.0184921 -0.0210789 -0.024803 -0.024809 -0.0247841 -0.0221919
internal_weight=0 277.429 179.559 97.8705 81.3177 62.7031 51.5638 62.0339 48.1147 46.3823 22.8539 2569.53 512.867 2056.66 869.307 832.937 817.791 807.288 774.062 438.809 1187.35 240.789 36.3702 423.662 74.0579 24.6917 946.566 850.645 141.041 709.604 683.215 39.3902 218.406 193.062 18.6147 34.6677 30.291 33.2259 95.921 350.922 267.294 218.591 83.6279 49.078 129.34 166.156 42.9332 13.6715 29.2617 11.1392 26.9065 9.09924 4.26577 8.72605 27.3808 48.7034 26.023 13.9193 72.7399 34.5499 22.2836 34.0748 27.2371 38.6651 31.905 16.1086 11.0121 8.89137 9.91442 6.83301 117.525 79.3618 5.18146 5.09726 2.41319 14.3489 2.94936 5.18154 6.45935 3.22167 5.02789 5.94201 8.98803 38.163 28.9175 9.24555 3.02193
internal_count=11334 5610 5000 610 581 452 310 807 512 182 123 5724 1333 4391 2923 2851 2833 2825 2725 721 1468 202 72 686 612 55 1266 1213 301 912 875 417 186 172 129 195 352 100 53 452 278 197 174 92 292 130 355 151 204 142 42 65 53 84 315 81 161 295 234 82 264 113 93 121 100 97 73 193 64 46 4193 2814 157 51 58 76 73 128 45 102 102 120 41 1379 1045 334 84
cat_boundaries=0 1 2 3 4 5 6 7 8 9 10 11 12 13 14 15 16 17 18 19 20 21 22
cat_threshold=2 2 1 2 1 1 1 1 1 2 2 2 1 2 1 2 1 1 1 1 1 1
is_linear=0
shrinkage=0.05


Tree=90
num_leaves=68
num_cat=21
split_feature=2 3 2 0 2 2 2 3 3 2 2 3 2 2 3 1 2 3 2 2 3 3 2 1 2 2 2 2 3 0 1 2 2 2 1 3 1 1 1 3 0 3 2 0 0 2 1 1 2 2 2 3 2 0 3 2 3 2 3 2 2 1 0 0 0 1 0
split_gain=17.8033 11.7365 5.5165 1.77513 1.72469 2.9277 2.10437 2.18733 7.63625 1.95393 1.63082 13.1997 1.83612 1.21651 2.62388 3.90155 1.29599 5.95029 4.39242 2.28303 2.22408 1.48949 1.19266 0.845814 0.843936 1.36234 0.701986 0.42964 0.198085 0.143079 0.105514 0.0995276 0.0823335 0.0660741 0.0364126 0.0274261 0.0244778 0.0243008 0.0201536 0.0193043 0.0163581 0.0163435 0.0169249 0.012576 0.010778 0.00975976 0.00935447 0.00596494 0.00540244 0.00426173 0.00412081 0.00399118 0.00327983 0.00291592 0.00150503 0.00337857 0.00142472 0.000587098 0.000428303 0.000334153 0.000204064 8.78477e-05 0.000119233 7.70487e-06 3.34698e-06 2.25999e-06 1.77636e-15
threshold=7.5000000000000009 1.0000000180025095e-35 1.0000000180025095e-35 0 4.5000000000000009 3.5000000000000004 1.0000000180025095e-35 29.500000000000004 5.5000000000000009 6.5000000000000009 8.5000000000000018 1.5000000000000002 13.500000000000002 14.500000000000002 1.5000000000000002 1 19.500000000000004 6.5000000000000009 20.500000000000004 15.500000000000002 1.0000000180025095e-35 1.5000000000000002 1.5000000000000002 2 21.500000000000004 26.500000000000004 4.5000000000000009 6.5000000000000009 17.500000000000004 3 4 2.5000000000000004 5.5000000000000009 1.0000000180025095e-35 5 2.5000000000000004 6 7 8 3.5000000000000004 9 1.5000000000000002 12.500000000000002 10 11 5.5000000000000009 12 13 11.500000000000002 9.5000000000000018 1.5000000000000002 1.5000000000000002 5.5000000000000009 14 1.5000000000000002 11.500000000000002 1.5000000000000002 10.500000000000002 1.0000000180025095e-35 5.5000000000000009 3.5000000000000004 15 16 17 18 19 20
decision_type=2 2 2 9 2 2 2 2 2 2 2 2 2 2 2 1 2 2 2 2 2 2 2 1 2 2 2 2 2 9 1 2 2 2 1 2 1 1 1 2 9 2 2 9 9 2 1 1 2 2 2 2 2 9 2 2 2 2 2 2 2 1 9 9 9 1 9
left_child=1 2 61 4 5 6 7 8 -3 52 11 44 34 14 15 -14 17 19 21 20 -15 -18 23 -4 36 -26 31 30 33 -21 32 43 -28 35 39 56 -20 50 60 40 41 42 -12 47 -2 51 -46 -24 58 -36 -8 -35 -6 -40 55 57 65 -51 -42 -32 -33 62 -1 -63 -64 -5 -65
right_child=10 3 22 28 9 -7 37 -9 -10 -11 12 -13 13 16 -16 -17 18 -19 24 29 -22 -23 26 -25 25 -27 27 -29 -30 -31 59 38 -34 45 49 -37 -38 -39 53 -41 48 -43 -44 -45 46 -47 -48 -49 -50 54 -52 -53 -54 -55 -56 -57 -58 -59 -60 -61 -62 63 64 66 -66 -67 -68
leaf_value=-0.024674891349953876 -0.0090000001318271891 0.004246492820485291 0.0020057040260851857 -0.022119268210919522 -0.022199651728139477 0.045426904315770199 -0.022658959707069243 -0.0084471408624063344 0.052583503930952881 0.0070827826716422793 -0.011582989116325274 0.11281181674873141 0.055884460475362822 -0.013594598510009284 -0.017398937564581763 0.0070756431492535344 0.016385305563946833 0.020157505379151938 -0.013395242603363652 -0.0076919577895573953 0.022020540501534763 0.046933928513280293 -0.020684607157407237 -0.021353592772600516 0.0073558034998548434 0.0017162242805410653 -0.0080168459533947172 -0.017722024341101823 0.0079052492078684287 -0.016621775630986269 -0.014110009632154256 -0.013543329786074313 -0.0033492735404268095 -0.015376709481014206 -0.0088902175206445593 -0.013851743249281276 -0.0084425608018845813 -0.014895026424126821 -0.01790541397966677 -0.0053431156970551175 -0.010091679086840812 -0.015177765106566175 -0.0067747378677387787 -0.018340199315306553 -0.015246278941820219 -0.0091547914034141118 -0.011266180898865809 -0.023102635743666666 -0.0062648278575329844 -0.0073435709969096701 -0.019906306905369243 -0.012026844865164369 -0.020543407614761724 -0.015850959348487806 -0.0058026424360293422 -0.0059626401244129001 -0.020464191659009576 -0.0084243637481367269 -0.0089456494906072423 -0.013282083367941046 -0.012899819268727642 -0.024773099797167204 -0.024813592075863988 -0.024829264797239656 -0.024752517861280382 -0.022019754739258487 -0.024829263616189499
leaf_weight=42.374492272734642 1.5966273248195648 45.695796504616737 28.589642632752657 2.3501456007361394 6.5458184406161308 4.9119038432836524 2.9709093719720832 15.318266689777372 9.9498247504234296 11.9649887830019 11.359474882483484 2.8803934045135975 5.8113173320889473 8.4166173487901705 5.5620777234435073 13.857436545193201 11.482432186603548 19.994582891464233 7.4920570477843267 4.9382961541414261 9.1478332728147489 6.1152668222784987 3.6185143366456058 4.4828408770263186 112.60796730220318 2183.5906320661306 21.41540290415287 11.484976492822168 0.88810373842716295 48.94277124106884 2.6956367604434481 2.4243004284799099 16.906597875058651 1.8677212931215765 2.7869306951761237 1.5482196398079393 3.7402370274066925 1.9463138580322263 5.5981044135987741 1.8215317875146855 1.7286401800811355 2.5417865067720404 2.1816745698451987 2.2736719213426104 3.6003100723028165 1.6750996448099611 2.5023772642016411 8.6411468982696515 2.0243384577333927 2.3758396133780462 2.506907545030117 1.6971403770148752 5.5012245178222656 2.4977131299674511 3.254945181310176 3.9516401737928391 2.3552984483540058 2.6670143157243729 1.5429605543613432 2.2243599519133568 2.504845105111599 7.4278415180742741 25.315135061740875 32.673901252448559 2.4613570794463184 0.75344505161046837 1.6456279512494791
leaf_count=1522 26 193 198 71 18 27 25 26 28 22 149 17 33 53 21 48 46 20 43 43 23 22 83 107 275 3852 61 93 3 205 42 51 65 41 34 32 19 34 115 19 28 24 24 65 51 29 32 52 29 28 30 37 25 63 31 43 49 29 24 33 50 275 938 1204 91 18 61
internal_value=0 -0.0101646 -0.0168522 0.00245354 0.00457718 0.00798043 0.00563398 0.00828376 0.0128895 -0.00722902 0.00191343 0.0215024 0.00182986 0.00200011 0.0129222 0.0214967 0.00188607 -0.00395276 0.00211571 -0.0107002 0.00495431 0.0270011 -0.0091798 -0.00116055 0.00192592 0.0019928 -0.0124029 -0.00912576 -0.0148962 -0.0158033 -0.00684262 -0.0189109 -0.00595764 -0.0165497 -0.00904205 -0.0197255 -0.0117461 -0.0196941 -0.0157369 -0.0102842 -0.0107052 -0.0114989 -0.0108083 -0.0217555 -0.0126574 -0.0123027 -0.0136143 -0.0223889 -0.008295 -0.00712545 -0.0213992 -0.0137819 -0.0214433 -0.0172716 -0.00672394 -0.00705735 -0.0213914 -0.00791517 -0.00955119 -0.0137357 -0.0132163 -0.0247618 -0.0247277 -0.0248193 -0.0248082 -0.0220951 -0.0248293
internal_weight=0 347.703 227.256 120.447 107.312 83.2999 78.388 70.9639 55.6456 24.012 2490.52 10.5797 2479.94 2441.7 25.2308 19.6688 2416.47 91.4401 2325.03 71.4455 17.5645 17.5977 115.358 33.0725 2307.43 2296.2 82.2853 54.727 13.1352 53.8811 43.242 27.5583 38.322 12.2471 38.2368 7.00711 11.2323 7.42413 13.025 23.2004 21.3789 16.0829 13.5411 14.5333 7.69931 5.23996 6.10269 12.2597 5.29594 15.0364 5.47782 3.56486 12.047 8.09582 12.2494 8.99449 5.45889 5.04285 3.2716 4.92 4.92915 111.898 70.151 41.7474 27.7765 3.10359 34.3195
internal_count=11168 5877 5169 708 428 363 336 247 221 65 5291 126 5165 4703 102 81 4601 344 4257 324 76 68 1078 305 4189 4127 773 294 280 248 201 479 126 277 462 170 62 89 279 297 278 197 173 200 109 107 83 135 81 165 55 78 43 178 131 100 138 57 52 75 101 4091 2551 1540 1029 89 1265
cat_boundaries=0 1 2 3 4 5 6 7 8 9 10 11 12 13 14 15 16 17 18 19 20 21
cat_threshold=2 2 1 1 1 1 1 1 2 2 2 1 1 1 2 1 2 1 1 1 2
is_linear=0
shrinkage=0.05


Tree=91
num_leaves=67
num_cat=20
split_feature=2 3 2 0 2 2 2 3 3 2 2 3 2 2 2 3 1 2 3 2 2 3 3 1 2 2 2 2 3 0 1 2 2 2 1 3 1 1 1 3 0 3 2 0 0 2 1 1 2 2 2 3 2 0 3 2 3 2 3 2 2 1 0 0 0 1
split_gain=17.0738 11.4378 5.52228 1.70094 1.63042 2.62108 2.01281 2.05247 6.75999 1.89945 1.50205 11.0843 1.75545 1.16057 1.13493 2.45211 3.4019 1.23383 5.62738 4.04471 2.21831 2.08675 1.29081 0.821411 0.809078 1.28095 0.695452 0.422768 0.192924 0.141699 0.103079 0.100198 0.0796845 0.065998 0.0355691 0.027571 0.0244542 0.0240829 0.0200828 0.0188543 0.0160443 0.0161433 0.0165776 0.0127381 0.0106222 0.00961841 0.0092645 0.00606423 0.00526466 0.00418014 0.00414729 0.00395702 0.00332779 0.00291974 0.00145997 0.00328185 0.00144521 0.000571879 0.000419273 0.000331273 0.000202007 9.00432e-05 0.000122196 7.89812e-06 3.43063e-06 2.29779e-06
threshold=7.5000000000000009 1.0000000180025095e-35 1.0000000180025095e-35 0 4.5000000000000009 3.5000000000000004 1.0000000180025095e-35 29.500000000000004 5.5000000000000009 6.5000000000000009 8.5000000000000018 1.5000000000000002 13.500000000000002 1.5000000000000002 14.500000000000002 1.5000000000000002 1 19.500000000000004 6.5000000000000009 20.500000000000004 15.500000000000002 1.0000000180025095e-35 1.5000000000000002 2 21.500000000000004 26.500000000000004 4.5000000000000009 6.5000000000000009 17.500000000000004 3 4 2.5000000000000004 5.5000000000000009 1.0000000180025095e-35 5 2.5000000000000004 6 7 8 3.5000000000000004 9 1.5000000000000002 12.500000000000002 10 11 5.5000000000000009 12 13 11.500000000000002 1.5000000000000002 9.5000000000000018 1.5000000000000002 5.5000000000000009 14 1.5000000000000002 11.500000000000002 1.5000000000000002 10.500000000000002 1.0000000180025095e-35 5.5000000000000009 3.5000000000000004 15 16 17 18 19
decision_type=2 2 2 9 2 2 2 2 2 2 2 2 2 2 2 2 1 2 2 2 2 2 2 1 2 2 2 2 2 9 1 2 2 2 1 2 1 1 1 2 9 2 2 9 9 2 1 1 2 2 2 2 2 9 2 2 2 2 2 2 2 1 9 9 9 1
left_child=1 2 61 4 5 6 7 8 -3 52 11 44 34 23 15 16 -14 18 20 22 21 -16 -19 -4 37 -26 31 30 33 -22 32 43 -28 35 39 56 49 -21 53 40 41 42 -12 47 -2 51 -46 -15 58 -8 -36 -35 -6 -33 55 57 65 -52 -42 -32 -40 62 -1 -63 -64 -5
right_child=10 3 13 28 9 -7 36 -9 -10 -11 12 -13 14 26 17 -17 -18 19 -20 24 29 -23 -24 -25 25 -27 27 -29 -30 -31 59 38 -34 45 50 -37 -38 -39 60 -41 48 -43 -44 -45 46 -47 -48 -49 -50 -51 54 -53 -54 -55 -56 -57 -58 -59 -60 -61 -62 63 64 -65 -66 -67
leaf_value=-0.024671034812643138 -0.0088568938442760755 0.0041232839556953676 0.0019519348758688486 -0.022058658312024752 -0.022140622486182936 0.042306788022679703 -0.022609221308334471 -0.0083081726559738039 0.048618041238045973 0.0068575555019490938 -0.011428665487609766 0.098128095078526087 0.051497540913012688 -0.020597984065267069 -0.013440824531954882 -0.017268526521425409 0.0068506914844104665 0.015715494753900907 0.019259763780060571 -0.013241051200737911 -0.0075596302394296076 0.021000160081286003 0.043643619062106745 -0.021278576160140672 0.0071199254888385209 0.0016707052767819597 -0.0078815217582981472 -0.017594946770959234 0.0076474955309736199 -0.016484212273158445 -0.013957688764038354 -0.01778032404299194 -0.0032772106130709183 -0.01523023710793662 -0.0087478841909454878 -0.013698627608264111 -0.014745948279856248 -0.0083036295893869263 -0.013389441255930685 -0.0052387203040098309 -0.0099421992605678855 -0.01503015957238563 -0.0066520080471076833 -0.018220090785178718 -0.015099055671741086 -0.0090106358460960191 -0.011112513077621173 -0.023062280609501551 -0.0061481596974279499 -0.019807326859260382 -0.0072146909819482911 -0.011871942312999935 -0.020454451042333229 -0.015707510823023497 -0.0056919169007460853 -0.0058498091945128304 -0.020373944342262862 -0.0082855791109407804 -0.0088029230370033264 -0.013127689811447123 -0.012744934160058112 -0.02477169238145923 -0.024813198003574927 -0.024829266322031477 -0.024750595161056439 -0.021957203906054181
leaf_weight=41.341701630502939 1.5823221169412136 45.890256877988577 28.647042587399483 2.2987326793372613 6.4021045863628387 5.1401822566986075 2.9043486341834059 15.189415991306303 10.487021610140799 12.050035290420055 11.228657431900503 3.2243736013770103 6.1453257650136948 3.5444354899227646 8.3029711991548556 5.4661405161023131 13.95583444833756 11.672124892473223 20.401713520288467 7.3923680037260038 4.9004566371440887 9.351507753133772 6.4091223925352088 4.3881310299038878 113.439343303442 2187.3413799926639 21.244404599070549 11.28323248401284 0.89515221863985139 48.135979987680912 2.6578682959079734 5.4987598881125432 16.850067690014839 1.8392215669155123 2.7622641175985327 1.5269219204783437 1.9175382964313028 3.7087926864624023 2.3916886262595654 1.8118250668048848 1.7112829759717016 2.5034991279244414 2.1669441759586325 2.232352375984191 3.5458348132669908 1.6598344482481477 2.4743432328104973 8.4438023567199689 2.0116959661245346 2.4574977159500122 2.3584563210606557 1.6768513955175874 5.3893635869026184 2.4584341309964657 3.2361126169562331 3.928148053586483 2.3075889572501183 2.6446406617760658 1.5292193181812761 2.1950111165642738 2.4727407097816467 7.2460909374058247 24.694704160094261 33.477891633287072 2.4011800903826979 0.73703569918870782
leaf_count=1522 26 193 198 71 18 27 25 26 28 22 149 17 33 83 53 21 48 46 20 43 43 23 22 107 275 3852 61 93 3 205 42 115 65 41 34 32 34 19 51 19 28 24 24 65 51 29 32 52 29 30 28 37 25 63 31 43 49 29 24 33 50 275 938 1265 91 18
internal_value=0 -0.010017 -0.0167171 0.0023808 0.00443651 0.00771231 0.005457 0.00800485 0.0124 -0.00710313 0.0018617 0.0204447 0.00178072 -0.00903608 0.00194612 0.0124254 0.0205001 0.00183546 -0.00387312 0.00205864 -0.0105494 0.00480243 0.025615 -0.00113382 0.00187441 0.00193938 -0.0122481 -0.00898202 -0.0147474 -0.0156596 -0.00671922 -0.018798 -0.00584493 -0.0164116 -0.00889872 -0.0196239 -0.019592 -0.0115915 -0.0155927 -0.0101339 -0.0105532 -0.0113447 -0.010656 -0.0216879 -0.0125024 -0.0121477 -0.0134606 -0.0223337 -0.0081573 -0.021325 -0.00699887 -0.0136286 -0.0213699 -0.0171399 -0.0066018 -0.00693149 -0.0213171 -0.00778076 -0.00940457 -0.0135823 -0.0130618 -0.0247602 -0.0247251 -0.024819 -0.0248077 -0.022034
internal_weight=0 344.239 223.47 120.769 107.828 83.9863 78.8461 71.5667 56.3773 23.8415 2495.34 10.8269 2484.52 114.308 2446.62 25.5673 20.1012 2421.06 91.0926 2329.96 70.6909 17.6545 18.0812 33.0352 2311.88 2300.78 81.2728 54.2306 12.9413 53.0364 42.9474 27.0422 38.0945 12.0462 37.8927 6.87028 7.27938 11.1012 12.8216 22.9631 21.1513 15.8991 13.3956 14.2206 7.6025 5.17591 6.02018 11.9882 5.2522 5.36185 14.9296 3.51607 11.7915 7.95719 12.1674 8.93125 5.34336 5.0031 3.2405 4.85288 4.86443 109.162 68.4376 40.724 27.0959 3.03577
internal_count=11168 5877 5169 708 428 363 336 247 221 65 5291 126 5165 1078 4703 102 81 4601 344 4257 324 76 68 305 4189 4127 773 294 280 248 201 479 126 277 462 170 89 62 279 297 278 197 173 200 109 107 83 135 81 55 165 78 43 178 131 100 138 57 52 75 101 4091 2551 1540 1029 89
cat_boundaries=0 1 2 3 4 5 6 7 8 9 10 11 12 13 14 15 16 17 18 19 20
cat_threshold=2 2 1 1 1 1 1 1 1 2 2 1 1 1 2 1 2 1 1 1
is_linear=0
shrinkage=0.05


Tree=92
num_leaves=69
num_cat=21
split_feature=2 3 2 0 2 2 2 3 3 2 2 3 2 2 2 3 1 2 3 2 2 3 3 1 2 2 2 2 3 0 2 1 2 2 1 3 1 1 1 3 0 3 2 0 0 3 1 2 1 2 2 2 2 0 3 3 2 2 2 3 2 2 1 0 0 0 1 0
split_gain=16.3728 11.1448 5.52651 1.63004 1.54187 2.3552 1.926 1.92727 6.01267 1.84653 1.38638 9.45853 1.67825 1.12896 1.05966 2.29491 2.98352 1.17465 5.3256 3.73041 2.15516 1.95993 1.12487 0.797673 0.775618 1.20485 0.688693 0.415841 0.187891 0.140275 0.100839 0.10066 0.0770957 0.0658959 0.0347304 0.0277075 0.0246006 0.0236836 0.0200035 0.0184072 0.0157294 0.0159383 0.0162303 0.0128992 0.0104639 0.00954367 0.00917119 0.00778305 0.00616405 0.00512832 0.00423938 0.00403433 0.0033757 0.00292238 0.00146567 0.00141574 0.0031867 0.00115437 0.000556827 0.000410253 0.000328265 0.000199876 9.22856e-05 0.000125233 8.09592e-06 3.51655e-06 2.33561e-06 1.77636e-15
threshold=7.5000000000000009 1.0000000180025095e-35 1.0000000180025095e-35 0 4.5000000000000009 3.5000000000000004 1.0000000180025095e-35 29.500000000000004 5.5000000000000009 6.5000000000000009 8.5000000000000018 1.5000000000000002 13.500000000000002 1.5000000000000002 14.500000000000002 1.5000000000000002 1 19.500000000000004 6.5000000000000009 20.500000000000004 15.500000000000002 1.0000000180025095e-35 1.5000000000000002 2 21.500000000000004 26.500000000000004 4.5000000000000009 6.5000000000000009 17.500000000000004 3 2.5000000000000004 4 5.5000000000000009 1.0000000180025095e-35 5 2.5000000000000004 6 7 8 3.5000000000000004 9 1.5000000000000002 12.500000000000002 10 11 2.5000000000000004 12 5.5000000000000009 13 11.500000000000002 1.5000000000000002 9.5000000000000018 5.5000000000000009 14 1.5000000000000002 1.5000000000000002 11.500000000000002 2.5000000000000004 10.500000000000002 1.0000000180025095e-35 5.5000000000000009 3.5000000000000004 15 16 17 18 19 20
decision_type=2 2 2 9 2 2 2 2 2 2 2 2 2 2 2 2 1 2 2 2 2 2 2 1 2 2 2 2 2 9 2 1 2 2 1 2 1 1 1 2 9 2 2 9 9 2 1 2 1 2 2 2 2 9 2 2 2 2 2 2 2 2 1 9 9 9 1 9
left_child=1 2 62 4 5 6 7 8 -3 52 11 44 34 23 15 16 -14 18 20 22 21 -16 -19 -4 37 -26 30 31 33 -22 43 32 -28 35 39 54 50 -21 53 40 41 42 -12 48 -2 47 -46 57 -15 59 -8 -36 -6 -32 66 56 58 -35 -53 -42 -33 -40 63 -1 -64 -65 -5 -66
right_child=10 3 13 28 9 -7 36 -9 -10 -11 12 -13 14 26 17 -17 -18 19 -20 24 29 -23 -24 -25 25 -27 27 -29 -30 -31 38 60 -34 45 51 -37 -38 -39 61 -41 49 -43 -44 -45 46 -47 -48 -49 -50 -51 -52 55 -54 -55 -56 -57 -58 -59 -60 -61 -62 -63 64 65 67 -67 -68 -69
leaf_value=-0.02466708258987459 -0.0087147999101399917 0.0040041508078154844 0.0018997124901192807 -0.021996861113413927 -0.022080430306110056 0.03952571852690856 -0.022558455851938899 -0.0081703409538469111 0.045132590646883186 0.0066410047322149864 -0.011274635808549514 0.086635605493465551 0.04766639369820435 -0.020509924084472275 -0.013286721352543097 -0.017136829881523166 0.0066344036473091998 0.015083294579356674 0.018418744149408622 -0.013086590512042515 -0.0074285834272756444 0.020047768371704515 0.040719487699582231 -0.021202212889326826 0.006893257135655537 0.0016264686238286507 -0.0077474200818481963 -0.017466532749470565 0.0074000767269506718 -0.016345510952801148 -0.017653870117230106 -0.013804882637336757 -0.0032064641141101901 -0.016123147532007182 -0.0086065889440019288 -0.013545103894926684 -0.014596158318893958 -0.0081658354265467005 -0.013235237792021763 -0.0051358217125595691 -0.0097934510197012839 -0.01488176485641042 -0.0065306899474353725 -0.018098567373617688 -0.014951023298309708 -0.0084396115454520148 -0.01095923511355577 -0.0096714047018971738 -0.023021055670348491 -0.0060329514362397309 -0.019706863947138869 -0.0070871475310557708 -0.020364045415401523 -0.015563099849106582 -0.02028224043693113 -0.0055826780411805908 -0.0057384574895997702 -0.013960612708541967 -0.0081479358349197759 -0.0086612213295695767 -0.012973062673073417 -0.012589934507908499 -0.024770246957787651 -0.024812794889528714 -0.024829264086213297 -0.024748623480337916 -0.021893444778198531 -0.024829265498254288
leaf_weight=40.334238395094872 1.5683695375919342 46.079865466803312 28.703015394508839 2.2485811375081521 6.2619156911969185 5.3623126931488505 2.8394203856587401 15.063742548227308 11.009477660059927 12.132953085005283 11.101059526205065 3.5568197444081306 6.4700853228569031 3.4721741154789951 8.1921189948916453 5.3725586757063857 14.051770582795148 11.857007101178171 20.798453867435455 7.2951305508613569 4.8635507300496101 9.5499674156308156 6.6950333267450324 4.2957442216575137 114.24990522861481 2190.9988348558545 21.077624782919884 11.086440961807964 0.90202412754297334 47.348999686539173 5.4018543437123281 2.6210283972322932 16.794936463236809 0.96472734585404474 2.738205447793006 1.5061478167772291 1.8894698508083818 3.6781237572431564 2.3598787263035774 1.8023582473397244 1.6943533457815676 2.4661525338888159 2.1525775194168082 2.1920469775795928 3.4926983229815942 1.3798717334866522 2.4469992518424988 1.0562435947358606 8.2512975931167585 1.9993657283484934 2.4093001782894135 2.3415021002292615 5.280246801674366 2.4201198779046535 2.2610499896109104 3.2177452370524398 3.9052362740039825 1.7125863768160341 2.6228189244866371 1.5158168040215967 2.1663839742541313 2.4414257556200027 7.0687982719391584 24.089489284902811 31.090991660952568 2.3424789439886835 0.72102881222963189 1.565904278308152
leaf_count=1522 26 193 198 71 18 27 25 26 28 22 149 17 33 83 53 21 48 46 20 43 43 23 22 107 275 3852 61 93 3 205 115 42 65 27 34 32 34 19 51 19 28 24 24 65 51 25 32 20 52 29 30 28 25 63 49 31 43 35 29 24 33 50 275 938 1204 91 18 61
internal_value=0 -0.00987 -0.0165807 0.00231072 0.00430117 0.00745578 0.00528695 0.00773801 0.0119356 -0.00697855 0.00181151 0.0194708 0.00173301 -0.00889332 0.00189371 0.0119548 0.0195709 0.0017863 -0.00379472 0.00200324 -0.0103991 0.00465611 0.0243348 -0.00110767 0.00182437 0.00188749 -0.0120934 -0.00883927 -0.0145979 -0.0155149 -0.0186836 -0.00659722 -0.00573369 -0.0162724 -0.00875639 -0.0195208 -0.0194884 -0.0114372 -0.0154476 -0.0099843 -0.0104018 -0.0111909 -0.0105042 -0.0216191 -0.0123473 -0.0119928 -0.0133065 -0.013306 -0.0222773 -0.00802077 -0.0212495 -0.00687365 -0.0212952 -0.017007 -0.0212414 -0.00648108 -0.00680701 -0.0147398 -0.0076476 -0.00925882 -0.0134285 -0.0129071 -0.0247584 -0.0247225 -0.0248188 -0.0248071 -0.0219718 -0.0248293
internal_weight=0 340.857 219.776 121.081 108.329 84.6536 79.2913 72.1531 57.0893 23.6751 2500.04 11.0649 2488.98 113.284 2451.42 25.8944 20.5219 2425.53 90.7531 2334.77 69.9546 17.7421 18.552 32.9988 2316.22 2305.25 80.2852 53.7464 12.7523 52.2126 26.5388 42.66 37.8726 11.8502 37.5572 6.73681 7.13819 10.9733 12.6233 22.7317 20.9293 15.7198 13.2536 13.9155 7.50807 5.11343 5.9397 3.73356 11.7235 5.20954 5.24872 14.8255 11.5422 7.82197 5.23066 12.0873 8.86956 2.67731 4.96432 3.21017 4.78741 4.8013 106.492 66.7662 39.7257 26.432 2.96961 32.6569
internal_count=11168 5877 5169 708 428 363 336 247 221 65 5291 126 5165 1078 4703 102 81 4601 344 4257 324 76 68 305 4189 4127 773 294 280 248 479 201 126 277 462 170 89 62 279 297 278 197 173 200 109 107 83 82 135 81 55 165 43 178 138 131 100 62 57 52 75 101 4091 2551 1540 1029 89 1265
cat_boundaries=0 1 2 3 4 5 6 7 8 9 10 11 12 13 14 15 16 17 18 19 20 21
cat_threshold=2 2 1 1 1 1 1 1 1 2 2 1 1 1 2 1 2 1 1 1 2
is_linear=0
shrinkage=0.05


Tree=93
num_leaves=70
num_cat=21
split_feature=2 3 2 0 2 2 2 3 3 2 2 3 2 2 2 3 3 1 2 3 2 2 3 3 1 2 2 2 2 3 0 2 1 2 2 1 3 1 1 1 3 0 3 2 0 0 3 1 2 1 2 2 2 2 0 3 3 2 2 2 3 2 2 1 0 0 0 1 0
split_gain=15.6991 10.8573 5.52919 1.56225 1.45862 2.12329 1.84362 1.81089 5.37049 1.79513 1.28193 8.1741 1.60439 1.09786 0.990104 2.15067 2.77012 1.17341 1.11832 5.04314 3.44556 2.09352 1.84258 0.985196 0.774581 0.7435 1.13364 0.681718 0.408865 0.182981 0.138807 0.101452 0.0982598 0.0745671 0.0657675 0.0338972 0.0278353 0.0247396 0.0232804 0.0199158 0.0179634 0.0154138 0.0157288 0.0158835 0.0130591 0.0103033 0.00939126 0.00907465 0.00768947 0.00626436 0.00499349 0.00429847 0.0039229 0.00342352 0.00292383 0.00148607 0.00137235 0.00309315 0.00114869 0.000541953 0.000401249 0.000325133 0.000197676 9.45894e-05 0.000128347 8.29833e-06 3.60462e-06 2.37376e-06 8.88178e-16
threshold=7.5000000000000009 1.0000000180025095e-35 1.0000000180025095e-35 0 4.5000000000000009 3.5000000000000004 1.0000000180025095e-35 29.500000000000004 5.5000000000000009 6.5000000000000009 8.5000000000000018 1.5000000000000002 13.500000000000002 1.5000000000000002 14.500000000000002 1.5000000000000002 1.0000000180025095e-35 1 19.500000000000004 6.5000000000000009 20.500000000000004 15.500000000000002 1.0000000180025095e-35 1.5000000000000002 2 21.500000000000004 26.500000000000004 4.5000000000000009 6.5000000000000009 17.500000000000004 3 2.5000000000000004 4 5.5000000000000009 1.0000000180025095e-35 5 2.5000000000000004 6 7 8 3.5000000000000004 9 1.5000000000000002 12.500000000000002 10 11 2.5000000000000004 12 5.5000000000000009 13 11.500000000000002 1.5000000000000002 9.5000000000000018 5.5000000000000009 14 1.5000000000000002 1.5000000000000002 11.500000000000002 2.5000000000000004 10.500000000000002 1.0000000180025095e-35 5.5000000000000009 3.5000000000000004 15 16 17 18 19 20
decision_type=2 2 2 9 2 2 2 2 2 2 2 2 2 2 2 2 2 1 2 2 2 2 2 2 1 2 2 2 2 2 9 2 1 2 2 1 2 1 1 1 2 9 2 2 9 9 2 1 2 1 2 2 2 2 9 2 2 2 2 2 2 2 2 1 9 9 9 1 9
left_child=1 2 63 4 5 6 7 8 -3 53 11 45 35 24 15 16 17 -14 19 21 23 22 -16 -20 -4 38 -27 31 32 34 -23 44 33 -29 36 40 55 51 -22 54 41 42 43 -12 49 -2 48 -47 58 -15 60 -8 -37 -6 -33 67 57 59 -36 -54 -43 -34 -41 64 -1 -65 -66 -5 -67
right_child=10 3 13 29 9 -7 37 -9 -10 -11 12 -13 14 27 18 -17 -18 -19 20 -21 25 30 -24 -25 -26 26 -28 28 -30 -31 -32 39 61 -35 46 52 -38 -39 -40 62 -42 50 -44 -45 -46 47 -48 -49 -50 -51 -52 -53 56 -55 -56 -57 -58 -59 -60 -61 -62 -63 -64 65 66 68 -68 -69 -70
leaf_value=-0.024663031431850908 -0.0085737518901207784 0.0038889286553064973 0.0018489832253324821 -0.021933867502782436 -0.022019059714948136 0.03703165918443415 -0.022506647622442352 -0.0080336741141129025 0.042045225379633268 0.0064327022086646526 -0.01112094791319234 0.077385270916759896 0.017408178062469869 -0.020420420143390138 -0.013132335370452473 -0.017003869743084387 0.048440804302996077 -0.012011739037616006 0.014485797710446204 0.017629460077958063 -0.012931909018756949 -0.0072988397550891523 0.019157042764673129 0.038103987355957616 -0.021124489869267023 0.0066753379240745321 0.001583474172209446 -0.007614565651706132 -0.017336801507020567 0.0071624571712571141 -0.016205700060351491 -0.017526071986376898 -0.013651636482760618 -0.0031370207242976521 -0.015981640260042292 -0.0084663645859367979 -0.013391218843050959 -0.014445699346619038 -0.0080292074606258257 -0.013080768140168892 -0.0050344193548043214 -0.0096454750924755417 -0.014732621469588781 -0.0064107965745449835 -0.017975642641814754 -0.014802224494584815 -0.0083007038104009473 -0.010806394202307066 -0.0095240957493693129 -0.022978947595225795 -0.0059192115926089278 -0.019604916001898016 -0.0069609603284013447 -0.020272183420591994 -0.015417761498649091 -0.020189074724123946 -0.0054749299760213964 -0.005628590900844322 -0.013807815106107364 -0.0080114622467207641 -0.008520578153865364 -0.012818250152505395 -0.012434868562386465 -0.024768768962672716 -0.024812381697720671 -0.024829264247383628 -0.024746602551123667 -0.021828461103616338 -0.024829265163123466
leaf_weight=39.351481713354588 1.5547609254717827 46.264746997505426 28.757595006376505 2.1996593680232746 6.1251652464270592 5.5785061195492736 2.7760845124721518 14.941168218851088 11.517747253179548 12.213796086609364 10.976601853966715 3.8787091374397278 10.142188191413879 3.4016853794455555 8.0839924812316912 5.2812744230031958 5.6987508460879317 5.0903258770704314 12.037205815315248 21.185084998607635 7.2002842426300031 4.827555239200592 9.7433549091219884 6.973278120160102 4.2056238278746596 115.04017989337444 2194.5653277635574 20.914958506822586 10.89448084682226 0.90872395783662874 46.581347152590752 5.3073274642229062 2.5850940383970729 16.741170652210712 0.94929761067032892 2.7147399112582198 1.4858844503760336 1.8620910830795763 3.6482111066579819 2.3288509398698807 1.793125383555888 1.6778407990932493 2.4297235533595076 2.138565480709075 2.1527308933436862 3.4408672340214235 1.3682751543819902 2.4203284978866577 1.0460774712264536 8.0635132789611799 1.9873398989439008 2.3622852340340614 2.3249660730361921 5.1738070547580719 2.3827468752861023 2.2156528122723103 3.1998316422104827 3.8828904032707214 1.6888437904417513 2.6015351116657257 1.502744674682617 2.1384607553482056 2.410881020128727 6.8958528805524111 23.499116543680429 30.328530639410019 2.2852173671126392 0.70541453361511086 1.527502760291102
leaf_count=1522 26 193 198 71 18 27 25 26 28 22 149 17 37 83 53 21 15 29 46 20 43 43 23 22 107 275 3852 61 93 3 205 115 42 65 27 34 32 34 19 51 19 28 24 24 65 51 25 32 20 52 29 30 28 25 63 49 31 43 35 29 24 33 50 275 938 1204 91 18 61
internal_value=0 -0.00972372 -0.0164432 0.00224314 0.00417088 0.00721013 0.00512344 0.00748249 0.0114946 -0.0068553 0.0017628 0.0185696 0.00168667 -0.00875156 0.00184283 0.0115084 0.0187024 0.00757678 0.00173856 -0.00371754 0.00194944 -0.0102494 0.00451509 0.0231492 -0.0010821 0.00177576 0.0018371 -0.0119387 -0.00869752 -0.0144478 -0.0153693 -0.0185677 -0.00647664 -0.00562394 -0.0161321 -0.00861509 -0.0194161 -0.0193833 -0.0112832 -0.0153016 -0.0098354 -0.010251 -0.0110375 -0.0103529 -0.0215489 -0.0121923 -0.0118379 -0.0131522 -0.0131516 -0.0222198 -0.00788543 -0.0211726 -0.00674982 -0.0212192 -0.0168728 -0.0211644 -0.00636179 -0.00668392 -0.01459 -0.0075157 -0.00911399 -0.0132743 -0.0127522 -0.0247566 -0.0247198 -0.0248185 -0.0248066 -0.0219083 -0.0248293
internal_weight=0 337.556 216.173 121.383 108.815 85.3026 79.7241 72.7237 57.7825 23.5128 2504.62 11.2947 2493.33 112.285 2456.1 26.2125 20.9313 15.2325 2429.89 90.4213 2339.46 69.2362 17.8273 19.0105 32.9632 2320.45 2309.61 79.3219 53.2742 12.5678 51.4089 26.0477 42.3797 37.6561 11.6591 37.2299 6.60661 7.00046 10.8485 12.4298 22.5059 20.7128 15.5449 13.1152 13.6179 7.41596 5.05249 5.8612 3.68422 11.4652 5.16793 5.13837 14.724 11.299 7.69007 5.12073 12.0092 8.80939 2.63814 4.9265 3.18059 4.72355 4.73973 103.888 65.1358 38.7519 25.7843 2.90507 31.856
internal_count=11168 5877 5169 708 428 363 336 247 221 65 5291 126 5165 1078 4703 102 81 66 4601 344 4257 324 76 68 305 4189 4127 773 294 280 248 479 201 126 277 462 170 89 62 279 297 278 197 173 200 109 107 83 82 135 81 55 165 43 178 138 131 100 62 57 52 75 101 4091 2551 1540 1029 89 1265
cat_boundaries=0 1 2 3 4 5 6 7 8 9 10 11 12 13 14 15 16 17 18 19 20 21
cat_threshold=2 1 1 1 1 1 1 1 1 2 2 1 1 1 2 1 2 1 1 1 2
is_linear=0
shrinkage=0.05


Tree=94
num_leaves=69
num_cat=21
split_feature=2 3 2 0 2 2 2 2 3 3 2 3 2 2 2 1 3 3 2 3 2 2 3 3 1 2 2 2 2 3 0 2 1 2 2 1 3 1 1 1 3 0 3 2 0 0 2 1 1 2 2 3 2 2 0 3 3 2 2 3 2 2 1 0 0 0 1 0
split_gain=15.0517 10.5753 5.53031 1.4974 1.3803 1.91995 1.76537 1.74516 1.70258 4.81498 1.18724 7.13702 1.5337 1.06728 0.925361 1.43407 6.20974 2.18473 1.06468 4.7784 3.18678 2.03335 1.7338 0.866807 0.752117 0.712671 1.06697 0.674534 0.401848 0.17819 0.137296 0.102033 0.0958795 0.0720986 0.0656129 0.0330701 0.0279543 0.0248711 0.0228738 0.0198199 0.0175232 0.0150978 0.0155148 0.0155374 0.0132176 0.0101405 0.00924145 0.00897501 0.00636509 0.00486028 0.00435738 0.00388071 0.00381307 0.00347123 0.00292409 0.0015064 0.00132983 0.00300124 0.000527265 0.000392271 0.000321883 0.000195409 9.69511e-05 0.000131532 8.50652e-06 3.69468e-06 2.41204e-06 1.77636e-15
threshold=7.5000000000000009 1.0000000180025095e-35 1.0000000180025095e-35 0 4.5000000000000009 3.5000000000000004 1.0000000180025095e-35 6.5000000000000009 29.500000000000004 5.5000000000000009 8.5000000000000018 1.5000000000000002 13.500000000000002 1.5000000000000002 14.500000000000002 1 1.0000000180025095e-35 1.0000000180025095e-35 19.500000000000004 6.5000000000000009 20.500000000000004 15.500000000000002 1.0000000180025095e-35 1.5000000000000002 2 21.500000000000004 26.500000000000004 4.5000000000000009 6.5000000000000009 17.500000000000004 3 2.5000000000000004 4 5.5000000000000009 1.0000000180025095e-35 5 2.5000000000000004 6 7 8 3.5000000000000004 9 1.5000000000000002 12.500000000000002 10 11 5.5000000000000009 12 13 11.500000000000002 1.5000000000000002 1.5000000000000002 9.5000000000000018 5.5000000000000009 14 1.5000000000000002 1.5000000000000002 11.500000000000002 10.500000000000002 1.0000000180025095e-35 5.5000000000000009 3.5000000000000004 15 16 17 18 19 20
decision_type=2 2 2 9 2 2 2 2 2 2 2 2 2 2 2 1 2 2 2 2 2 2 2 2 1 2 2 2 2 2 9 2 1 2 2 1 2 1 1 1 2 9 2 2 9 9 2 1 1 2 2 2 2 2 9 2 2 2 2 2 2 2 1 9 9 9 1 9
left_child=1 2 62 4 5 6 8 53 9 -3 11 45 35 24 15 17 -17 -14 19 21 23 22 -16 -20 -4 38 -27 31 32 34 -23 44 33 -29 36 40 55 50 -22 54 41 42 43 -12 48 -2 51 -47 -15 59 -8 -36 -37 -6 -33 66 57 58 -54 -43 -34 -41 63 -1 -64 -65 -5 -66
right_child=10 3 13 29 7 -7 37 -9 -10 -11 12 -13 14 27 18 16 -18 -19 20 -21 25 30 -24 -25 -26 26 -28 28 -30 -31 -32 39 60 -35 46 52 -38 -39 -40 61 -42 49 -44 -45 -46 47 -48 -49 -50 -51 -52 -53 56 -55 -56 -57 -58 -59 -60 -61 -62 -63 64 65 67 -67 -68 -69
leaf_value=-0.024658879885664255 -0.0084337818939189835 0.003777461893480054 0.0017996996185479096 -0.021869658540327158 -0.021956495946163775 0.034782743305620985 -0.022453780899262161 0.0062322486735395689 -0.0078982004326214033 0.039291765223281871 -0.010967647560538569 0.069773683420801036 0.016679264612174206 -0.020329463823235139 -0.012977714359172138 -0.011856850183980847 0.068607055007013404 -0.020169877876414763 0.013920392779539681 0.016887495308685507 -0.012777054011631409 -0.0071704198632495013 0.01832241589500205 0.035751091677312802 -0.021045396547648299 0.0064657344608343038 0.0015416833485149028 -0.0074829821617308336 -0.017205773945574564 0.0069341365388280955 -0.016064810570419103 -0.017396947550944043 -0.013497997457267888 -0.0030688643138520352 -0.014795972909787125 -0.0083272422206003439 -0.013237019430618611 -0.014294612562276513 -0.0078937735095612315 -0.01292607946069322 -0.004934512575745645 -0.0094983116612890051 -0.014582770399163562 -0.0062923396191436574 -0.017851331128051064 -0.014652697426424888 -0.0085724033731423895 -0.010654035348662286 -0.022935935186104667 -0.0058069469649635339 -0.01950148305525435 -0.011403563663323429 -0.0068361457418379653 -0.020178858593084222 -0.015271532445981412 -0.020094441550977754 -0.0053686757678833089 -0.005520213274634673 -0.0078761856826916384 -0.0083810251469134556 -0.012663298424521453 -0.012279783216365034 -0.024767251291546298 -0.024811955475078726 -0.024829264297291084 -0.024744530376521447 -0.021762238115380181 -0.024829265958574334
leaf_weight=38.392824906855822 1.5414877571165562 46.445017699152231 28.810815375298262 2.1519376151263696 5.9917686954140663 5.7889603376388541 2.7143019810318938 12.292617075145245 14.821616411209105 12.012338206171988 10.855207763612272 4.1907833740115166 10.320290334522726 3.3329259939491775 7.9785247743129757 5.0295478403568286 4.5824145674705505 6.5914151258766642 12.212842971086504 21.561878383159637 7.1077703833579999 4.7924479842185974 9.9318079948425275 7.2441152185201636 4.1177138574421397 115.81068044900894 2198.0431215539575 20.756305143237114 10.707233007997273 0.9152560234069832 45.832547649741173 5.2151212915778142 2.5500430613756171 16.688736528158188 1.7596158385276797 2.6918530166149131 1.4661192558705805 1.835385277867317 3.6190361380577087 2.2985861711204052 1.784120738506316 1.6617350056767493 2.3941897600889197 2.1248995363712302 2.1143798120319834 3.3903099633753282 1.6150906793773172 2.3943143412470818 7.8803355097770682 1.9756112173199651 2.3164237961173058 1.618351526558399 2.3088383153080922 5.0699786692857742 2.346292071044445 2.1713693514466286 3.1823606938123694 3.8610965833067894 2.5807763561606407 1.4899948090314863 2.1112244203686714 2.3810876831412315 6.7271492443978786 22.923222526907921 29.584766380488873 2.2293599341064718 0.69018327444791649 1.4900429360568548
leaf_count=1522 26 193 198 71 18 27 25 22 26 28 149 17 37 83 53 29 13 23 46 20 43 43 23 22 107 275 3852 61 93 3 205 115 42 65 41 34 32 34 19 51 19 28 24 24 65 51 29 32 52 29 30 37 28 25 63 49 31 43 29 24 33 50 275 938 1204 91 18 61
internal_value=0 -0.00957817 -0.0163046 0.00217792 0.00404537 0.00697472 0.00496612 -0.00673339 0.00723763 0.0110753 0.0017155 0.0177322 0.00164165 -0.00861083 0.0017934 0.0110821 0.0265036 0.00231714 0.00169218 -0.00364159 0.00189719 -0.0101002 0.00437913 0.0220483 -0.00105708 0.00172853 0.00178814 -0.0117842 -0.00855683 -0.014297 -0.0152228 -0.0184504 -0.00635748 -0.00551567 -0.0159908 -0.00847487 -0.01931 -0.0192767 -0.0111295 -0.0151547 -0.00968726 -0.0101009 -0.0108844 -0.0102023 -0.0214775 -0.0120373 -0.0116833 -0.0129976 -0.0221612 -0.00775131 -0.0210944 -0.0131707 -0.00662739 -0.0211417 -0.0167374 -0.021086 -0.00624394 -0.00656224 -0.00738509 -0.00897011 -0.0131199 -0.0125972 -0.0247548 -0.0247171 -0.0248182 -0.024806 -0.0218436 -0.0248293
internal_weight=0 334.334 212.658 121.676 109.288 85.934 80.1451 23.3544 73.279 58.4574 2509.09 11.5169 2497.57 111.311 2460.66 26.5237 9.61196 16.9117 2434.13 90.0972 2344.04 68.5353 17.9103 19.457 32.9285 2324.58 2313.85 78.3823 52.8135 12.3879 50.625 25.5687 42.1063 37.445 11.4727 36.9107 6.47961 6.86611 10.7268 12.2411 22.2858 20.5016 15.3743 12.9801 13.3276 7.32611 4.99306 5.78462 11.2133 5.12734 5.03073 3.37797 14.6249 11.0617 7.56141 5.01349 11.9331 8.75071 4.88961 3.15173 4.66127 4.67967 101.347 63.5454 37.802 25.1526 2.84212 31.0748
internal_count=11168 5877 5169 708 428 363 336 65 247 221 5291 126 5165 1078 4703 102 42 60 4601 344 4257 324 76 68 305 4189 4127 773 294 280 248 479 201 126 277 462 170 89 62 279 297 278 197 173 200 109 107 83 135 81 55 78 165 43 178 138 131 100 57 52 75 101 4091 2551 1540 1029 89 1265
cat_boundaries=0 1 2 3 4 5 6 7 8 9 10 11 12 13 14 15 16 17 18 19 20 21
cat_threshold=2 1 1 1 1 1 1 1 1 2 2 1 1 1 2 1 2 1 1 1 2
is_linear=0
shrinkage=0.05


Tree=95
num_leaves=70
num_cat=22
split_feature=2 3 2 0 2 2 2 2 3 3 2 3 2 2 2 1 3 3 2 3 2 2 1 3 1 2 2 2 2 3 0 2 1 2 2 1 3 1 1 1 3 0 3 2 0 0 3 1 2 1 2 2 2 2 0 3 3 2 2 2 3 2 2 1 0 0 0 1 0
split_gain=14.4296 10.2985 5.52989 1.43535 1.30658 1.7408 1.6966 1.69098 1.60167 4.33158 1.10109 6.28481 1.46604 1.03721 0.864215 1.30588 5.42567 2.08059 1.01362 4.52994 2.95115 1.97463 1.71703 0.765825 0.730264 0.683079 1.00454 0.667149 0.394796 0.173513 0.135745 0.102584 0.0935208 0.0696902 0.0654326 0.0322498 0.0280643 0.0249949 0.0224643 0.0197157 0.0170869 0.0147818 0.0152968 0.0151924 0.0133747 0.00997581 0.00923359 0.00887237 0.00748725 0.00646619 0.00472875 0.00441607 0.0037049 0.00351878 0.00292314 0.00152665 0.00128817 0.002911 0.00116597 0.000512773 0.000383328 0.000318516 0.000193076 9.93667e-05 0.000134797 8.71958e-06 3.78698e-06 2.45052e-06 2.66454e-15
threshold=7.5000000000000009 1.0000000180025095e-35 1.0000000180025095e-35 0 4.5000000000000009 3.5000000000000004 6.5000000000000009 1.0000000180025095e-35 29.500000000000004 5.5000000000000009 8.5000000000000018 1.5000000000000002 13.500000000000002 1.5000000000000002 14.500000000000002 1 1.0000000180025095e-35 1.0000000180025095e-35 19.500000000000004 6.5000000000000009 20.500000000000004 15.500000000000002 2 1.5000000000000002 3 21.500000000000004 26.500000000000004 4.5000000000000009 6.5000000000000009 17.500000000000004 4 2.5000000000000004 5 5.5000000000000009 1.0000000180025095e-35 6 2.5000000000000004 7 8 9 3.5000000000000004 10 1.5000000000000002 12.500000000000002 11 12 2.5000000000000004 13 5.5000000000000009 14 11.500000000000002 1.5000000000000002 9.5000000000000018 5.5000000000000009 15 1.5000000000000002 1.5000000000000002 11.500000000000002 2.5000000000000004 10.500000000000002 1.0000000180025095e-35 5.5000000000000009 3.5000000000000004 16 17 18 19 20 21
decision_type=2 2 2 9 2 2 2 2 2 2 2 2 2 2 2 1 2 2 2 2 2 2 1 2 1 2 2 2 2 2 9 2 1 2 2 1 2 1 1 1 2 9 2 2 9 9 2 1 2 1 2 2 2 2 9 2 2 2 2 2 2 2 2 1 9 9 9 1 9
left_child=1 2 63 4 5 7 53 8 9 -3 11 45 35 24 15 17 -17 -14 19 21 23 22 -16 -20 -4 38 -27 31 32 34 -23 44 33 -29 36 40 55 51 -22 54 41 42 43 -12 49 -2 48 -47 58 -15 60 -9 -37 -6 -33 67 57 59 -36 -54 -43 -34 -41 64 -1 -65 -66 -5 -67
right_child=10 3 13 29 6 -7 -8 37 -10 -11 12 -13 14 27 18 16 -18 -19 20 -21 25 30 -24 -25 -26 26 -28 28 -30 -31 -32 39 61 -35 46 52 -38 -39 -40 62 -42 50 -44 -45 -46 47 -48 -49 -50 -51 -52 -53 56 -55 -56 -57 -58 -59 -60 -61 -62 -63 -64 65 66 68 -68 -69 -70
leaf_value=-0.024654626571712846 -0.0082949212218144368 0.0036696042433888888 0.0017518189769578042 -0.021804221164893736 -0.021892721703239894 0.032744917576791481 0.0060392676130967011 -0.022399839218070965 -0.0077639458164062425 0.036821189075949452 -0.010814781370202305 0.063397907057487199 0.015992673193116431 -0.020237048639061686 -0.013991912627678172 -0.011702122779152975 0.062411622234441966 -0.020074944570884955 0.013384720410134785 0.01618891912237266 -0.012622074957194394 -0.0070433434378003651 0.01732884810494861 0.033623534461750267 -0.020964918988709915 0.0062640419166495563 0.0015010590527781507 -0.0073526934220202291 -0.017073470875138729 0.0067146467736316461 -0.015922874273570729 -0.017266516593970823 -0.013344011222558745 -0.0030019814252755499 -0.015719295883943184 -0.0081892523140083464 -0.013082552990981071 -0.014142942504795843 -0.0077595594775071918 -0.012771218496193268 -0.0048360991663808136 -0.0093519996863754215 -0.014432253362560635 -0.006175331847400177 -0.017725646166116486 -0.014502484867887085 -0.0079921564112400405 -0.010502205407589197 -0.0092446042674809454 -0.022892008318190354 -0.0056961640315506537 -0.019396563306481641 -0.0067127208301669614 -0.020084064453156501 -0.015124451318640887 -0.01999833626650524 -0.0052639173038565266 -0.0054133286863823271 -0.013497528336417548 -0.0077421327960212703 -0.0082425927710699492 -0.012508257127091993 -0.012124727975544701 -0.024765695964226536 -0.024811520845507081 -0.024829263476616414 -0.02474240868305903 -0.021694761465507799 -0.024829265274528639
leaf_weight=37.457678306847811 1.5285418406128883 46.6207938157022 28.862712426111102 2.1053862553089839 5.8616444244980812 5.9938590973615637 12.369466483592987 2.6540347561240187 14.705013602972029 12.493719577789305 10.736802257597448 4.4936323016881943 10.493868976831438 3.2658535987138775 7.5138397440314293 4.9702653884887713 4.9078359976410866 6.459798850119113 12.384039580821993 21.929096311330795 7.0175315067172033 4.7582070305943489 10.477271199226381 7.5077853798866263 4.0319605879485598 116.56190889328718 2201.4344196096063 20.601566582918167 10.524582572281359 0.92162454873323518 45.102138705551624 5.1251787245273572 2.515853874385356 16.637599050998688 0.92196033522486764 2.6695303395390502 1.4468400403857229 1.8093357458710668 3.5905807614326477 2.2690657563507557 1.7753386572003353 1.6460260823369055 2.3595291823148719 2.1115708053112021 2.0769703537225714 3.3409950993955118 1.3432009667158125 2.3689405024051666 1.0273173935711382 7.7016496062278739 1.9641721509397028 2.2716877609491348 2.2931085601448995 4.9686977490782738 2.3107327520847321 2.1281722635030746 3.1653213426470748 3.8398411720991135 1.6425996012985704 2.5605294406414032 1.4775593020021913 2.0846579819917679 2.3520272374153137 6.5625823568552732 22.36145081371069 28.859243631362915 2.1748724058270481 0.67532557994127129 1.4535018540918851
leaf_count=1522 26 193 198 71 18 27 22 25 26 28 149 17 37 83 32 29 13 23 46 20 43 43 44 22 107 275 3852 61 93 3 205 115 42 65 27 34 32 34 19 51 19 28 24 24 65 51 25 32 20 52 29 30 28 25 63 49 31 43 35 29 24 33 50 275 938 1204 91 18 61
internal_value=0 -0.00943339 -0.016165 0.00211495 0.00392438 0.00674895 -0.00661283 0.00481465 0.00700282 0.0106761 0.00166952 0.0169514 0.00159785 -0.00847116 0.00174534 0.0106697 0.0251206 0.00224995 0.00164713 -0.00356686 0.00184645 -0.00995179 0.00424799 0.0210235 -0.00103261 0.00168264 0.00174057 -0.0116298 -0.00841721 -0.0141457 -0.0150755 -0.0183317 -0.00623977 -0.0054089 -0.0158484 -0.00833574 -0.0192025 -0.0191687 -0.0109762 -0.015007 -0.00953992 -0.00995139 -0.0107319 -0.0100523 -0.0214047 -0.0118825 -0.0115289 -0.0128428 -0.0128514 -0.0221014 -0.00761845 -0.0210148 -0.00650637 -0.021063 -0.0166009 -0.0210062 -0.00612754 -0.00644199 -0.0142963 -0.00725579 -0.00882721 -0.0129653 -0.0124422 -0.024753 -0.0247143 -0.024818 -0.0248054 -0.0217776 -0.0248293
internal_weight=0 331.19 209.23 121.961 109.748 86.5484 23.1998 80.5546 73.8195 59.1145 2513.44 11.7321 2501.71 110.36 2465.11 26.8318 9.8781 16.9537 2438.28 89.7806 2348.5 67.8515 17.9911 19.8918 32.8947 2328.6 2318 77.4657 52.3643 12.2124 49.8603 25.1015 41.8397 37.2392 11.2908 36.5993 6.35572 6.73506 10.6081 12.057 22.071 20.2957 15.2079 12.8484 13.0445 7.23848 4.93508 5.70994 3.59188 10.9675 5.08776 4.92572 14.5283 10.8303 7.43591 4.90888 11.8588 8.69348 2.56456 4.85364 3.12359 4.60051 4.62109 98.8693 61.994 36.8753 24.5363 2.78071 30.3127
internal_count=11168 5877 5169 708 428 363 65 336 247 221 5291 126 5165 1078 4703 102 42 60 4601 344 4257 324 76 68 305 4189 4127 773 294 280 248 479 201 126 277 462 170 89 62 279 297 278 197 173 200 109 107 83 82 135 81 55 165 43 178 138 131 100 62 57 52 75 101 4091 2551 1540 1029 89 1265
cat_boundaries=0 1 2 3 4 5 6 7 8 9 10 11 12 13 14 15 16 17 18 19 20 21 22
cat_threshold=2 1 2 1 1 1 1 1 1 1 2 2 1 1 1 2 1 2 1 1 1 2
is_linear=0
shrinkage=0.05


Tree=96
num_leaves=69
num_cat=21
split_feature=2 3 2 0 2 2 2 2 3 3 2 3 2 2 2 1 3 3 2 3 2 2 1 1 3 2 2 2 2 3 0 2 1 2 2 1 3 1 1 1 3 0 3 2 0 1 3 2 1 2 2 2 2 0 3 3 2 2 2 3 2 2 1 0 0 0 1 0
split_gain=13.8319 10.0269 5.52791 1.37596 1.23713 1.64937 1.58228 1.62022 1.50755 3.90869 1.02248 5.57425 1.4013 1.00766 0.80775 1.19186 4.77685 1.98273 0.965019 4.29648 2.73615 1.91728 1.62055 0.709004 0.679194 0.659571 0.654674 0.946042 0.387714 0.168947 0.134156 0.103103 0.0911852 0.0673414 0.0652259 0.031437 0.028165 0.0251107 0.0220522 0.0196035 0.0166548 0.0144661 0.015075 0.0148487 0.0135301 0.009822 0.00907362 0.00738736 0.00656761 0.00459898 0.00447447 0.00359842 0.00356613 0.00292098 0.00154679 0.00124738 0.00282245 0.00115871 0.000498485 0.000374425 0.000315036 0.000190683 0.000101845 0.000138141 8.93868e-06 3.88179e-06 2.48904e-06 8.88178e-16
threshold=7.5000000000000009 1.0000000180025095e-35 1.0000000180025095e-35 0 4.5000000000000009 6.5000000000000009 3.5000000000000004 1.0000000180025095e-35 29.500000000000004 5.5000000000000009 8.5000000000000018 1.5000000000000002 13.500000000000002 1.5000000000000002 14.500000000000002 1 1.0000000180025095e-35 1.0000000180025095e-35 19.500000000000004 6.5000000000000009 20.500000000000004 15.500000000000002 2 3 1.5000000000000002 4.5000000000000009 21.500000000000004 26.500000000000004 6.5000000000000009 17.500000000000004 4 2.5000000000000004 5 5.5000000000000009 1.0000000180025095e-35 6 2.5000000000000004 7 8 9 3.5000000000000004 10 1.5000000000000002 12.500000000000002 11 12 2.5000000000000004 5.5000000000000009 13 11.500000000000002 1.5000000000000002 9.5000000000000018 5.5000000000000009 14 1.5000000000000002 1.5000000000000002 11.500000000000002 2.5000000000000004 10.500000000000002 1.0000000180025095e-35 5.5000000000000009 3.5000000000000004 15 16 17 18 19 20
decision_type=2 2 2 9 2 2 2 2 2 2 2 2 2 2 2 1 2 2 2 2 2 2 1 1 2 2 2 2 2 2 9 2 1 2 2 1 2 1 1 1 2 9 2 2 9 1 2 2 1 2 2 2 2 9 2 2 2 2 2 2 2 2 1 9 9 9 1 9
left_child=1 2 62 4 6 52 7 8 9 -3 11 45 35 23 15 17 -17 -14 19 21 24 22 -16 -4 -20 31 38 -28 32 34 -23 44 33 -27 36 40 54 50 -22 53 41 42 43 -12 48 -2 47 57 -15 59 -9 -37 -6 -33 66 56 58 -36 -53 -43 -34 -41 63 -1 -64 -65 -5 -66
right_child=10 3 13 29 5 -7 -8 37 -10 -11 12 -13 14 25 18 16 -18 -19 20 -21 26 30 -24 -25 -26 28 27 -29 -30 -31 -32 39 60 -35 46 51 -38 -39 -40 61 -42 49 -44 -45 -46 -47 -48 -49 -50 -51 -52 55 -54 -55 -56 -57 -58 -59 -60 -61 -62 -63 64 65 67 -67 -68 -69
leaf_value=-0.024650268319302334 -0.013263269442107015 0.0035652160318984565 0.0017052945258916035 -0.0217375375407802 -0.02182772457035689 0.0058534055591040347 0.030890189511806387 -0.022344805917519323 -0.007630936048601435 0.034592430800541217 -0.010662395331429854 0.057978103351825565 0.015345014291040297 -0.020143169839472091 -0.013839210971425897 -0.011547604793079924 0.057133206215438187 -0.019978537165455494 0.012876643721569101 0.015530225393031925 -0.012467018049311622 -0.0069176287978059865 0.016604588325372226 -0.020883047938738526 0.031690821202254166 -0.00722371995501661 0.0060698811827479921 0.0014615653321704027 -0.016939915327353661 0.0065035499643938044 -0.015779923883543091 -0.017134800325640489 -0.013189724576868731 -0.0029363579996718025 -0.015574962493782011 -0.0080524234280507628 -0.012927865656820534 -0.013990732148700441 -0.0076265907009087286 -0.012616235503126908 -0.0047391758301465478 -0.0092065771413227908 -0.014281112800614289 -0.0060597810114417575 -0.017598607834209738 -0.0094921360772256668 -0.007857052584511243 -0.009099862542874369 -0.022847150894350909 -0.0055868679038219831 -0.019290159006578989 -0.0065907002743297721 -0.01998779858275785 -0.014976555647187355 -0.019900752750797019 -0.0051606553337289595 -0.0053079387508025129 -0.013343540847199478 -0.0076093283463967562 -0.008105310689879415 -0.012353175289045337 -0.011969751761334598 -0.024764101349071362 -0.024811075009669559 -0.024829264960451465 -0.024740231814067985 -0.021626016227851434 -0.024829264268292659
leaf_weight=36.545463584363461 4.2404635697603208 46.792187083512545 28.913319692015648 2.0599768552929145 5.7347114309668541 12.444395422935486 6.1933761462569228 2.5952457487583152 14.591286599636076 12.962327569723127 10.621311828494074 4.7877437323331833 10.663043186068537 3.200426451861861 7.4094389081001282 4.9124416857957858 5.2239025607705116 6.331411860883235 12.550910472869875 22.28699392080307 6.9295125380158407 4.7248111069202423 10.66041247546673 3.9483107775449744 7.7645156085491172 20.450643658638 117.29434866458178 2204.7413824051619 10.346417002379892 0.92783378064632493 44.389670200645924 5.0374443717300874 2.4825052581727496 16.587727785110474 0.90758106485009271 2.6477582082152358 1.4280350245535371 1.7839265689253805 3.5628273040056229 2.2402711920440197 1.7667736709117878 1.6307042241096525 2.3257204145193091 2.0985714495182028 2.0404790285974732 2.9125351905822754 1.332508649677038 1.0178640037775037 7.5273455381393424 1.9530157186090944 2.2280493900179863 2.2777671292424184 4.8699015229940414 2.2760471701622009 2.0860351510345936 3.1487031430006018 3.8191110640764236 1.6205775439739225 2.5407821387052536 1.4654304198920725 2.0587448552250862 2.3236816376447678 6.4020518213510513 21.81345546618104 28.151511624455452 2.1217210516333607 0.66083233058452462 1.4178567901253725
leaf_count=1522 68 193 198 71 18 22 27 25 26 28 149 17 37 83 32 29 13 23 46 20 43 43 44 107 22 61 275 3852 93 3 205 115 42 65 27 34 32 34 19 51 19 28 24 24 65 41 25 20 52 29 30 28 25 63 49 31 43 35 29 24 33 50 275 938 1204 91 18 61
internal_value=0 -0.00928942 -0.0160242 0.00205412 0.00380771 -0.00649365 0.00653227 0.00466875 0.00677748 0.0102958 0.00162487 0.0162214 0.00155531 -0.00833258 0.00169866 0.0102785 0.023848 0.00218496 0.00160335 -0.00349338 0.00179717 -0.00980406 0.00412128 -0.00100869 0.0200674 -0.0114757 0.00163804 0.00169435 -0.0082787 -0.0139938 -0.0149274 -0.0182115 -0.0061235 -0.00530361 -0.0157051 -0.00819774 -0.0190934 -0.0190592 -0.0108234 -0.0148585 -0.00939343 -0.00980264 -0.0105798 -0.00990304 -0.0213306 -0.0117278 -0.0113747 -0.0126965 -0.0220405 -0.00748685 -0.0209338 -0.00638678 -0.0209828 -0.0164631 -0.0209251 -0.0060126 -0.00632316 -0.0141446 -0.00712781 -0.00868534 -0.0128105 -0.0122871 -0.024751 -0.0247114 -0.0248177 -0.0248048 -0.0217105 -0.0248293
internal_weight=0 328.122 205.885 122.237 110.195 23.049 87.1464 80.953 74.3458 59.7545 2517.68 11.9407 2505.74 109.433 2469.45 27.1308 10.1363 16.9945 2442.31 89.4713 2352.84 67.1843 18.0699 32.8616 20.3154 76.5717 2332.53 2322.04 51.926 12.0412 49.1145 24.6457 41.5796 37.0384 11.1134 36.2956 6.23488 6.60722 10.4923 11.8774 21.8615 20.0948 15.0456 12.7199 12.7683 7.153 4.87853 3.54602 10.7278 5.04915 4.8233 14.4341 10.6046 7.31349 4.80684 11.7864 8.63766 2.52816 4.81855 3.09613 4.54125 4.56395 96.4521 60.4806 35.9714 23.9352 2.72081 29.5694
internal_count=11168 5877 5169 708 428 65 363 336 247 221 5291 126 5165 1078 4703 102 42 60 4601 344 4257 324 76 305 68 773 4189 4127 294 280 248 479 201 126 277 462 170 89 62 279 297 278 197 173 200 109 107 82 135 81 55 165 43 178 138 131 100 62 57 52 75 101 4091 2551 1540 1029 89 1265
cat_boundaries=0 1 2 3 4 5 6 7 8 9 10 11 12 13 14 15 16 17 18 19 20 21
cat_threshold=2 1 2 1 1 1 1 1 1 1 2 2 1 1 2 1 2 1 1 1 2
is_linear=0
shrinkage=0.05


Tree=97
num_leaves=68
num_cat=19
split_feature=2 3 2 0 2 2 2 2 3 3 2 2 3 2 2 3 1 2 3 2 2 3 1 2 3 2 2 3 2 3 0 2 1 2 2 1 3 1 1 3 0 3 2 0 1 3 2 1 2 2 2 2 0 3 3 2 2 2 3 2 2 1 0 0 0 1 0
split_gain=13.2578 9.76055 5.52437 1.3191 1.17168 1.60344 1.44148 1.55286 1.41968 3.53697 0.978648 0.95058 4.97448 1.33936 0.755524 2.12866 2.61122 0.918745 4.07687 2.5396 1.8613 1.60242 0.688322 0.672141 2.75208 2.46503 0.651809 0.604482 0.380611 0.164486 0.132529 0.103588 0.088874 0.0650521 0.0649933 0.0306321 0.0282563 0.0252184 0.0194832 0.0162271 0.0141509 0.0148496 0.0145067 0.0136837 0.00967233 0.00891243 0.00728548 0.00666928 0.00453254 0.00447104 0.00361325 0.0034937 0.00291759 0.00156681 0.00120748 0.00273562 0.00115097 0.000484407 0.000365574 0.000311449 0.00018823 0.000104381 0.000141569 9.16241e-06 3.97875e-06 2.52767e-06 8.88178e-16
threshold=7.5000000000000009 1.0000000180025095e-35 1.0000000180025095e-35 0 4.5000000000000009 6.5000000000000009 3.5000000000000004 1.0000000180025095e-35 29.500000000000004 5.5000000000000009 1.5000000000000002 8.5000000000000018 1.5000000000000002 13.500000000000002 14.500000000000002 1.5000000000000002 1 19.500000000000004 6.5000000000000009 20.500000000000004 15.500000000000002 1.0000000180025095e-35 2 41.500000000000007 1.5000000000000002 48.500000000000007 4.5000000000000009 1.5000000000000002 6.5000000000000009 17.500000000000004 3 2.5000000000000004 4 5.5000000000000009 1.0000000180025095e-35 5 2.5000000000000004 6 7 3.5000000000000004 8 1.5000000000000002 12.500000000000002 9 10 2.5000000000000004 5.5000000000000009 11 1.5000000000000002 11.500000000000002 5.5000000000000009 9.5000000000000018 12 1.5000000000000002 1.5000000000000002 11.500000000000002 2.5000000000000004 10.500000000000002 1.0000000180025095e-35 5.5000000000000009 3.5000000000000004 13 14 15 16 17 18
decision_type=2 2 2 9 2 2 2 2 2 2 2 2 2 2 2 2 1 2 2 2 2 2 1 2 2 2 2 2 2 2 9 2 1 2 2 1 2 1 1 2 9 2 2 9 1 2 2 1 2 2 2 2 9 2 2 2 2 2 2 2 2 1 9 9 9 1 9
left_child=1 2 61 4 6 50 7 8 9 -3 22 12 44 35 15 16 -15 18 20 27 21 -16 -4 24 -21 -25 31 -19 32 34 -22 43 33 -28 36 39 53 48 52 40 41 42 -13 47 -2 46 56 -12 -9 58 -6 -37 -33 65 55 57 -36 -53 -42 -34 -40 62 -1 -63 -64 -5 -65
right_child=11 3 10 29 5 -7 -8 37 -10 -11 26 13 -14 14 17 -17 -18 19 -20 23 30 -23 -24 25 -26 -27 28 -29 -30 -31 -32 38 59 -35 45 51 -38 -39 60 -41 49 -43 -44 -45 -46 -47 -48 -49 -50 -51 -52 54 -54 -55 -56 -57 -58 -59 -60 -61 -62 63 64 66 -66 -67 -68
leaf_value=-0.024645801876625992 -0.013108844395110925 0.0034641647705137345 0.0016600843736954104 -0.021669594740911621 -0.021761487281259422 0.0056743324745050193 0.029195318729127746 -0.02228866618480406 -0.007499194669403313 0.032572037760845426 -0.020047819923270607 -0.010510534425970943 0.053313616703888338 0.042137357901526361 -0.012887650451507304 -0.017492174616495004 0.005075737798357521 0.012394231559395848 0.01490827541303349 -0.0040142710495437821 -0.0067932932790224559 0.017072149898715538 -0.020799772528710708 0.0099809596803541335 0.0064736044200524659 0.0015397589828999409 -0.0070960821344789905 0.02992773690572148 -0.016805131606396486 0.0063004366092628133 -0.015635993384060014 -0.017001820985142548 -0.01303518542793676 -0.0028719779292067319 -0.015429699090330507 -0.00791678405253461 -0.01277300740656305 -0.01383802770018029 -0.012461177409121654 -0.0046437395632400067 -0.0090620817363407831 -0.014129392793632074 -0.0059456972515175965 -0.017470232128775704 -0.0093458610815826994 -0.007723175883815961 -0.0089560736186423181 -0.022801342618775526 -0.019182271582180208 -0.0054790619890303857 -0.019890054724499163 -0.0064700984356969114 -0.014827885520823016 -0.019801689813815266 -0.0050588899791834657 -0.0052040452170089967 -0.013189253753653053 -0.0074777967714802721 -0.0079692069571546242 -0.012198099585874117 -0.011814902042557897 -0.024762467821398154 -0.024810619069809248 -0.024829264191486414 -0.024738003602936383 -0.021555987855855621 -0.024829264331420478
leaf_weight=35.655619420111179 4.1845925711095315 46.959310662001371 28.962667459622025 2.0156812462955696 5.610892079770565 12.517451323568821 6.387676201760768 2.5378985852003089 14.480365157127379 13.418571695685385 3.1366046667099026 10.508664727211 5.0735328197479248 7.0042816400527954 7.9183504953980473 5.6327586062252513 14.784156598150735 12.713569149374964 22.635817348957062 196.01704531162977 4.6922393813729286 10.228156015276907 3.866712972521781 90.484498292207718 91.86409243196249 1957.9883702099323 20.303446859121323 8.0145199000835401 10.172625962644814 0.93388768285513002 43.69470239430666 4.9518641196191293 2.4499766901135436 16.539092198014259 0.89355502277612764 2.626522868871688 1.4096923694014547 1.7591419070959089 2.2121849022805691 1.7584204226732243 1.615759890526536 2.2927425578236571 2.0858929157257071 2.0048835612833491 2.8850196823477745 1.3220800831913946 1.0086436122655866 7.3573171496391288 2.1854818537831306 1.9421349354088304 4.7735292464494705 2.2628044411540014 2.242213811725378 2.0449317656457424 3.1324956715106955 3.7988931909203529 1.5990969128906725 2.5215218439698219 1.4536006785929201 2.0334694087505341 2.2960335910320282 6.2454577535390854 21.278899282217026 27.461137533187866 2.0698731578886536 0.64669460803270196 1.383085928857329
leaf_count=1522 68 193 198 71 18 22 27 25 26 28 83 149 17 33 53 21 48 46 20 634 43 23 107 262 335 2958 61 22 93 3 205 115 42 65 27 34 32 34 51 19 28 24 24 65 41 25 20 52 30 29 25 28 63 49 31 43 35 29 24 33 50 275 938 1204 91 18 61
internal_value=0 -0.0091463 -0.0158825 0.00199533 0.00369513 -0.00637585 0.0063242 0.00452814 0.00656112 0.00993319 -0.00819513 0.00158151 0.0155372 0.00151399 0.00165333 0.00990669 0.0169899 0.00156082 -0.0034211 0.00174929 -0.00965707 0.00399899 -0.000985284 0.0015947 -0.000667545 0.00191262 -0.0113219 0.0191736 -0.00814134 -0.0138414 -0.0147785 -0.0180899 -0.00600869 -0.00519983 -0.0155608 -0.0080609 -0.0189829 -0.0189482 -0.0147092 -0.00924781 -0.00965466 -0.0104283 -0.00975451 -0.0212552 -0.0115732 -0.0112208 -0.0125415 -0.0219783 -0.0208514 -0.00735654 -0.0209012 -0.00626863 -0.0163243 -0.0208425 -0.00589913 -0.00620578 -0.0139924 -0.00700119 -0.00854451 -0.0126555 -0.012132 -0.0247491 -0.0247085 -0.0248174 -0.0248042 -0.021642 -0.0248293
internal_weight=0 325.128 202.623 122.505 110.63 22.9019 87.7284 81.3408 74.8582 60.3779 108.529 2521.82 12.1431 2509.67 2473.67 27.4212 21.7884 2446.25 89.1693 2357.08 66.5334 18.1465 32.8294 2336.35 287.881 2048.47 75.6997 20.7281 51.4986 11.8743 48.3869 24.2011 41.326 36.8425 10.9404 35.9995 6.117 6.48252 11.7023 21.6572 19.8988 14.8873 12.5946 12.4988 7.06961 4.82338 3.5013 10.4939 4.72338 5.0115 10.3844 14.3422 7.19408 4.70731 11.7157 8.58322 2.49265 4.78433 3.06936 4.48345 4.50822 94.0941 59.0044 35.0897 23.3488 2.66238 28.8442
internal_count=11168 5877 5169 708 428 65 363 336 247 221 1078 5291 126 5165 4703 102 81 4601 344 4257 324 76 305 4189 969 3220 773 68 294 280 248 479 201 126 277 462 170 89 279 297 278 197 173 200 109 107 82 135 55 81 43 165 178 138 131 100 62 57 52 75 101 4091 2551 1540 1029 89 1265
cat_boundaries=0 1 2 3 4 5 6 7 8 9 10 11 12 13 14 15 16 17 18 19
cat_threshold=2 2 1 1 1 1 1 1 2 2 1 1 2 1 2 1 1 1 2
is_linear=0
shrinkage=0.05


Tree=98
num_leaves=68
num_cat=20
split_feature=2 3 2 3 2 2 3 3 2 0 2 2 2 1 3 2 2 3 3 1 2 3 2 2 1 1 2 2 3 2 3 2 3 0 2 1 2 3 1 1 3 1 2 3 1 0 3 2 0 2 1 2 2 0 3 2 3 2 2 3 2 2 1 0 0 0 0
split_gain=12.7063 9.49925 5.51929 1.26643 3.78567 3.43345 2.38716 3.37945 1.77234 1.06686 1.04493 0.95017 0.884663 4.53371 6.09136 1.28009 0.707768 2.00508 2.34601 0.969488 0.874675 3.87008 2.35961 1.80663 1.51685 0.668201 0.643871 0.637479 2.6123 2.31214 0.539735 0.373493 0.263618 0.130867 0.10404 0.0865887 0.0628217 0.0465382 0.0330882 0.0298357 0.028099 0.019355 0.0160062 0.0158043 0.0140489 0.0138365 0.0146209 0.0141666 0.0138354 0.00943599 0.00677116 0.004345 0.00339076 0.00291297 0.0015867 0.0015048 0.00116845 0.00265053 0.000470545 0.000356779 0.000307759 0.000185722 0.000106987 0.000145079 9.39302e-06 4.07835e-06 1.77636e-15
threshold=7.5000000000000009 1.0000000180025095e-35 1.0000000180025095e-35 2.5000000000000004 6.5000000000000009 4.5000000000000009 5.5000000000000009 29.500000000000004 3.5000000000000004 0 1.0000000180025095e-35 1.5000000000000002 8.5000000000000018 1 1.5000000000000002 13.500000000000002 14.500000000000002 1.5000000000000002 1.0000000180025095e-35 2 19.500000000000004 6.5000000000000009 20.500000000000004 15.500000000000002 3 4 4.5000000000000009 41.500000000000007 1.5000000000000002 48.500000000000007 1.5000000000000002 6.5000000000000009 19.500000000000004 5 2.5000000000000004 6 5.5000000000000009 1.5000000000000002 7 8 1.5000000000000002 9 1.0000000180025095e-35 3.5000000000000004 10 11 1.5000000000000002 12.500000000000002 12 1.5000000000000002 13 11.500000000000002 9.5000000000000018 14 1.5000000000000002 5.5000000000000009 1.5000000000000002 11.500000000000002 10.500000000000002 1.0000000180025095e-35 5.5000000000000009 3.5000000000000004 15 16 17 18 19
decision_type=2 2 2 2 2 2 2 2 2 9 2 2 2 1 2 2 2 2 2 1 2 2 2 2 1 1 2 2 2 2 2 2 2 9 2 1 2 2 1 1 2 1 2 2 1 9 2 2 9 2 1 2 2 9 2 2 2 2 2 2 2 2 1 9 9 9 9
left_child=1 2 62 5 6 8 38 32 9 10 40 25 13 37 -15 39 17 18 19 -17 21 23 30 24 -18 -4 34 28 -24 -29 -22 35 -8 -25 48 36 -28 -2 -5 43 -3 53 54 45 -12 46 47 -14 50 -40 -13 59 -41 -36 -11 -7 57 58 -54 -47 -37 -43 63 -1 -64 -65 -66
right_child=12 3 11 4 -6 55 7 -9 -10 42 44 26 15 14 -16 16 20 -19 -20 -21 22 -23 27 33 -26 -27 31 29 -30 -31 -32 -33 -34 -35 41 60 -38 -39 49 52 -42 61 -44 -45 -46 51 -48 -49 -50 -51 -52 -53 56 -55 -56 -57 -58 -59 -60 -61 -62 -63 64 65 66 -67 -68
leaf_value=-0.024641223973873805 -0.012954192214998765 0.0067659354309532529 0.0016161452795223361 -0.013324876489951731 0.050174360813575639 -0.021976518691092205 0.020534758435646328 -0.0065536373230789639 0.02809720879354188 -0.021572269228090413 -0.021693517923129877 -0.019950993351137054 -0.010359243086112279 -0.00920047752975095 0.08969679898310251 0.01453294565248636 -0.013713213166949673 -0.017362703615679938 0.042332417137935896 -0.011947736467930915 0.011935722677502258 0.014320251614356181 -0.0039305459933392985 -0.0066703524815567268 0.015709571491928125 -0.020715082878321325 -0.0069697989411855732 0.0096352483142363252 0.0062716167008106663 0.0014991882897825637 0.028313262788695649 -0.01666914624127841 0.033602552096715192 -0.01549111790613162 -0.016867602871657308 -0.012880440924648276 -0.0028088274449178182 -0.022356967296757808 -0.022174863528814454 -0.0077823602234806449 0.0042113841031408252 -0.012306091461073348 -0.014342855122096732 -0.0045497852481837684 -0.015698355453291454 -0.0089185487631549664 -0.013977137014247798 -0.0058330865305258389 -0.017340538259449062 -0.018432250416615469 -0.022754572871002611 -0.0053727503570334487 -0.0063509278927405448 -0.014678481187471443 -0.019701142085291282 -0.02094570529834815 -0.004958620569041422 -0.0051016484037372835 -0.0073475595162347182 -0.0078343087602681747 -0.01204307977373124 -0.011660226262626625 -0.024760791800697918 -0.024810150115258427 -0.024829266624439066 -0.024735716180647085 -0.02482926491993926
leaf_weight=34.787598669528961 4.1300953328609449 23.597558155655861 29.01078742928803 1.9385647885501385 4.8893290981650344 4.8841387890279302 8.3154700137674826 15.231593549251555 6.6676827408373347 2.6053756810724726 3.0386080890893927 3.074348974972966 10.398791544139387 2.8581822365522385 3.4200572669506073 10.883029192686081 7.3254543170332909 5.5350861400365821 6.2170549854636183 5.0650340467691466 12.872124627232553 22.975806951522827 195.23175649344921 4.6604716181755066 10.895773544907572 3.7871167920529833 20.159881770610809 91.392141982913017 92.460713066160679 1961.0055194348097 8.2580014169216138 10.003101624548433 7.2017538994550696 43.016805693507195 4.8683849312365037 2.4182480722665778 16.491660349071026 1.9313040897250173 4.2747969478368741 2.6058113723993293 19.794531434774399 2.1847896687686443 1.2319381609559057 1.7502737045288075 1.4404154680669305 1.6011838763952284 2.2605752795934668 2.0735276341438285 1.9701619949191798 2.7789624556899071 7.191458284854888 1.9315229095518587 2.2482110634446126 2.209211815148592 2.0048370622098446 12.869220323860645 3.1166886761784545 3.7791749760508537 2.5027366206049919 1.4420626759529112 2.0088156014680862 2.2690658271312714 6.0927038546651602 20.757452048361301 26.7876907736063 2.0192968584597137 1.349167682230475
leaf_count=1522 68 122 198 40 10 20 33 28 43 89 38 83 149 41 12 37 32 21 15 29 46 20 634 43 44 107 61 262 335 2958 22 93 11 205 115 42 65 5 35 34 46 51 36 19 28 28 24 24 65 26 52 29 28 63 49 54 31 43 29 24 33 50 275 938 1204 91 61
internal_value=0 -0.00900407 -0.0157397 0.00193847 0.00865784 -0.00189964 0.00355009 0.010177 0.00378371 0.00076556 0.00322724 -0.00805883 0.00153938 0.0148944 0.0446736 0.00147381 0.00160928 0.00955681 0.0162792 0.0061228 0.00151942 -0.00335005 0.00170271 -0.00951088 0.00388077 -0.000962403 -0.0111684 0.00155251 -0.0006517 0.00186148 0.0183363 -0.00800514 0.0265997 -0.0146289 -0.017967 -0.00589536 -0.00509754 -0.0159501 -0.0191104 -0.00792524 0.0056006 -0.0145593 -0.0194057 -0.0091031 -0.0197655 -0.00950749 -0.0102773 -0.00960677 -0.0211784 -0.0207004 -0.021915 -0.00722755 -0.00615193 -0.0161843 -0.0207586 -0.0212293 -0.00578714 -0.00608986 -0.00687594 -0.00840477 -0.0125005 -0.011977 -0.0247471 -0.0247055 -0.0248171 -0.0248036 -0.0248293
internal_weight=0 322.206 199.441 122.765 44.6305 78.1343 39.7411 30.7488 60.3809 53.7133 47.8711 107.647 2525.84 12.3396 6.27824 2513.51 2477.79 27.7002 22.1651 15.9481 2450.09 88.8743 2361.22 65.8985 18.2212 32.7979 74.8491 2340.09 287.692 2052.4 21.1301 51.0817 15.5172 47.6773 23.7674 41.0786 36.6515 6.0614 8.99232 35.7106 43.3921 11.5315 5.84215 21.4579 4.47902 19.7077 14.7329 12.4723 12.236 7.05376 10.2658 4.97477 14.2526 7.0776 4.61021 17.7534 11.6468 8.53012 4.75095 3.04325 4.42706 4.45386 91.7939 57.5643 34.2296 22.7767 28.1369
internal_count=11168 5877 5169 708 183 525 173 72 451 408 234 1078 5291 126 53 5165 4703 102 81 66 4601 344 4257 324 76 305 773 4189 969 3220 68 294 44 248 479 201 126 73 101 462 168 279 174 297 66 278 197 173 200 61 135 81 165 178 138 74 131 100 57 52 75 101 4091 2551 1540 1029 1265
cat_boundaries=0 1 2 3 4 5 6 7 8 9 10 11 12 13 14 15 16 17 18 19 20
cat_threshold=2 1 1 2 1 1 1 2 1 1 1 2 2 1 2 1 2 1 1 2
is_linear=0
shrinkage=0.05


Tree=99
num_leaves=67
num_cat=19
split_feature=2 3 2 0 2 2 2 2 3 3 2 2 1 3 2 2 1 3 2 3 2 2 3 1 2 2 2 3 2 3 0 2 1 2 2 3 1 3 1 1 1 3 0 0 3 2 2 1 2 2 3 2 2 0 3 3 2 2 3 2 2 1 0 0 0 1
split_gain=12.1777 9.24138 5.51266 1.21876 1.05986 1.51801 1.22244 1.43261 1.26707 2.95465 0.92223 0.82142 4.11631 5.09859 1.22337 0.663168 1.06073 1.85181 0.832718 3.67516 2.19449 1.75328 1.49804 0.648627 0.635765 0.615025 0.94905 0.483373 0.366365 0.160236 0.129171 0.104457 0.0843307 0.0657387 0.0606498 0.0466111 0.0290484 0.028188 0.0255364 0.0216548 0.019219 0.0153864 0.013985 0.0135234 0.0143892 0.0138287 0.00983056 0.00687315 0.00462497 0.0042209 0.00388019 0.00373033 0.00328964 0.00290712 0.00160643 0.00113031 0.00256719 0.000456908 0.000348048 0.00030397 0.000183162 0.000109647 0.000148674 9.62732e-06 4.18019e-06 2.62241e-06
threshold=7.5000000000000009 1.0000000180025095e-35 1.0000000180025095e-35 0 4.5000000000000009 6.5000000000000009 3.5000000000000004 1.0000000180025095e-35 29.500000000000004 5.5000000000000009 1.5000000000000002 8.5000000000000018 1 1.5000000000000002 13.500000000000002 14.500000000000002 2 1.0000000180025095e-35 19.500000000000004 6.5000000000000009 20.500000000000004 15.500000000000002 1.0000000180025095e-35 3 4.5000000000000009 21.500000000000004 26.500000000000004 1.5000000000000002 6.5000000000000009 101.50000000000001 4 2.5000000000000004 5 1.0000000180025095e-35 5.5000000000000009 1.5000000000000002 6 2.5000000000000004 7 8 9 3.5000000000000004 10 11 1.5000000000000002 12.500000000000002 5.5000000000000009 12 1.5000000000000002 11.500000000000002 1.5000000000000002 5.5000000000000009 9.5000000000000018 13 1.5000000000000002 1.5000000000000002 11.500000000000002 10.500000000000002 1.0000000180025095e-35 5.5000000000000009 3.5000000000000004 14 15 16 17 18
decision_type=2 2 2 9 2 2 2 2 2 2 2 2 1 2 2 2 1 2 2 2 2 2 2 1 2 2 2 2 2 2 9 2 1 2 2 2 1 2 1 1 1 2 9 9 2 2 2 1 2 2 2 2 2 9 2 2 2 2 2 2 2 1 9 9 9 1
left_child=1 2 61 4 6 51 7 8 9 -3 23 12 35 -14 36 16 17 -16 19 21 27 22 -17 -4 31 39 -27 -20 32 33 -23 42 34 37 -26 -2 41 54 48 -22 53 43 47 44 45 -13 50 -12 -9 58 -35 -6 -38 -33 65 56 57 -54 -45 -34 -42 62 -1 -63 -64 -5
right_child=11 3 10 29 5 -7 -8 38 -10 -11 24 14 13 -15 15 18 -18 -19 20 -21 25 30 -24 -25 28 26 -28 -29 -30 -31 -32 40 59 46 -36 -37 52 -39 -40 -41 60 -43 -44 49 -46 -47 -48 -49 -50 -51 -52 -53 55 -55 -56 -57 -58 -59 -60 -61 -62 63 64 -65 -66 -67
leaf_value=-0.024636533303773092 -0.01279935915724017 0.0032655851119141148 0.0015734409492363889 -0.021411727734749031 -0.021636864486530474 0.0053268603195837268 0.026430558135214246 -0.022179311321085353 -0.0072539388932571242 0.029241100719301361 -0.022706823016127701 -0.010208565524777901 -0.0090560217129918123 0.079871419215863368 0.013965032754492136 -0.012762395378136081 0.021677545706657746 -0.019970683802531468 0.011499512959584755 0.013763615606344546 -0.012287436625199613 -0.0065488213567750564 0.016151955060757762 -0.020628967632661657 -0.006844886681660169 0.0059387182777086121 0.0013329649441533027 0.026829725588247789 -0.016531983750062554 0.0072873963384236379 -0.015345333123659474 -0.016732169379639825 -0.012725539768665417 -0.014183641831527384 -0.002746888672749981 -0.022301071666464448 -0.0076491772730191351 -0.012505998516683756 -0.013526255321210557 -0.0074641092933232294 -0.01215102773592952 -0.0044573077367259057 -0.017209547507430405 -0.0087760135660034863 -0.013824390268010835 -0.0057219560815344695 -0.007737265627190887 -0.019852690032939099 -0.018980645052124462 -0.0052679337766557872 -0.010696675076515998 -0.019697989282216548 -0.0062331993357093831 -0.014528384274045387 -0.019599110748165782 -0.0048598446568553465 -0.0050007481418430505 -0.0072186386561043942 -0.0077006420265242209 -0.011888164357311713 -0.011505773127541245 -0.024759075859329467 -0.02480966934495207 -0.02482926339828477 -0.024733373729016829 -0.02152996803960501
leaf_weight=33.940865527838469 4.0769384242594224 47.291227992624044 29.057711441069841 0.61939669400453568 5.3918577805161476 12.661682859063148 6.7322029992938033 2.4331680946052066 14.278298258781431 14.245205610990523 7.0296674370765686 10.291624024510385 2.8320061936974525 3.7410042136907578 11.042346775531771 7.8361573740839985 10.609399676322939 6.321178510785102 13.026683658361437 23.307192951440811 6.8302914947271329 4.629488080739975 10.457820214331148 3.7094734497368327 20.019860029220581 117.79436744749546 2215.5787865817547 8.4951541721820814 9.8377407044172269 0.85379940271377641 42.355562508106232 4.7869556918740255 2.387299668043851 1.658403489738703 16.445403404533863 1.8886050432920454 2.5856106951832762 1.3791485019028185 1.7106192521750925 3.529490739107132 2.1580681949853897 1.7423284053802479 1.9362927973270405 1.5869671478867542 2.2291987240314493 2.0614678561687461 1.6327383257448671 3.0136204175651091 2.1101389676332474 1.9211731813848016 1.5374042913317678 4.5948538295924664 2.2339781671762449 2.1770207360386848 1.9657259620726106 3.101272538304328 3.7599439024925232 2.4844151213765144 1.4308092407882211 1.9847682900726793 2.2427617013454437 5.9436958748847246 20.248792286962271 27.446844559162855 1.9699607957154537 1.9303770475089517
leaf_count=1522 68 193 198 18 18 22 27 25 26 28 52 149 41 12 37 53 42 23 46 20 43 43 23 107 61 275 3852 22 93 2 205 115 42 41 65 5 34 32 34 19 51 19 65 28 24 24 30 83 30 29 37 25 28 63 49 31 43 29 24 33 50 275 938 1265 91 71
internal_value=0 -0.00886321 -0.015596 0.00188158 0.00348553 -0.00616932 0.00594797 0.00426776 0.0061651 0.00927871 -0.00792371 0.00149835 0.0142642 0.0415567 0.00143476 0.00156646 0.00922157 0.00161076 0.00147919 -0.0032802 0.00165745 -0.00936552 0.0037666 -0.000940026 -0.0110153 0.00151151 0.00156547 0.0175507 -0.00787014 -0.0135593 -0.0144786 -0.0178426 -0.00578349 -0.0152191 -0.00499674 -0.0158075 -0.0077908 -0.0187623 -0.0187332 -0.0106442 -0.0144087 -0.00895935 -0.0211003 -0.00936117 -0.0101271 -0.00945985 -0.0108936 -0.0218504 -0.0206937 -0.00709989 -0.0125062 -0.0207448 -0.00603668 -0.0160432 -0.0206732 -0.00567663 -0.0059754 -0.00675207 -0.00826615 -0.0123454 -0.0118222 -0.024745 -0.0247024 -0.0248168 -0.0248029 -0.0215012
internal_weight=0 319.363 196.337 123.026 111.449 22.6484 88.8009 82.0687 75.8147 61.5364 106.787 2529.78 12.5386 6.57301 2517.24 2481.81 27.9729 17.3635 2453.84 88.5862 2365.25 65.279 18.294 32.7672 74.0195 2343.73 2333.37 21.5218 50.6751 11.577 46.9851 23.3444 40.8373 10.7232 36.4653 5.96554 35.4288 5.89465 6.25393 10.3598 11.3648 21.2636 11.9796 19.5212 14.5823 12.3531 4.82855 10.0433 4.54331 4.93895 3.19581 9.98671 14.1652 6.96398 4.5155 11.5796 8.47834 4.71839 3.01778 4.37207 4.40083 89.5502 56.1596 33.3905 22.2188 2.54977
internal_count=11168 5877 5169 708 428 65 363 336 247 221 1078 5291 126 53 5165 4703 102 60 4601 344 4257 324 76 305 773 4189 4127 68 294 280 248 479 201 278 126 73 462 170 89 62 279 297 200 278 197 173 108 135 55 81 78 43 165 178 138 131 100 57 52 75 101 4091 2551 1540 1029 89
cat_boundaries=0 1 2 3 4 5 6 7 8 9 10 11 12 13 14 15 16 17 18 19
cat_threshold=2 1 1 1 1 1 1 1 1 1 2 2 2 2 1 2 1 1 2
is_linear=0
shrinkage=0.05


Tree=100
num_leaves=97
num_cat=24
split_feature=2 3 2 2 2 2 2 2 2 2 3 2 1 3 3 3 3 3 0 2 2 2 2 2 1 2 2 3 2 3 2 2 1 1 2 0 3 2 2 2 2 2 0 2 0 1 2 3 2 3 1 2 3 3 2 2 2 2 3 1 3 1 2 2 2 2 2 2 2 2 2 2 0 2 2 2 2 1 1 3 2 1 2 0 3 2 0 2 2 2 1 0 1 1 0 0
split_gain=12.9713 5.19952 5.59975 4.69883 2.95491 2.64008 4.08735 2.5446 2.7451 2.31063 4.58083 1.49345 4.59701 6.13066 1.80062 1.35771 1.20269 7.42583 0.937618 0.912061 1.43103 2.90082 1.29459 3.13649 1.12112 1.20639 1.61842 0.901375 2.10043 1.15019 3.64538 9.65746 0.712268 0.705445 0.692046 0.75093 0.629166 0.583138 3.93542 0.582874 0.353993 1.72217 0.341432 0.332615 0.315854 0.310441 0.302205 0.245474 0.46073 0.32227 0.223434 0.210835 0.198986 0.1815 0.177024 0.218013 0.158177 0.151416 0.230457 0.15224 0.145341 0.141621 0.140131 0.13743 0.127263 0.159421 0.12179 0.1072 0.116282 0.105167 0.0886133 0.0872958 0.0785386 0.0562011 0.0413252 0.0688339 0.0393539 1.06576 0.77265 0.0287639 0.0243733 0.0171702 0.0140483 0.00810298 0.00802456 0.00779142 0.00702215 0.00571941 0.00143853 0.00117917 0.00100606 0.000277406 1.7948e-06 9.53853e-07 1.43662e-07 6.66134e-16
threshold=7.5000000000000009 1.0000000180025095e-35 1.0000000180025095e-35 92.500000000000014 5.5000000000000009 6.5000000000000009 2.5000000000000004 23.500000000000004 21.500000000000004 3.5000000000000004 1.5000000000000002 8.5000000000000018 0 1.5000000000000002 6.5000000000000009 1.5000000000000002 6.5000000000000009 3.5000000000000004 1 65.500000000000014 31.500000000000004 32.500000000000007 41.500000000000007 43.500000000000007 2 26.500000000000004 25.500000000000004 5.5000000000000009 93.500000000000014 3.5000000000000004 160.50000000000003 122.50000000000001 3 4 1.0000000180025095e-35 5 52.500000000000007 471.50000000000006 456.50000000000006 16.500000000000004 313.50000000000006 334.50000000000006 6 27.500000000000004 7 8 643.00000000000011 1.0000000180025095e-35 22.500000000000004 1.5000000000000002 9 27.500000000000004 3.5000000000000004 33.500000000000007 102.50000000000001 95.500000000000014 4.5000000000000009 306.50000000000006 86.500000000000014 10 55.500000000000007 11 37.500000000000007 649.50000000000011 84.500000000000014 78.500000000000014 82.500000000000014 709.50000000000011 372.00000000000006 4.5000000000000009 628.50000000000011 125.50000000000001 12 88.500000000000014 81.500000000000014 72.500000000000014 1.5000000000000002 13 14 1.5000000000000002 109.50000000000001 15 6.5000000000000009 16 1.0000000180025095e-35 1.5000000000000002 17 272.50000000000006 4.5000000000000009 5.5000000000000009 18 19 20 21 22 23
decision_type=2 2 2 2 2 2 2 2 2 2 2 2 1 2 2 2 2 2 9 2 2 2 2 2 1 2 2 2 2 2 2 2 1 1 2 9 2 2 2 2 2 2 9 2 9 1 2 2 2 2 1 2 2 2 2 2 2 2 2 1 2 1 2 2 2 2 2 2 2 2 2 2 9 2 2 2 2 1 1 2 2 1 2 9 2 2 9 2 2 2 1 9 1 1 9 9
left_child=1 2 91 7 9 6 18 8 11 16 56 12 79 -14 15 39 17 34 76 20 24 -22 62 -24 42 26 -26 28 -5 32 31 80 37 -7 35 -3 -18 38 -30 -13 54 -42 84 -44 74 69 -39 48 -10 -49 64 -27 66 67 55 -29 -11 58 59 -56 -55 -17 -23 71 65 -46 -52 68 -43 83 -62 -34 87 -66 75 -21 78 -78 -4 -2 -31 -36 -6 -8 -9 90 88 -32 -47 -71 -20 92 -1 94 -93 -95
right_child=3 4 5 27 82 33 45 19 47 10 -12 14 13 -15 -16 61 36 -19 85 44 21 22 23 -25 25 51 -28 40 29 30 72 -33 63 -35 81 -37 -38 46 -40 -41 41 53 43 -45 50 86 -48 49 -50 -51 52 -53 -54 60 57 -57 -58 -59 -60 -61 70 -63 -64 -65 73 -67 -68 -69 -70 89 -72 -73 -74 -75 -76 -77 77 -79 -80 -81 -82 -83 -84 -85 -86 -87 -88 -89 -90 -91 -92 93 -94 95 -96 -97
leaf_value=-0.024630368461793044 -0.012548907022329301 0.00071393271500101729 -0.020838116522977911 0.022466470120921109 -0.018461228206303318 0.024928531927311575 -0.017554084301746525 -0.0046163373757350168 0.0068201830485907352 0.030943162197222502 -0.019284687269481439 0.0008580774990114764 -0.0071913569993524622 0.092839251991903182 0.0094174560219238233 -0.01603082413129947 -0.019582601347046313 0.072575950826237273 -0.021620199664435704 0.00021190534338930142 0.023026924935670146 -0.0050898446939788402 0.013944564919525275 -0.0023351743855806895 -0.0093373001253414314 -0.017652327078658863 0.019324456825709043 -0.0097033017310595854 0.0035084615539259048 -0.0023311114375896445 -0.0014863102536381088 0.044708787516880524 -0.0013905916594544635 -0.0072855463206692901 -0.020231750181725339 -0.019827773172433161 -0.0030065275669550291 -0.0036863573316189089 0.031579547452027144 -0.0062355596518505309 0.014566373591414092 0.0046472195149836722 -0.017416964266447534 -0.0086328132559776276 -0.0076483774972705759 -0.011533512654059774 0.0027277789456315645 0.003091348502110354 0.018432911237250629 0.013512697334094582 -0.0050765010330408476 -0.0067527779538583271 -0.0089117139698563393 -0.0019924717590729508 -0.00051742684671454448 0.00045379277403298149 0.042880356185670897 -0.0041959004857905621 0.0070738702001316711 0.0016835428305019909 -4.5934089293484469e-05 -0.0089342172926944741 -0.0091444795008265439 0.0045652979766955572 -0.0024825499364885149 -0.011845530243233355 -8.4569047484345011e-05 0.0051168090236493567 0.00079998344913515267 -0.02342441586599249 0.0026575726936672681 0.0006964635275577975 0.0030569481258942155 -0.0071878830910834862 0.00024743959564652653 -0.0058532486195604447 -0.019727117179587021 0.016432765816230224 0.0057741136630482404 -0.019752149843407677 -0.0057518256635292475 -0.014841100646882297 -0.021490244185149013 -0.01388736924272708 -0.0012547815582788903 -0.017014209003847047 -0.0086544077645152335 -0.00030260542706454086 -0.012953065004531805 -0.022812324006247282 -0.019323988883407382 -0.024809048854978727 -0.024612804475865616 -0.024829264672884644 -0.024794934421240641 -0.024829265682908878
leaf_weight=33.506533168256283 3.853469289839266 52.798677671700716 3.0644272640347481 14.231385767459868 5.3561959676444539 7.4036116003990156 4.8568281903862953 3.0078639388084412 14.508306354284285 6.1843039393425006 5.5356153808534136 74.142824649810791 2.8636938743293285 3.2931707799434662 28.363173298537731 20.530707880854607 12.712515629827978 3.4476374275982371 2.4028081186115733 7.9798692464828518 12.135981425642965 41.704766139388084 34.567825123667717 205.30222952365875 8.616789348423481 6.4541586488485363 11.49641826748848 10.197668433189394 328.50551563501358 10.139370292425157 24.480869293212891 19.743431210517883 66.454923808574677 2.2057937830686569 4.1357461512088767 4.8584347125142804 10.414117842912672 35.105563521385193 12.9789981842041 47.518090583384037 26.014169216156006 26.418058276176453 29.735324367880821 16.902280271053314 55.676127552986145 3.532897870987652 38.507363080978394 17.44308149069548 20.76682423055172 12.908240608870981 36.423575550317764 14.194203376770018 23.375645071268082 55.30379992723465 228.31240859627724 10.962129175662993 5.034049890935421 18.168165862560272 12.789788544178007 119.78934893012047 72.264273285865784 10.690974503755571 43.573480814695358 19.158825635910034 9.9462618529796618 38.111056327819824 18.386012673377991 31.583835482597351 76.558874547481537 18.428434997797012 52.207127451896667 203.62391704320908 16.747361063957214 17.532177954912186 13.704333186149595 11.305558323860167 2.8120020404458028 7.4004480838775635 24.804796725511554 2.1642809957265854 10.705594688653944 2.2979404404759407 13.415550265461206 2.1843573860824099 4.3325310498476028 1.8159480951726434 1.6761363968253133 17.499371826648712 3.6065163910388947 13.730999924242495 0.59518494084477458 19.626257956027985 25.701652616262436 5.5031542852520943 1.9851918146014238 1.26276031136513
leaf_count=1540 65 201 85 18 37 59 119 21 29 30 35 551 42 9 39 123 38 34 77 27 41 201 90 656 34 13 22 16 554 23 36 30 118 34 63 151 20 22 7 234 18 24 83 98 146 81 21 24 35 28 83 66 37 34 363 26 19 16 14 157 50 74 157 8 29 73 38 16 59 58 26 210 18 41 37 28 79 56 114 8 17 51 38 64 35 62 38 17 60 54 23 932 1214 261 94 60
internal_value=0 -0.010175 -0.0154424 0.000606549 -0.00232321 -0.00738971 -0.0100241 -0.00221959 0.00198386 0.000875242 0.0179343 -0.00101425 0.0159377 0.0463128 -0.00215295 -0.00429952 -0.0022771 0.00109273 0.00119263 -0.00385833 -0.00249956 -0.00097442 -0.00187026 1.09091e-05 -0.00792923 -0.00167012 0.00704535 0.00228127 0.0034255 0.00308831 0.00812564 0.0196483 0.00237801 0.0175339 -0.00275257 -0.001017 -0.0121183 0.00370527 0.00457538 -0.00191254 0.00101758 0.002203 -0.0126558 -0.0142334 -0.00638381 -0.0200447 -0.000331084 0.0108202 0.0136567 0.00752349 -0.00713341 -0.0101597 -0.00504924 0.00117982 9.49604e-06 -0.00444128 0.0362998 0.000257946 0.000482164 0.000239974 0.000140362 -0.0136008 -0.00716159 0.000473212 -0.00847717 -0.00935392 -0.00340195 0.00256854 0.00178697 -0.0219513 0.001088 0.000182928 0.000162006 -0.00548471 -0.00185186 -0.00334363 0.00382089 0.00647613 0.0028479 -0.0151395 -0.00408793 -0.0183064 -0.020626 -0.0164166 -0.00263224 -0.0195988 -0.0115668 -0.000992885 -0.0122506 -0.0231631 -0.0211643 -0.0246843 -0.0246227 -0.0248129 -0.0248078 -0.0248293
internal_weight=0 314.298 188.107 2481.96 126.191 100.521 90.9118 923.511 259.047 107.419 16.754 193.42 12.1746 6.15686 181.246 152.883 90.6651 67.5384 42.8956 664.464 432.024 337.284 325.148 239.87 94.7396 40.7616 20.1132 1558.45 817.882 803.651 99.316 40.5884 704.335 9.60941 64.0908 57.6571 23.1266 415.097 341.485 121.661 740.57 340.35 53.978 46.6376 232.441 48.0162 73.6129 65.6265 35.2751 30.3513 199.451 20.6484 78.1852 314.336 400.22 21.1598 11.2184 379.06 360.892 348.102 179.775 31.2217 85.2782 289.238 121.266 93.7872 54.8096 134.561 102.977 39.2006 124.471 270.079 58.7276 27.4784 32.9898 19.2854 38.0817 10.2125 27.8692 6.01775 20.845 6.43369 18.7717 7.04119 7.34039 4.81394 8.81555 41.9802 7.13941 32.1594 2.99799 87.5856 59.2082 28.3774 21.6114 6.76591
internal_count=11116 5881 5164 5235 717 1063 970 3317 1261 642 84 1145 124 51 1021 982 558 500 496 2056 1517 1145 1104 746 372 135 56 1918 1099 1081 141 70 940 93 466 352 58 604 561 785 819 227 237 181 539 474 43 116 64 52 447 79 158 209 592 42 49 550 534 520 110 197 358 336 289 219 121 99 83 295 76 328 71 70 92 55 334 135 199 73 40 114 75 183 56 162 179 53 141 112 100 4101 2754 1347 1026 321
cat_boundaries=0 1 2 3 4 5 6 7 8 9 10 11 12 13 14 15 16 17 18 19 20 21 22 23 24
cat_threshold=1 2 1 1 1 2 1 1 1 1 1 1 2 1 2 1 2 2 1 2 1 1 1 1
is_linear=0
shrinkage=0.05


Tree=101
num_leaves=97
num_cat=25
split_feature=2 3 2 2 2 2 2 2 2 2 3 2 1 3 3 3 3 3 0 2 2 2 2 2 1 2 2 3 2 3 2 2 2 0 1 1 3 2 2 2 2 2 2 1 0 2 3 2 3 1 2 3 3 2 2 2 3 1 1 3 2 2 2 0 2 2 0 2 2 2 2 2 2 2 0 2 2 2 1 1 3 2 1 2 2 0 2 0 2 2 1 0 1 1 0 0
split_gain=12.47 5.08463 5.58639 4.46682 2.87276 2.50999 4.00196 2.42837 2.58017 2.15861 4.20617 1.39605 4.15849 5.09505 1.70716 1.31742 1.15873 6.56682 0.905014 0.878302 1.37701 2.70216 1.24236 2.94739 1.09015 1.15252 1.5128 0.850747 1.93914 1.07681 3.3748 9.57999 0.673078 0.728975 0.672674 0.647429 0.620363 0.558421 0.550024 3.59318 0.336341 0.335478 1.60791 0.311642 0.305083 0.287764 0.225924 0.42108 0.299016 0.216972 0.207647 0.192591 0.171914 0.169083 0.210227 0.144501 0.217413 0.144566 0.140038 0.138322 0.136183 0.134287 0.129995 0.126528 0.123916 0.156102 0.122383 0.116828 0.106421 0.100965 0.109767 0.0830586 0.0829508 0.0542732 0.0488549 0.0394988 0.0660582 0.0368645 1.01056 0.744137 0.0286982 0.0234663 0.0172333 0.0142022 0.00984183 0.00808774 0.0078547 0.00690108 0.00141984 0.00120267 0.00101865 0.000284272 1.83893e-06 9.77963e-07 1.47189e-07 2.22045e-16
threshold=7.5000000000000009 1.0000000180025095e-35 1.0000000180025095e-35 92.500000000000014 5.5000000000000009 6.5000000000000009 2.5000000000000004 23.500000000000004 21.500000000000004 3.5000000000000004 1.5000000000000002 8.5000000000000018 0 1.5000000000000002 6.5000000000000009 1.5000000000000002 6.5000000000000009 3.5000000000000004 1 65.500000000000014 31.500000000000004 32.500000000000007 41.500000000000007 43.500000000000007 2 26.500000000000004 25.500000000000004 5.5000000000000009 93.500000000000014 3.5000000000000004 153.50000000000003 122.50000000000001 1.0000000180025095e-35 3 4 5 47.500000000000007 16.500000000000004 471.50000000000006 456.50000000000006 27.500000000000004 313.50000000000006 334.50000000000006 6 7 643.00000000000011 1.0000000180025095e-35 22.500000000000004 1.5000000000000002 8 27.500000000000004 3.5000000000000004 33.500000000000007 102.50000000000001 95.500000000000014 306.50000000000006 86.500000000000014 9 10 56.500000000000007 37.500000000000007 4.5000000000000009 649.50000000000011 11 84.500000000000014 78.500000000000014 12 82.500000000000014 4.5000000000000009 709.50000000000011 372.00000000000006 125.50000000000001 628.50000000000011 88.500000000000014 13 81.500000000000014 72.500000000000014 1.5000000000000002 14 15 1.5000000000000002 109.50000000000001 16 6.5000000000000009 196.50000000000003 17 1.5000000000000002 18 4.5000000000000009 5.5000000000000009 19 20 21 22 23 24
decision_type=2 2 2 2 2 2 2 2 2 2 2 2 1 2 2 2 2 2 9 2 2 2 2 2 1 2 2 2 2 2 2 2 2 9 1 1 2 2 2 2 2 2 2 1 9 2 2 2 2 1 2 2 2 2 2 2 2 1 1 2 2 2 2 9 2 2 9 2 2 2 2 2 2 2 9 2 2 2 1 1 2 2 1 2 2 9 2 9 2 2 1 9 1 1 9 9
left_child=1 2 91 7 9 6 18 8 11 16 61 12 80 -14 15 37 17 32 77 20 24 -22 60 -24 40 26 -26 28 -5 34 31 81 33 -3 38 -7 -18 -13 39 -30 63 53 -43 68 75 -40 47 -10 -48 64 -27 67 69 54 -29 56 57 -55 -17 -54 -23 -11 71 -9 65 -46 -32 -51 85 70 -44 -36 -61 -66 -42 76 -21 79 -79 -4 -2 -31 -34 -6 -68 -8 90 88 -45 -70 -20 92 -1 94 -93 -95
right_child=3 4 5 27 83 35 43 19 46 10 -12 14 13 -15 -16 58 36 -19 86 44 21 22 23 -25 25 50 -28 41 29 30 66 -33 82 -35 62 -37 -38 -39 45 -41 74 42 52 87 49 -47 48 -49 -50 51 -52 -53 59 55 -56 -57 -58 -59 -60 72 -62 -63 -64 -65 73 -67 84 -69 89 -71 -72 -73 -74 -75 -76 -77 -78 78 -80 -81 -82 -83 -84 -85 -86 -87 -88 -89 -90 -91 -92 93 -94 95 -96 -97
leaf_value=-0.024625409009569117 -0.012393831011290851 0.00069570296606235758 -0.020754074616382536 0.021415748781838734 -0.018342575019541237 0.023703477424708318 -0.017425246416260025 -0.017144510202511037 0.0066050631028784198 0.029243813472876735 -0.019176724132208566 0.00083604529455273474 -0.0070640595708043154 0.082406764285059497 0.0090964526237014235 -0.015888641273040051 -0.019853625950161342 0.065757112601415327 -0.021550064133869326 0.00020659949553815854 0.021937534228809952 -0.004989117918051786 0.013407632368757961 -0.0022825851508002175 -0.0091919693753091322 -0.017524512741278996 0.018479401888700165 -0.0095558155821040321 0.0034092140238345075 -0.0022786045921537432 0.0040427910194506828 0.045512854266232521 -0.020137787317344155 -0.019727615269890812 -0.0013579753835870046 -0.0071572634127113387 -0.0033607286717475511 -0.0061192548321940717 -0.0036082732585239019 0.029826014630942435 -0.0018604837645768973 0.013996681521649838 0.0045105537252275929 -0.011379278261224934 -0.0075164676298973832 0.0026527118877459695 0.0030051700993353444 0.01764276920814789 0.012998078402641984 -0.0049759711547678401 -0.0066302982512088009 -0.0087692272068605279 -0.0019148808789913334 -0.00050484401184391556 0.00044232210444606788 -0.0041091431134638208 0.0068489877544663505 0.0016389449477914092 -0.0087915712550472175 -3.8289664553828693e-05 -0.0090003924611498417 0.040038311992550174 0.0044314087839031407 -0.0094646368099093811 -0.0024270042228106766 -0.011690816405814668 -0.0019668371662766144 -8.2476342157237318e-05 -0.023391118904245209 0.0049639720091936065 0.00077948870088668121 0.00067869194854092922 0.0025846214794350308 -0.0070606220410058445 -0.0084923870307442272 0.00024123537824894293 -0.0057418515097985949 -0.019625468125020987 0.015760257711047963 0.005597915945408251 -0.01965086843778549 -0.005641779392223616 -0.014691759970848465 -0.021417711202506903 -0.00038223217816711136 -0.013734355076588956 -0.016880104208278665 -0.0085138163176878712 -0.012798231559557692 -0.022765784290626336 -0.019216570851443539 -0.024808538908616409 -0.024607410194627963 -0.024829264961797659 -0.024794074030793339 -0.024829264871555162
leaf_weight=32.691333070397377 3.8054146841168386 52.836385477334261 3.0012312717735767 14.55473345518112 5.2582210637629041 7.5904927104711515 4.7723152637481689 26.489871665835381 14.607593744993208 6.3786571770906466 5.4298855774104586 74.206473268568516 2.8431738018989563 3.6135478317737579 28.631543941795826 20.204207833856344 11.918370462954046 3.7071564905345431 2.3514164034277192 7.9815604090690639 12.418678253889082 41.493034660816193 35.053235068917274 204.82337173819542 8.5367063656449318 6.3412274122238186 11.720740959048271 10.099195778369905 329.66008779406548 10.115761756896974 17.344827175140381 18.449218213558197 4.0529134757816783 4.7630514688789836 66.362576812505722 2.1897819563746452 10.930477052927015 47.222710683941841 34.976389765739441 13.395409345626829 3.3285843878984451 26.395874619483948 26.541114747524261 3.4923852942883951 55.251920089125633 38.612545847892761 17.497087180614475 21.153166919946671 13.083849497139452 36.23913985490799 14.098676100373266 23.168253928422928 56.386705040931702 228.19430470466614 10.967104882001875 18.092093825340271 12.88058280944824 119.99118909239769 10.59588433802128 71.067967772483826 43.176840335130692 5.254606619477272 19.246490955352783 6.7245623916387549 9.9216003417968768 37.662274032831192 14.874875664710997 18.384458154439926 18.00177676230669 31.7458575963974 76.620144546031952 203.76578366756439 52.346055865287781 17.406610667705536 16.756993934512142 13.70772463083267 11.239577457308767 2.7570728026330453 7.5230627059936523 24.948436439037327 2.1219512522220612 10.644194841384886 2.2640882730484009 13.130322385579348 28.714467406272888 2.1542320996522895 1.7853125743567941 1.6616930700838564 3.5601021200418472 13.421309553086759 0.58379399031400714 19.14533969014883 25.076785240322351 5.3681969940662384 1.9365742504596735 1.2317929789423967
leaf_count=1540 65 201 85 18 37 59 119 77 29 30 35 551 42 9 39 123 36 34 77 27 41 201 90 656 34 13 22 16 554 23 19 26 63 151 118 34 22 234 22 7 24 18 24 81 146 21 24 35 28 83 66 37 35 363 26 16 14 157 74 49 157 19 8 38 29 73 23 38 58 16 59 210 26 41 98 37 28 79 56 114 8 17 51 38 33 64 62 38 60 54 23 932 1214 261 94 60
internal_value=0 -0.0100277 -0.0152973 0.00059022 -0.00227555 -0.0072627 -0.00987651 -0.00217054 0.00192811 0.000847382 0.0171595 -0.000992625 0.0152482 0.0430089 -0.00210468 -0.00421141 -0.00222908 0.00106008 0.00115948 -0.0037779 -0.00244457 -0.000951828 -0.00182768 1.02307e-05 -0.00779579 -0.00163358 0.00681839 0.0022189 0.0033279 0.00300134 0.00785338 0.0192959 -0.00269235 -0.000993156 0.00231311 0.0167938 -0.0119637 -0.00186881 0.00359932 0.00444072 -0.012501 0.000991136 0.00214328 -0.0199479 -0.00626582 -0.000323098 0.0104358 0.0131341 0.00728057 -0.00700683 -0.0100101 -0.00494922 0.00114908 9.18814e-06 -0.00435079 0.000251432 0.000469929 0.000233945 -0.0134471 0.000136817 -0.00703464 0.0341196 0.000461217 -0.0155897 -0.00833802 -0.00920852 0.000490521 -0.00332899 -0.0218874 0.0024982 0.00173941 0.000178343 0.00107422 -0.00537837 -0.00739335 -0.00180936 -0.00327176 0.00370988 0.00627001 0.00276824 -0.0149918 -0.004003 -0.0181859 -0.0205384 -0.000922979 -0.0162773 -0.0194953 -0.0114126 -0.0120956 -0.023124 -0.0210859 -0.0246807 -0.0246176 -0.0248125 -0.0248072 -0.0248293
internal_weight=0 311.169 185.244 2483.56 125.924 99.7944 90.0141 921.512 259.587 107.536 17.0631 193.245 12.3841 6.45672 180.861 152.229 90.4724 67.6236 42.9503 661.926 430.963 336.965 324.546 239.877 93.9974 40.6974 20.2574 1562.05 820.717 806.163 100.143 39.2092 63.9164 57.5994 706.019 9.78027 22.8488 121.429 416.644 343.055 53.3 741.328 341.104 47.0638 230.963 73.5889 66.3417 35.7608 30.5809 198.034 20.4399 77.7919 314.708 400.224 21.0663 379.158 361.066 348.185 30.8001 179.801 84.6699 11.6333 289.375 33.2144 120.242 92.9142 60.9342 54.6236 38.3496 134.907 103.161 270.128 123.414 27.3282 20.0856 32.9289 19.2211 38.2298 10.2801 27.9497 5.92737 20.76 6.317 18.3885 43.5893 6.92655 4.72052 8.71418 7.05249 31.4231 2.93521 85.45 57.7681 27.6819 21.0819 6.59999
internal_count=11116 5881 5164 5235 717 1063 970 3317 1261 642 84 1145 124 51 1021 982 558 500 496 2056 1517 1145 1104 746 372 135 56 1918 1099 1081 141 66 466 352 940 93 58 785 604 561 237 819 227 474 539 43 116 64 52 447 79 158 209 592 42 550 534 520 197 110 358 49 336 115 289 219 75 121 295 99 83 328 75 70 122 92 55 334 135 199 73 40 114 75 56 183 162 179 141 112 100 4101 2754 1347 1026 321
cat_boundaries=0 1 2 3 4 5 6 7 8 9 10 11 12 13 14 15 16 17 18 19 20 21 22 23 24 25
cat_threshold=1 2 1 2 1 1 1 1 1 1 1 2 1 1 1 2 1 2 2 1 2 1 1 1 1
is_linear=0
shrinkage=0.05


Tree=102
num_leaves=97
num_cat=25
split_feature=2 3 2 2 2 2 2 2 2 2 3 2 1 3 3 3 3 3 0 2 2 2 2 2 1 2 2 3 2 3 2 2 2 0 1 3 1 2 2 2 2 2 2 1 0 1 3 2 3 2 3 3 2 2 2 1 2 3 1 2 0 2 2 2 2 2 2 2 2 2 0 3 2 0 2 2 2 1 1 3 2 1 2 2 0 2 0 2 2 2 1 0 1 1 0 0
split_gain=11.9863 4.97076 5.57155 4.24628 2.7927 2.38748 3.91754 2.31742 2.42611 2.01829 3.87334 1.30652 3.77826 4.2943 1.61887 1.27796 1.11625 5.84777 0.873583 0.845591 1.32472 2.51975 1.19203 2.77106 1.0597 1.10111 1.4154 0.803126 1.79251 1.00854 3.11868 7.76912 0.654495 0.707586 0.635408 0.611358 0.595292 0.563908 0.532429 0.87994 0.331551 0.317963 1.50224 0.312747 0.294593 0.210619 0.208178 0.385446 0.277679 0.204424 0.186342 0.163451 0.216961 0.161484 0.202672 0.138411 0.137891 0.205158 0.137285 0.132296 0.125572 0.12298 0.120609 0.152786 0.114807 0.112048 0.107663 0.0790262 0.0755177 0.195411 0.0734937 0.0644554 0.0523961 0.0473023 0.0377489 0.0633829 0.0345487 0.958966 0.716799 0.028621 0.0225873 0.0172904 0.0145843 0.0143538 0.00806912 0.00791598 0.00677902 0.00517332 0.00140073 0.0012265 0.00103112 0.000291316 1.88381e-06 1.00218e-06 1.50939e-07 4.44089e-16
threshold=7.5000000000000009 1.0000000180025095e-35 1.0000000180025095e-35 92.500000000000014 5.5000000000000009 6.5000000000000009 2.5000000000000004 23.500000000000004 21.500000000000004 3.5000000000000004 1.5000000000000002 8.5000000000000018 0 1.5000000000000002 6.5000000000000009 1.5000000000000002 6.5000000000000009 3.5000000000000004 1 65.500000000000014 31.500000000000004 32.500000000000007 41.500000000000007 43.500000000000007 2 26.500000000000004 25.500000000000004 5.5000000000000009 93.500000000000014 3.5000000000000004 160.50000000000003 122.50000000000001 1.0000000180025095e-35 3 4 47.500000000000007 5 13.500000000000002 119.50000000000001 243.50000000000003 27.500000000000004 313.50000000000006 334.50000000000006 6 7 8 1.0000000180025095e-35 22.500000000000004 1.5000000000000002 27.500000000000004 3.5000000000000004 16.500000000000004 490.00000000000006 102.50000000000001 95.500000000000014 9 306.50000000000006 86.500000000000014 10 37.500000000000007 11 649.50000000000011 84.500000000000014 78.500000000000014 4.5000000000000009 82.500000000000014 4.5000000000000009 125.50000000000001 454.50000000000006 517.50000000000011 12 33.500000000000007 88.500000000000014 13 81.500000000000014 72.500000000000014 1.5000000000000002 14 15 1.5000000000000002 109.50000000000001 16 98.500000000000014 6.5000000000000009 17 1.5000000000000002 18 272.50000000000006 4.5000000000000009 5.5000000000000009 19 20 21 22 23 24
decision_type=2 2 2 2 2 2 2 2 2 2 2 2 1 2 2 2 2 2 9 2 2 2 2 2 1 2 2 2 2 2 2 2 2 9 1 2 1 2 2 2 2 2 2 1 9 1 2 2 2 2 2 2 2 2 2 1 2 2 1 2 9 2 2 2 2 2 2 2 2 2 9 2 2 9 2 2 2 1 1 2 2 1 2 2 9 2 9 2 2 2 1 9 1 1 9 9
left_child=1 2 91 7 9 6 18 8 11 16 64 12 79 -14 15 37 17 32 76 20 24 -22 59 -24 40 26 -26 28 -5 34 31 80 33 -3 38 -18 -7 -13 82 -40 60 53 -43 66 74 62 47 -10 -48 -27 65 52 -44 54 -29 -17 57 58 -55 -23 -9 67 63 -46 -11 -47 84 -36 71 -70 -32 -53 -64 -42 75 -21 78 -78 -4 -2 -31 -34 -30 -6 -8 90 88 -72 -45 -68 -20 92 -1 94 -93 -95
right_child=3 4 5 27 83 36 43 19 46 10 -12 14 13 -15 -16 55 35 -19 85 44 21 22 23 -25 25 49 -28 41 29 30 70 -33 81 -35 61 -37 -38 -39 39 -41 73 42 51 86 45 50 48 -49 -50 -51 -52 68 -54 56 -56 -57 -58 -59 -60 -61 -62 -63 72 -65 -66 -67 89 -69 69 -71 87 -73 -74 -75 -76 -77 77 -79 -80 -81 -82 -83 -84 -85 -86 -87 -88 -89 -90 -91 -92 93 -94 95 -96 -97
leaf_value=-0.024620326083608587 -0.012238749175856269 0.00067795148680000416 -0.020668615034973588 0.020435908293366709 -0.018222494112017134 0.022566608450291004 -0.017295099454223469 -0.017011623231963341 0.0063981211957146308 0.027685411712101312 -0.019067281331197825 -0.0084017553491184775 -0.0069381207566496881 0.073924105206675902 0.0087892483589415236 -0.01574545252543233 -0.019753854404460047 0.059992037956940893 -0.021478629839173004 0.00020142767520522762 0.02092276030061711 -0.0048898857370695036 0.012898388269327916 -0.0022310617860217012 -0.0090475694161600336 -0.017395372720823487 0.01768643368751625 -0.0094091659598794508 -0.0026534811462761987 -0.0022271619206628329 0.0030093166482620306 0.039003566932616099 -0.020042353337076046 -0.019625972956305162 -0.0013260802991104023 -0.003288457396092322 -0.0070303261413241815 -5.7153128250469089e-05 0.0068918926970271384 0.0019309925971358098 -0.0018177110304913322 0.013457032084606378 0.0008377931060822544 -0.011225352903536904 -0.0073858463139850061 -0.0048769354948870122 0.0029216474814712724 0.016900017011109509 0.012509577092775816 -0.0065092330096986721 -0.0086277736817339003 0.0039905489415821126 0.0062098800648130933 -0.00049256088473682499 0.00043114644571831917 -0.0086499530524525494 -0.0040238260106608128 0.0066327648658086741 0.001595600527010829 -0.0088572834191845608 -0.0093185260496464993 0.0043020297716343655 -0.0023725677858344608 -0.011536315734746221 0.03749243167796272 -8.0435280332125418e-05 -0.023357082821866052 0.00066138579165939322 -0.003151008958710946 0.00085302148349415935 -0.0014064534671280739 0.00078722311409478655 -0.006934720340523161 -0.0083530570218469241 0.00023518826989230783 -0.0056319391439535625 -0.019522332452644231 0.015125572432548921 0.0054280611453491603 -0.019548102262026315 -0.005533221891374754 -0.014541722581486328 -0.00057008485891263676 -0.021343855394168641 -0.013580922610785646 -0.01674478222518376 -0.0083743166235391991 -0.00028580286599077571 -0.01264326598230036 -0.0227182678422478 -0.019107671375958667 -0.024808021656131021 -0.024601883330158281 -0.02482926410818365 -0.024793190970425684 -0.024829264962492492
leaf_weight=31.896129101514816 3.7585420534014684 52.873156432062387 2.9395852796733379 14.869795739650725 5.1626509800553331 7.7725627049803716 4.6898766979575157 26.039586387574673 14.704397112131117 6.5679477974772471 5.3267501629889003 25.691916558891535 2.8231603056192398 3.9239423274993896 28.893177792429924 19.885727107524872 11.684081051498653 3.9591218568384638 2.3012853823602191 7.9832094460725811 12.694123506546019 41.286536678671837 35.526380524039268 204.35637812316418 8.4585967659950256 6.2310682833194759 11.939346626400948 10.003149390220644 10.173699498176573 10.092738121747972 16.226137459278107 21.508050918579102 3.9721130970865479 4.6700085103511801 66.272519141435623 10.893804579973219 2.1741650365293026 95.511247284710407 165.67543452978134 194.11949902772903 3.3223973512649536 26.767926692962646 44.170594751834869 3.4528697021305543 54.838177740573883 36.059262961149216 17.549748323857788 21.529678583145142 13.255024433135985 14.005506500601767 22.965974390506744 23.307646512985229 32.715051770210266 228.079131513834 10.971956849098204 10.503138296306135 18.017903506755829 12.969104528427122 120.18800994753838 42.789975538849831 6.6612171232700339 19.331969499588013 9.8975496590137499 37.224535346031189 5.4692607410252094 18.382941544055939 17.585581503808498 203.90412491559982 40.129124283790588 126.6145703792572 25.050948917865753 48.133446276187897 17.284142017364502 16.615289986133579 13.711031883955 11.175226345658301 2.7034914493560773 7.6425672769546509 25.088488429784778 2.0806601047515869 10.584311753511427 2.2310680262744427 48.183738112449646 12.852091263979673 2.1248473227024069 1.75542926043272 1.6476057693362234 17.487391471862793 3.5148294866085052 13.119215145707132 0.57268257625401053 18.676213972270489 24.46724010258913 5.2365499008446932 1.8891490399837518 1.2015850469470049
leaf_count=1540 65 201 85 18 37 59 119 77 29 30 35 354 42 9 39 123 36 34 77 27 41 201 90 656 34 13 22 16 28 23 17 30 63 151 118 22 34 431 286 164 24 18 37 81 146 83 24 35 28 66 37 20 20 363 26 74 16 14 157 157 38 8 29 73 19 38 58 210 25 71 37 36 41 98 37 28 79 56 114 8 17 51 126 38 64 62 38 17 60 54 23 932 1214 261 94 60
internal_value=0 -0.00988092 -0.0151514 0.000574376 -0.00222851 -0.00713695 -0.0097296 -0.0021224 0.00187423 0.000820734 0.0164321 -0.000971217 0.0146043 0.0400893 -0.00205739 -0.00412474 -0.00218175 0.00102878 0.00112733 -0.00369882 -0.00239062 -0.000929716 -0.00178599 9.59362e-06 -0.0076635 -0.00159771 0.00660041 0.00215839 0.00323343 0.00291708 0.00759236 0.0179648 -0.00263328 -0.000969846 0.00225014 -0.0118093 0.0160973 -0.00182599 0.0034968 0.00421535 -0.012346 0.000965407 0.00208531 -0.0198496 -0.00614926 -0.00688161 0.0100691 0.0126382 0.00704725 -0.0098612 -0.00485068 0.00111919 0.00312363 8.89124e-06 -0.00426176 -0.0132931 0.000245084 0.000458011 0.00022807 -0.00690906 -0.0154445 0.000449532 -0.0082 -0.00906404 0.0321414 -0.00325735 -0.0218223 0.000173874 0.000472154 -0.000110603 0.000146324 0.00183231 -0.00527352 -0.00726401 -0.00176776 -0.00320121 0.00360254 0.00607185 0.00269104 -0.0148433 -0.00391949 -0.018064 -0.000933292 -0.0204493 -0.016137 -0.0193903 -0.0112586 -0.000945757 -0.0119406 -0.0230841 -0.0210062 -0.024677 -0.0246123 -0.024812 -0.0248067 -0.0248293
internal_weight=0 308.114 182.452 2485.11 125.662 99.0851 89.1384 919.559 260.11 107.647 17.364 193.072 12.5863 6.7471 180.485 151.592 90.2834 67.7055 43.0035 659.448 429.926 336.653 323.959 239.883 93.273 40.6345 20.3979 1565.55 823.48 808.611 100.95 42.1851 63.7463 57.5432 707.661 22.5779 9.94673 121.203 418.152 359.795 52.6385 742.068 341.838 46.1348 229.522 196.653 67.0388 36.2341 30.8048 20.2366 77.4082 315.07 76.8856 400.229 20.9751 30.3889 379.254 361.236 348.267 84.0765 32.7008 289.509 119.244 92.0627 12.0372 54.4422 37.5195 270.177 238.185 166.744 58.7645 71.4411 27.1817 19.9377 32.8695 19.1584 38.3741 10.3461 28.0281 5.8392 20.677 6.20318 58.3574 18.0147 6.81472 4.6294 8.6153 42.5383 6.9677 30.7048 2.87397 83.3669 56.3634 27.0035 20.5654 6.43813
internal_count=11116 5881 5164 5235 717 1063 970 3317 1261 642 84 1145 124 51 1021 982 558 500 496 2056 1517 1145 1104 746 372 135 56 1918 1099 1081 141 70 466 352 940 58 93 785 604 450 237 819 227 474 539 447 116 64 52 79 158 209 57 592 42 197 550 534 520 358 115 336 289 219 49 121 295 328 152 96 71 56 70 122 92 55 334 135 199 73 40 114 154 75 183 162 179 54 141 112 100 4101 2754 1347 1026 321
cat_boundaries=0 1 2 3 4 5 6 7 8 9 10 11 12 13 14 15 16 17 18 19 20 21 22 23 24 25
cat_threshold=1 2 1 2 1 1 1 1 1 1 1 2 1 1 1 2 1 2 2 1 2 1 1 1 1
is_linear=0
shrinkage=0.05


Tree=103
num_leaves=100
num_cat=24
split_feature=2 3 2 2 2 2 2 2 2 2 3 2 1 3 3 3 3 3 0 2 2 2 2 2 1 2 3 3 2 3 2 2 2 0 3 1 1 2 2 2 0 2 1 2 0 2 2 2 2 1 2 1 2 3 3 3 2 1 2 2 2 3 2 2 0 2 2 2 3 2 2 3 2 2 2 2 2 2 2 2 1 1 3 2 1 2 2 0 2 3 0 2 2 1 0 1 1 0 0
split_gain=11.5197 4.85795 5.55524 4.03686 2.71467 2.27197 3.8341 2.21149 2.28213 1.88858 3.57626 1.22397 3.4459 3.66169 1.53541 1.23932 1.07519 5.23818 0.843276 0.813902 1.27415 2.35193 1.14355 2.60651 1.02978 1.05206 1.32699 0.758454 1.6589 0.9452 2.91241 7.74797 0.636295 0.686749 0.602285 0.600413 0.5483 0.546001 0.505743 3.29605 0.32837 0.32405 0.313757 0.305711 0.284383 0.273481 0.244456 0.355564 0.212352 0.204377 0.203967 1.61717 0.201171 0.180239 0.168772 1.79682 0.179011 0.136743 0.128473 0.119567 0.301334 0.117407 0.116485 0.242724 0.108916 0.108894 0.107445 0.0987761 0.0970658 0.0606059 0.056158 0.0657577 0.0538464 0.106885 0.0473131 0.0410097 0.0960252 0.0360726 0.0608052 0.0323928 0.91068 0.690578 0.0285324 0.0217359 0.0173412 0.0145029 0.0100093 0.0080471 0.00797518 0.00787455 0.00665611 0.00138123 0.00125065 0.00104348 0.000298523 1.92988e-06 1.02757e-06 1.5473e-07 2.22045e-16
threshold=7.5000000000000009 1.0000000180025095e-35 1.0000000180025095e-35 92.500000000000014 5.5000000000000009 6.5000000000000009 2.5000000000000004 23.500000000000004 21.500000000000004 3.5000000000000004 1.5000000000000002 8.5000000000000018 0 1.5000000000000002 6.5000000000000009 1.5000000000000002 6.5000000000000009 3.5000000000000004 1 65.500000000000014 31.500000000000004 32.500000000000007 41.500000000000007 43.500000000000007 2 26.500000000000004 1.0000000180025095e-35 5.5000000000000009 93.500000000000014 3.5000000000000004 153.50000000000003 122.50000000000001 1.0000000180025095e-35 3 47.500000000000007 4 5 16.500000000000004 471.50000000000006 456.50000000000006 6 27.500000000000004 7 129.50000000000003 8 643.00000000000011 95.500000000000014 119.50000000000001 123.50000000000001 9 22.500000000000004 10 27.500000000000004 3.5000000000000004 35.500000000000007 34.500000000000007 709.50000000000011 11 37.500000000000007 81.500000000000014 78.500000000000014 8.5000000000000018 248.50000000000003 232.50000000000003 12 4.5000000000000009 82.500000000000014 4.5000000000000009 58.500000000000007 203.50000000000003 109.50000000000001 12.500000000000002 628.50000000000011 469.50000000000006 345.50000000000006 238.50000000000003 374.50000000000006 81.500000000000014 72.500000000000014 1.5000000000000002 13 14 1.5000000000000002 109.50000000000001 15 6.5000000000000009 196.50000000000003 16 1.5000000000000002 1.0000000180025095e-35 17 4.5000000000000009 5.5000000000000009 18 19 20 21 22 23
decision_type=2 2 2 2 2 2 2 2 2 2 2 2 1 2 2 2 2 2 9 2 2 2 2 2 1 2 2 2 2 2 2 2 2 9 2 1 1 2 2 2 9 2 1 2 9 2 2 2 2 1 2 1 2 2 2 2 2 1 2 2 2 2 2 2 9 2 2 2 2 2 2 2 2 2 2 2 2 2 2 2 1 1 2 2 1 2 2 9 2 2 9 2 2 1 9 1 1 9 9
left_child=1 2 94 7 9 6 18 8 11 16 67 12 82 -14 15 37 17 32 79 20 24 -22 58 -24 40 26 -26 28 -5 35 31 83 33 -3 -18 38 -7 -13 39 -30 89 -42 65 46 77 -40 -29 70 -49 59 51 -10 -27 66 55 56 69 -17 -23 60 -46 -61 63 -37 -32 87 -51 -11 75 -45 71 -48 73 -70 -64 -56 -77 78 -21 81 -81 -4 -2 -31 -34 -6 -66 -8 93 -9 91 -44 -67 -20 95 -1 97 -96 -98
right_child=3 4 5 27 85 36 42 19 50 10 -12 14 13 -15 -16 57 34 -19 88 44 21 22 23 -25 25 52 -28 43 29 30 64 -33 84 -35 -36 62 -38 -39 45 -41 41 -43 90 54 49 -47 47 48 -50 53 -52 -53 -54 -55 68 -57 -58 -59 -60 61 -62 -63 74 -65 86 92 -68 -69 72 -71 -72 -73 -74 -75 -76 76 -78 -79 -80 80 -82 -83 -84 -85 -86 -87 -88 -89 -90 -91 -92 -93 -94 -95 96 -97 98 -99 -100
leaf_value=-0.024615118451084907 -0.012083710413837838 0.00066066516511004603 -0.020581726058208353 0.019520261248623574 -0.01810099874468404 0.021509021226740241 -0.017163662127275041 -0.0042899314474944663 0.022721595424738221 0.026251460008987884 -0.018956361501601814 0.0008899969348934644 -0.0068135580238672389 0.066887152678853229 0.0084950617261240809 -0.015601291627062183 -0.019652598710943957 0.055053067622381373 -0.021405884874827801 0.00019638630897146926 0.01997544442947978 -0.0047921456464472649 0.012414886277269136 -0.0021805874926684207 0.016077898629694828 -0.017264924704609479 -0.01028645133352875 -0.009263390754942525 0.0032031351656229157 -0.0021767672619803116 0.0037683431155590428 0.039812084452993647 -0.019945444823488593 -0.019522843825107064 -0.0032175047585624723 0.00018859624660346665 -0.0069047533469363907 -0.0060033369527505648 -0.0035726497874281693 0.028117599655756401 -0.01703594726196379 -0.0082148536616672707 -0.011071783689026012 0.0017235245895888211 -0.0072565349031539538 0.0025270308411288397 -0.0012043920306028439 -0.0093892523164186142 -0.0010170479864235159 -0.0047793916340108135 0.0066779325328045359 0.0019053086808695455 -0.0063895945027098921 -0.0084873862757833731 0.00091775382324240588 0.015878911224441527 0.004717185893148514 -0.0085093956613369569 -0.0087151866501042289 -0.0043031355555649521 -0.014217920367015162 -0.0102279475512189 0.0034343525282827373 -0.006686255524295916 -0.0019538141181512252 -0.023322292665559536 -7.8444524361391123e-05 0.035199098499305935 0.0015749340155659652 0.00032481109734428334 0.0043886352426030359 0.0036586350902285078 0.002403863835846043 -0.0016145788423780807 0.0010926566314536886 -0.0035662371739281096 8.6723201892660796e-05 0.00022929409906520074 -0.0055235159769438215 -0.019417709402722159 0.014525776927386855 0.0052642688639194133 -0.019443849417454362 -0.0054261565471601433 -0.014391031229691501 -0.021268663382117043 -0.00035518401037339537 -0.013427117146591986 -0.016608269794327078 -0.00093491063280699773 -0.0082359392393514617 -0.012488217086686626 -0.022669760750329497 -0.018997293199011007 -0.024807487382377168 -0.024596220433801275 -0.024829266417100631 -0.024792284283519522 -0.024829265690389062
leaf_weight=31.120422147214413 3.7128224782645685 52.909014586359262 2.8794516064226627 15.176799416542051 5.0694265626370916 7.9499573409557325 4.6094621792435646 2.9600637257099152 18.450499445199966 6.752324581146242 5.2261457480490199 74.050809115171432 2.8036406710743904 4.2250071167945862 29.148246586322784 19.575069613754749 11.455540139228107 4.203906785696744 2.2523839324712744 7.9848177134990719 12.962517589330671 41.085142865777016 35.987581744790077 203.90095496177673 12.989769384264948 6.1236142367124584 7.5450322031974784 9.9094696044921857 332.08356827497482 10.070285111665727 17.511283576488495 20.076267898082733 3.8932950459420672 4.5792487636208525 10.858039408922194 166.71279689669609 2.1589335724711418 46.931943148374557 34.917773842811584 13.827634334564207 28.281558066606522 16.477079510688782 3.4143267981708032 118.24381971359253 54.434643864631653 38.7899409532547 18.217301905155185 14.741191685199739 15.577318370342253 35.883832395076752 30.392882846295834 18.874999538064003 13.914637580513952 22.768681347370148 22.406651020050049 21.890409827232361 32.011014223098755 10.412678398191931 42.412645980715752 30.567272633314133 21.759123086929321 11.509964376688002 29.616396307945251 13.910071492195128 14.866407573223112 17.179593108594418 18.381463170051575 5.6782091371715069 74.470885515213013 224.45874720811844 15.256915956735609 11.240653842687605 50.842074871063232 40.580017924308777 79.399773716926575 32.240525126457214 40.701597809791565 13.714256703853605 11.112465083599089 2.651225019246338 7.7590444087982178 25.225039333105091 2.0403821617364883 10.525908231735228 2.1988592147827148 12.580684881657362 28.682732760906219 2.0961850658059111 1.7262797076255081 4.2745319604873657 1.6338657625019548 3.4706702828407288 12.824529364705088 0.56184384413063559 18.218594364821911 23.87264409661293 5.1081308461725712 1.8428869433701063 1.1721178516745592
leaf_count=1540 65 201 85 18 37 59 119 21 33 30 35 551 42 9 39 123 36 34 77 27 41 201 90 656 29 13 27 16 554 23 19 26 63 151 22 251 34 234 22 7 83 98 81 199 146 21 42 18 31 83 56 27 66 37 31 13 16 74 157 89 34 20 28 10 23 58 38 19 72 216 33 26 25 26 47 28 27 37 28 79 56 114 8 17 51 38 33 64 62 35 38 60 54 23 932 1214 261 94 60
internal_value=0 -0.00973485 -0.0150047 0.000559051 -0.00218213 -0.00701246 -0.00958345 -0.00207519 0.00182212 0.000795199 0.015748 -0.000950079 0.014001 0.0374889 -0.00201106 -0.0040395 -0.00213513 0.000998694 0.00109614 -0.0036211 -0.00233771 -0.000908076 -0.00174516 8.99527e-06 -0.00753245 -0.00156252 0.00639094 0.00209976 0.00314215 0.00283565 0.00734273 0.0177084 -0.00257536 -0.00094706 -0.0116551 0.00218917 0.0154408 -0.00178408 0.0033978 0.00419908 -0.0121911 -0.0137886 -0.0197499 0.00094037 -0.00603417 -0.000362589 -0.0018825 -0.000907728 -0.00508771 -0.00675777 0.00971891 0.0121951 -0.00971305 -0.00475363 0.00130487 0.00195485 0.00114142 -0.0131388 -0.00678485 -0.00806313 -0.00924454 -0.00592383 0.000438149 -0.000340848 0.000438167 -0.021756 -0.00318702 0.0303387 0.000318099 0.000807414 0.00192647 0.000651256 0.00104878 0.000449949 0.00172882 -0.000953172 -0.00152789 -0.00172705 -0.00313195 0.00349873 0.00588125 0.00261621 -0.014694 -0.0038374 -0.0179407 -0.0203589 -0.00090091 -0.0159956 -0.0192838 -0.00230763 -0.011105 -0.0117858 -0.0230434 -0.020925 -0.0246732 -0.0246069 -0.0248116 -0.0248061 -0.0248293
internal_weight=0 305.132 179.728 2486.61 125.405 98.3928 88.2839 917.651 260.619 107.755 17.6567 192.901 12.7819 7.02865 180.119 150.971 90.0979 67.7843 43.0553 657.032 428.915 336.349 323.386 239.889 92.5663 40.5731 20.5348 1568.96 826.168 810.991 101.733 40.6725 63.5804 57.4883 22.3136 709.258 10.1089 120.983 419.619 345.911 51.9932 44.7586 45.2286 742.789 228.117 73.7077 84.9429 75.0334 30.3185 195.305 67.7184 37.3255 20.0383 77.034 657.846 396.604 374.714 29.9877 83.4978 118.271 76.1938 42.0772 289.639 180.623 61.0604 36.7098 54.2653 12.4305 261.242 342.703 44.7149 29.458 165.893 115.051 109.016 95.3488 72.9421 32.8115 19.0973 38.5148 10.4103 28.1045 5.7532 20.5962 6.09215 17.6501 43.5491 6.70565 4.54051 7.2346 8.51886 6.885 30.0041 2.81423 81.3348 54.9931 26.3417 20.0615 6.28025
internal_count=11116 5881 5164 5235 717 1063 970 3317 1261 642 84 1145 124 51 1021 982 558 500 496 2056 1517 1145 1104 746 372 135 56 1918 1099 1081 141 66 466 352 58 940 93 785 604 561 237 181 474 819 539 43 166 150 49 447 116 60 79 158 653 444 431 197 358 289 180 109 336 261 75 295 121 49 209 415 101 68 123 98 75 86 55 92 55 334 135 199 73 40 114 75 56 183 162 56 179 141 112 100 4101 2754 1347 1026 321
cat_boundaries=0 1 2 3 4 5 6 7 8 9 10 11 12 13 14 15 16 17 18 19 20 21 22 23 24
cat_threshold=1 2 1 2 1 1 1 1 1 1 1 1 1 1 2 1 2 2 1 2 1 1 1 1
is_linear=0
shrinkage=0.05


Tree=104
num_leaves=94
num_cat=22
split_feature=2 3 2 2 2 2 2 2 2 2 3 2 1 3 3 3 3 0 2 2 2 2 2 1 2 2 3 2 3 2 2 3 3 3 1 2 2 2 2 2 1 2 2 0 1 2 3 2 3 3 2 2 1 2 2 2 1 2 3 1 2 0 2 2 2 3 2 0 2 2 2 2 0 2 2 2 1 1 3 2 2 2 2 2 0 0 2 2 1 0 1 1 0
split_gain=11.0694 4.74622 5.53749 3.83774 2.63859 2.16292 3.75165 2.11026 2.14726 1.76851 3.30993 1.14766 3.15338 1.4565 1.20151 1.03551 4.71583 0.814047 0.783222 1.22528 2.19729 1.09686 2.45281 1.00039 1.00523 1.31342 0.716331 1.537 0.886234 2.69566 6.97586 0.619524 0.920714 0.593447 0.567366 0.552161 0.499934 4.21172 0.459683 0.321949 0.314669 0.29309 1.38789 0.274452 0.198253 0.19789 0.190599 0.368889 0.250942 0.174282 0.146278 0.188416 0.135036 0.134889 0.174124 0.266782 0.14463 0.13069 0.192595 0.132821 0.124714 0.123088 0.116415 0.295624 0.115216 0.113993 0.110111 0.103226 0.103014 0.0854741 0.0746461 0.0707696 0.044481 0.0344671 0.0583222 0.0303845 0.865423 0.665415 0.0284323 0.0209975 0.0209115 0.0146493 0.00954956 0.00803221 0.0080217 0.00653247 0.00136137 0.00127512 0.00105571 0.000305909 1.97718e-06 1.05324e-06 1.58611e-07
threshold=7.5000000000000009 1.0000000180025095e-35 1.0000000180025095e-35 92.500000000000014 5.5000000000000009 6.5000000000000009 2.5000000000000004 23.500000000000004 21.500000000000004 3.5000000000000004 1.5000000000000002 8.5000000000000018 0 6.5000000000000009 1.5000000000000002 6.5000000000000009 3.5000000000000004 1 65.500000000000014 31.500000000000004 32.500000000000007 41.500000000000007 43.500000000000007 2 26.500000000000004 25.500000000000004 5.5000000000000009 93.500000000000014 3.5000000000000004 153.50000000000003 122.50000000000001 2.5000000000000004 1.5000000000000002 52.500000000000007 3 13.500000000000002 204.50000000000003 243.50000000000003 120.50000000000001 27.500000000000004 4 313.50000000000006 345.50000000000006 5 6 27.500000000000004 1.0000000180025095e-35 22.500000000000004 1.5000000000000002 3.5000000000000004 102.50000000000001 95.500000000000014 7 588.00000000000011 466.50000000000006 490.00000000000006 8 306.50000000000006 85.500000000000014 9 37.500000000000007 10 81.500000000000014 78.500000000000014 649.50000000000011 8.5000000000000018 4.5000000000000009 11 82.500000000000014 4.5000000000000009 125.50000000000001 412.50000000000006 12 81.500000000000014 72.500000000000014 1.5000000000000002 13 14 1.5000000000000002 823.00000000000011 109.50000000000001 6.5000000000000009 196.50000000000003 1.5000000000000002 15 16 4.5000000000000009 5.5000000000000009 17 18 19 20 21
decision_type=2 2 2 2 2 2 2 2 2 2 2 2 1 2 2 2 2 9 2 2 2 2 2 1 2 2 2 2 2 2 2 2 2 2 1 2 2 2 2 2 1 2 2 9 1 2 2 2 2 2 2 2 1 2 2 2 1 2 2 1 2 9 2 2 2 2 2 9 2 2 2 2 9 2 2 2 1 1 2 2 2 2 2 2 9 9 2 2 1 9 1 1 9
left_child=1 2 89 7 9 6 17 8 11 15 69 12 78 14 35 16 31 75 19 23 -21 60 -23 39 25 -25 27 -5 34 30 80 32 -3 -17 36 -13 38 -38 -29 61 66 50 -43 73 62 -26 47 -10 -48 68 51 -28 -16 54 71 -56 79 58 59 -52 -22 -9 63 -45 70 -64 84 -31 -46 -11 -36 -44 -41 74 -20 77 -77 -4 -2 -55 -30 -6 -69 88 -8 86 -42 -68 -19 90 -1 92 -91
right_child=3 4 5 26 81 -7 40 18 46 10 -12 13 -14 -15 52 33 -18 83 43 20 21 22 -24 24 45 -27 41 28 29 67 -32 -33 -34 -35 64 -37 37 -39 -40 72 85 42 53 44 49 -47 48 -49 -50 -51 57 -53 -54 56 55 -57 -58 -59 -60 -61 -62 -63 65 -65 -66 -67 87 82 -70 -71 -72 -73 -74 -75 -76 76 -78 -79 -80 -81 -82 -83 -84 -85 -86 -87 -88 -89 -90 91 -92 -93 -94
leaf_value=-0.024609780525797643 -0.011928762368690671 -0.0073651890002985783 -0.020493398756612689 0.018662941975644106 -0.017978101365463666 0.014821057952537506 -0.017030956453490311 -0.016740868355268824 0.0057648355867290441 0.02492796300625294 -0.018843971263528419 -0.0082778911428358568 0.035156992353584132 0.008213169052619344 -0.015456194395957121 -0.019164795234855689 0.050774161806429956 -0.021331813842876624 0.00019147210753207367 0.019089329501190758 -0.0046958944560392618 0.011955363946911039 -0.0021311461417844574 -0.0089958027433005225 -0.017133194265462309 0.016651657865289951 -0.009118528086005849 0.0048002497689011549 -0.0021274043717688963 0.0036607803292751902 0.037289133024728159 -0.020581853366112547 0.0051270602314329988 -0.0027237827315209993 -0.0012993305989294475 6.062601136001529e-06 0.019485459139557133 0.001782074683923491 -0.00044398872259531391 -0.0017203969822565453 -0.01091861816399483 0.011385696897412012 0.00062342095643198783 -0.0071285541110731503 -0.0046833360488840545 -0.0062713953750593732 0.0026002427761795846 0.015927634762078289 0.011630685010649703 -0.0083480960377347365 -0.00051878155331239553 0.00041456318480072329 -0.0083699309468929246 0.001906013232698229 -0.0049908322209469844 0.00055307284727454246 0.0046684588535870954 -0.0039436709865284629 0.0061188862864021872 0.0015354052684204652 -0.0085741356291900578 -0.0090441551984811758 -0.0042146185490733708 -0.014065971243729851 0.0041452985193760799 -0.01007783968871586 -0.023286733572496558 -0.0019090760710694548 -7.6502849599396688e-05 0.033122907494173771 0.00063283543737034079 0.0034228593761391965 -0.0080778068635372988 0.0002235489975721867 -0.0054165853021196191 -0.019311603158344733 0.01395824645723439 0.0051062626056942433 -0.01933811125930333 0.00017388967565760947 -0.0053205862513205438 -0.021192124054798905 -0.00034648965309986099 -0.01647059319208596 -0.013272987053491196 -0.0080987132128460051 -0.012333133210528259 -0.022620246139164812 -0.018885442683115247 -0.024806940040786766 -0.0245904155378672 -0.024829264540149283 -0.024791355442996568
leaf_weight=30.363741777837276 3.6682278215885145 29.725313542410731 2.8207932040095329 15.47596490383148 4.9784903898835191 10.266883518546818 4.5310220755636692 25.167924977838993 15.008772522211073 6.9319303110241908 5.1280099935829631 25.499648049473763 7.3018741086125374 29.396916955709457 19.272043168544769 11.774852991104128 4.4418339841067782 2.2046820782124987 7.9863859266042736 13.224053263664244 40.88872803747654 36.437147974967957 203.45681384205818 8.4309415519237518 6.0187976509332684 12.237182527780533 9.8180981576442736 63.662123054265976 10.048388153314592 17.5773965716362 20.891669631004333 4.4162812065333119 29.276955613866448 10.280913710594175 66.197178304195404 95.268134616315365 40.579968392848969 195.20579832792282 121.60437962412834 3.3084064126014709 3.376732435077427 35.25368344783783 67.320557236671448 54.04106605052948 35.712738513946533 13.826012134552 17.755387671291832 22.04333558678627 13.574545964598654 22.576252520084381 226.93387266993523 10.979164659976957 10.324448741972448 31.190533638000488 33.695916533470154 60.9560307264328 40.838376522064209 17.948754251003265 14.277316212654112 120.4624208509922 42.044618248939514 6.5454344600439098 30.436020165681839 21.451942503452301 19.436540842056274 11.392841100692747 16.783561773598194 14.837389409542082 18.380020946264267 5.8816361799836159 204.13275998830795 33.966565370559692 16.342277258634571 13.717401832342146 11.051254346966742 2.6002408452332002 7.8725733757019043 25.358180880546573 2.0010924935340881 39.850942850112915 10.468947410583494 12.315935574471951 28.672546863555908 1.6978459674865005 2.06822745501995 1.6204646229743955 3.4275972694158554 12.537071004509928 0.55127106793224845 17.772196166217327 23.292630899697542 6.1262349598109749 1.7977592460811163
leaf_count=1540 65 277 85 18 37 93 119 77 29 30 35 354 51 39 123 38 34 77 27 41 201 90 656 34 13 22 16 157 23 19 26 51 138 20 118 431 49 164 234 24 81 25 57 146 83 66 24 35 28 37 361 26 74 20 18 43 18 16 16 157 157 38 89 34 8 20 58 23 38 19 210 26 98 37 28 79 56 114 8 20 17 38 33 62 64 38 60 54 23 932 1214 321 94
internal_value=0 -0.00958949 -0.0148573 0.000544101 -0.00213643 -0.00688927 -0.00943812 -0.00202892 0.00177155 0.000770695 0.0151037 -0.000929237 0.0134342 -0.00196567 -0.00395568 -0.00208926 0.000969746 0.00106587 -0.00354473 -0.00228585 -0.0008869 -0.00170519 8.43357e-06 -0.00740268 -0.00152799 0.00618955 0.00204278 0.00305361 0.00275659 0.00710309 0.0169517 -0.00251855 -0.00116653 -0.0115011 0.00212985 -0.00174306 0.00330171 0.00482892 0.00135806 -0.0120363 -0.0196486 0.000915982 0.00198848 -0.00592056 -0.00663535 -0.00956571 0.00938362 0.011811 0.00651293 -0.00465807 -2.9175e-06 -0.00408588 -0.0129842 0.000912243 0.000121335 -0.00142055 0.00229739 0.000220764 0.000427432 0.000193524 -0.00666204 -0.0151523 -0.00792749 -0.00909988 0.000427036 -0.00581157 -0.0216884 0.000427037 -0.00311799 0.0286896 0.000159695 0.00156221 -0.00700747 -0.0016872 -0.00306398 0.0033983 0.00569785 0.00254367 -0.014544 0.000934373 -0.00375672 -0.0202669 -0.00087935 -0.0191759 -0.0158532 -0.0109517 -0.0116312 -0.0230018 -0.0208425 -0.0246693 -0.0246014 -0.0248112 -0.0248055
internal_weight=0 302.222 177.07 2488.07 125.152 97.7171 87.4503 915.789 261.114 107.858 17.9416 192.732 12.9712 179.761 150.364 89.9162 67.8604 43.1056 654.674 427.928 336.051 322.827 239.894 91.877 40.5129 20.6681 1572.28 828.791 813.315 102.496 41.409 63.4186 59.0023 22.0558 710.819 120.768 421.052 235.786 185.267 51.364 44.3447 743.492 343.073 226.746 193.991 19.8448 68.382 37.0521 31.3299 76.669 400.42 20.7973 29.5965 307.819 195.939 94.6519 111.88 379.622 361.674 347.396 82.9333 31.7134 117.322 75.493 289.766 41.8289 35.9199 61.0873 54.0928 12.8136 270.33 101.287 19.6507 32.755 19.0376 38.6518 10.4728 28.179 5.66932 71.0415 20.5173 17.2944 43.5099 4.4538 6.59925 8.42479 6.80433 29.3206 2.75595 79.3526 53.6564 25.6962 19.57
internal_count=11116 5881 5164 5235 717 1063 970 3317 1261 642 84 1145 124 1021 982 558 500 496 2056 1517 1145 1104 746 372 135 56 1918 1099 1081 141 66 466 415 58 940 785 604 213 391 237 474 819 227 539 447 79 116 64 52 158 592 42 197 202 144 61 58 550 534 518 358 115 289 180 336 109 295 75 121 49 328 83 122 92 55 334 135 199 73 40 40 75 56 162 183 179 141 112 100 4101 2754 1347 1026
cat_boundaries=0 1 2 3 4 5 6 7 8 9 10 11 12 13 14 15 16 17 18 19 20 21 22
cat_threshold=1 2 1 1 1 1 1 1 1 1 2 1 1 1 2 2 2 1 2 1 1 1
is_linear=0
shrinkage=0.05


Tree=105
num_leaves=99
num_cat=22
split_feature=2 3 2 2 2 2 2 2 2 2 3 2 3 2 3 3 2 1 3 2 3 3 0 2 2 2 2 1 2 2 2 3 2 3 2 2 2 0 3 1 2 2 3 0 2 1 2 0 2 2 2 1 2 2 1 1 3 3 3 2 2 2 2 3 2 2 0 3 2 2 2 2 3 2 2 2 2 2 2 2 1 2 1 2 2 2 2 0 3 0 2 2 1 0 1 1 0 0
split_gain=10.6353 4.63554 5.51836 3.64823 2.5644 2.06018 3.67019 2.01397 2.02107 1.65723 3.07021 1.11359 2.7976 1.94223 2.10546 1.64848 1.54809 2.89748 1.06822 1.36531 0.997133 4.26413 0.785852 0.753523 1.17803 2.05455 1.06415 0.971529 0.960503 1.23169 0.796096 0.67665 1.42555 0.83138 2.49784 6.30132 0.614275 0.665661 0.584719 0.536183 0.507318 0.797059 0.335262 0.318152 0.317639 0.315482 0.281552 0.264794 0.224976 0.339051 0.207627 1.46468 0.205032 0.194584 0.192245 0.168952 0.168469 0.161362 1.66751 0.167746 0.113301 0.289897 0.111313 0.110638 0.109037 0.0987481 0.0978425 0.0901932 0.0743523 0.0710225 0.0596355 0.0532069 0.0623038 0.0484813 0.0963748 0.0397703 0.0912487 0.0329297 0.0559308 0.0285125 0.82295 0.0201136 0.0173826 0.0147929 0.013817 0.00911026 0.00808698 0.00799293 0.00762986 0.00640825 0.00134117 0.00129989 0.00106779 0.000313466 2.02621e-06 1.0798e-06 1.62534e-07 2.88658e-15
threshold=7.5000000000000009 1.0000000180025095e-35 1.0000000180025095e-35 92.500000000000014 5.5000000000000009 6.5000000000000009 2.5000000000000004 23.500000000000004 21.500000000000004 3.5000000000000004 1.5000000000000002 16.500000000000004 17.500000000000004 14.500000000000002 6.5000000000000009 1.5000000000000002 8.5000000000000018 0 1.0000000180025095e-35 19.500000000000004 6.5000000000000009 3.5000000000000004 1 65.500000000000014 31.500000000000004 32.500000000000007 64.500000000000014 2 26.500000000000004 25.500000000000004 41.500000000000007 5.5000000000000009 93.500000000000014 3.5000000000000004 153.50000000000003 122.50000000000001 1.0000000180025095e-35 3 47.500000000000007 4 119.50000000000001 243.50000000000003 1.0000000180025095e-35 5 27.500000000000004 6 129.50000000000003 7 95.500000000000014 119.50000000000001 22.500000000000004 8 123.50000000000001 27.500000000000004 9 10 3.5000000000000004 35.500000000000007 34.500000000000007 709.50000000000011 81.500000000000014 78.500000000000014 4.5000000000000009 8.5000000000000018 649.50000000000011 82.500000000000014 11 58.500000000000007 4.5000000000000009 125.50000000000001 203.50000000000003 109.50000000000001 12.500000000000002 628.50000000000011 469.50000000000006 238.50000000000003 374.50000000000006 81.500000000000014 72.500000000000014 1.5000000000000002 12 109.50000000000001 13 6.5000000000000009 98.500000000000014 196.50000000000003 1.5000000000000002 14 1.0000000180025095e-35 15 4.5000000000000009 5.5000000000000009 16 17 18 19 20 21
decision_type=2 2 2 2 2 2 2 2 2 2 2 2 2 2 2 2 2 1 2 2 2 2 9 2 2 2 2 1 2 2 2 2 2 2 2 2 2 9 2 1 2 2 2 9 2 1 2 9 2 2 2 1 2 2 1 1 2 2 2 2 2 2 2 2 2 2 9 2 2 2 2 2 2 2 2 2 2 2 2 2 1 2 1 2 2 2 2 9 2 9 2 2 1 9 1 1 9 9
left_child=1 2 93 7 9 6 22 8 11 20 68 13 18 16 15 -15 17 -2 19 -13 21 36 79 24 27 -26 30 43 29 -29 -27 32 -5 39 35 81 37 -3 -22 40 84 -42 -18 88 -45 62 48 77 -33 71 51 -10 -51 -30 60 -20 65 58 59 70 61 -49 87 -62 69 -56 -36 75 -11 -41 -48 72 -50 74 -69 -59 -77 78 -25 -4 -81 -35 -38 -6 -34 -68 92 -8 -9 90 -47 -64 -24 94 -1 96 -95 -97
right_child=3 4 5 31 83 -7 45 23 50 10 -12 12 -14 14 -16 -17 42 -19 55 -21 38 -23 86 47 25 26 -28 28 53 -31 -32 46 33 34 66 -37 82 -39 -40 64 41 -43 -44 44 -46 89 57 54 49 52 -52 -53 -54 -55 56 -57 -58 67 -60 -61 63 -63 91 -65 -66 -67 85 73 -70 -71 -72 -73 -74 -75 -76 76 -78 -79 -80 80 -82 -83 -84 -85 -86 -87 -88 -89 -90 -91 -92 -93 -94 95 -96 97 -98 -99
leaf_value=-0.024604313556137888 -0.014393414107572647 0.00069096274004802312 0.0024733285373115883 0.017858774903309706 -0.017853816477477361 0.014237731056827138 -0.01689700620366821 -0.0040889994330146704 0.021360611602708548 0.023702950713263983 -0.018730114918925424 -0.012676629386146396 0.019765672534969039 0.011197470263808115 0.036180016830519711 -0.017028116880239547 -0.0032980043496941523 0.033084696110805306 -0.017945174296857543 0.0067863501529371335 -0.01944770307292007 0.047031286738230184 -0.021256405480198491 0.00018668174090031491 0.018258904627426499 -0.0065406411882877498 0.010577013545392025 -0.0088527251233369922 -0.017000199005837397 0.015966651342667153 -0.00078910324806058378 -0.0089746142500594494 -0.0027718027174978704 -0.0020790568543615972 0.0035566752194157916 0.035015449065638742 -0.019806893508153452 -0.019396946738198764 -0.0030709450792662501 -0.0012687375611637303 0.0064295725389544494 0.0017346937161505809 -0.011153017031689798 -0.016774117997795435 -0.0079419439716702095 -0.010765900604801149 0.0016707201008585191 -0.0070019227908295293 -0.001186230210408987 -0.0092458323544626058 0.0060292280867049698 0.0017268871525408455 -0.00099798596205699164 -0.0061546459645989288 -0.0045887647075411762 -0.010343355090171952 -0.008209933806882409 0.00089153293173012751 0.015165014194225744 0.0045368235513807142 -0.004127552383701427 -0.013913505427121121 -0.023250390805594247 -0.0099284251745087419 0.0040254389479367136 -7.4609228286640246e-05 -0.0018652778715659499 0.0014747908140043851 0.031234809302610956 0.00061672724342834114 0.00028453702780847982 0.0042551398890808027 0.0035420643305257606 0.0022609851737136317 -0.0015543634365981079 -0.0035075883510055335 5.5102006054507985e-05 0.00021794900548874319 -0.0053111495753932992 -0.019204013071533358 0.013420601936486415 -0.0052165118386935175 -0.014182209204378496 -0.021114221795592122 -0.0007497421132897868 -0.00033800516076074722 -0.016331781385384256 -0.013118577788605621 -0.00077240706134318673 -0.0079626669691114354 -0.012178061896978988 -0.022569709423800197 -0.018772123521219736 -0.024806376635477786 -0.024584467358078742 -0.024829263013722468 -0.024790403730828709 -0.024829265765636599
leaf_weight=29.625614695250988 5.5874972902238351 52.84619814530015 28.251571983098984 15.767503857612608 4.8897863849997529 10.42018239200115 4.4545078352093697 2.9313865527510643 18.994143918156624 7.1069007515907305 5.0322827771306029 18.172124795615673 9.6382691860198957 27.41894905269146 6.9004165530204764 6.3758108243346205 38.989152144640684 7.5631519332528114 22.332238160073757 17.87266731262207 11.019385896623136 4.6731880977749816 2.1581502743065348 7.9879153966903713 13.478916078805922 82.382832258939743 16.822071522474289 8.3554387167096138 5.9165550321340588 12.442657992243767 223.07698972523212 9.7289784550666791 10.22827363014221 10.027034044265749 17.641861319541931 21.685408890247345 3.7858913652598849 4.4731221236288539 10.784901797771452 66.111221313476562 168.12578451633453 195.55397993326187 20.847469199448824 27.362277969717979 16.210798799991608 3.3400638252496702 118.47943532466888 53.657201811671257 18.203307718038563 14.605523228645326 31.031799897551537 19.001812741160393 15.564858525991438 13.739574983716009 35.545874804258347 10.865260645747183 22.38856828212738 22.429493367671967 22.28115439414978 32.207621574401855 30.308013379573822 21.152312457561493 16.397243462502956 11.278602629899977 19.517278432846069 18.378615319728851 14.809090971946715 74.754407167434692 6.0797153003513813 204.26198256015778 224.81870365142822 15.32694426178932 11.286838859319685 51.110224843025208 40.475031733512878 32.151842594146729 40.753318905830383 13.720468699932097 10.991556122899054 2.5505077317357046 7.9832309484481812 10.413394600152968 2.1557327155023813 12.057681255042553 48.543236285448074 28.662613689899445 1.6701104138046501 2.04095734655857 4.2456576004624367 1.6073939539492128 3.3855840116739273 12.256662033498289 0.54095777869224582 17.336746826767921 22.726840972900391 4.8606642577797174 1.7537382841110254 1.115333810448649
leaf_count=1540 73 201 199 18 37 93 119 21 33 30 35 106 2 120 5 27 370 51 85 80 36 34 77 27 41 358 23 34 13 22 723 16 28 23 19 26 63 151 22 118 286 164 171 83 98 81 199 146 42 18 56 27 31 66 83 55 37 31 13 16 89 34 58 20 8 38 23 72 19 210 216 33 26 25 26 28 27 37 28 79 56 17 51 38 126 33 62 64 35 38 60 54 23 932 1214 261 94 60
internal_value=0 -0.00944487 -0.014709 0.000529634 -0.00209149 -0.00676727 -0.00929363 -0.00198343 0.00172311 0.000747078 0.0144958 -0.000908215 -0.00547287 0.00225905 0.0110114 0.00587235 -0.00262097 0.012912 -0.00898599 -0.00302599 -0.00204422 0.000941737 0.0010365 -0.00346969 -0.00223499 -0.000866181 -0.00166606 -0.00727416 -0.00149417 0.0059957 -0.0023403 0.00198747 0.00296783 0.00267994 0.00687326 0.0162408 -0.00246297 -0.000876671 -0.0113474 0.00207221 0.00320855 0.00390509 -0.00603474 -0.0118815 -0.0134882 -0.0195459 0.000892268 -0.00580842 -0.00182118 -0.000893083 0.00906358 0.0115418 -0.00499078 -0.00941919 -0.00651435 -0.0154572 -0.00456398 0.00124085 0.0018752 0.00108663 -0.00779307 -0.00895617 -0.0216196 -0.00570079 0.000416232 -0.00305024 0.000416195 0.000276529 0.0271755 0.000155696 0.000762938 0.00186544 0.000623442 0.000979283 0.000410782 -0.000949636 -0.00151608 -0.00164821 -0.00299727 0.00330113 0.00552129 -0.00367744 -0.0177662 -0.0201735 -0.00110165 -0.000858287 -0.0190664 -0.0157098 -0.00212703 -0.0107989 -0.0114768 -0.0229592 -0.0207585 -0.0246653 -0.0245957 -0.0248107 -0.0248049 -0.0248293
internal_weight=0 299.381 174.476 2489.49 124.905 97.0571 86.6369 913.965 261.591 107.957 18.2189 192.563 78.8806 113.682 40.6952 33.7948 72.9873 13.1506 69.2423 36.0448 89.7384 67.9341 43.1545 652.374 426.965 335.761 322.282 91.2043 40.4542 20.7981 305.46 1575.53 831.349 815.581 103.239 42.1258 63.2609 57.3193 21.8043 712.342 422.451 363.68 59.8366 50.7501 43.5731 43.4824 744.178 225.409 84.7165 74.9875 69.0278 37.996 30.1704 19.6561 192.709 33.1975 76.3131 659.461 397.787 375.506 116.396 74.8095 35.1494 41.5866 289.89 53.9245 61.1136 261.674 13.1866 270.373 343.298 44.8171 29.4901 166.34 115.229 95.3347 72.9052 32.6999 18.9795 38.7853 10.5337 20.4404 5.94162 16.9475 58.7715 43.4717 4.36922 6.49547 7.17704 8.33304 6.72565 28.6539 2.69911 77.4189 52.3525 25.0665 19.0905 5.976
internal_count=11116 5881 5164 5235 717 1063 970 3317 1261 642 84 1145 328 817 152 147 665 124 326 186 558 500 496 2056 1517 1145 1104 372 135 56 1081 1918 1099 1081 141 66 466 352 58 940 604 450 541 237 181 474 819 539 166 150 116 60 49 79 447 140 158 653 444 431 289 180 295 109 336 121 75 209 49 328 415 101 68 123 98 86 55 92 55 334 135 40 114 75 154 56 162 183 56 179 141 112 100 4101 2754 1347 1026 321
cat_boundaries=0 1 2 3 4 5 6 7 8 9 10 11 12 13 14 15 16 17 18 19 20 21 22
cat_threshold=1 2 1 2 1 1 1 1 1 1 1 1 1 1 2 2 1 2 1 1 1 1
is_linear=0
shrinkage=0.05


Tree=106
num_leaves=97
num_cat=20
split_feature=2 3 2 2 2 2 2 2 2 2 3 2 1 0 2 2 3 2 2 2 3 2 3 3 0 3 2 3 2 2 3 3 3 1 2 2 2 2 3 3 2 2 2 1 2 2 0 2 1 3 3 3 2 2 2 2 2 1 2 2 2 2 2 2 3 2 1 2 3 2 2 0 2 1 2 1 2 2 2 2 2 2 0 0 2 2 2 2 2 2 1 0 1 1 0 0
split_gain=10.2163 4.526 5.49788 3.46882 2.49208 1.96293 3.58986 1.93128 2.20832 1.55394 2.85365 1.01535 2.07409 2.51337 6.00629 1.9034 1.39718 2.78481 2.13896 1.06314 2.64612 1.82661 0.96006 3.8704 0.758687 0.639403 1.32347 0.780232 2.31991 5.238 0.601335 0.875164 0.575471 0.50691 0.480854 3.81439 0.467371 0.465114 0.323694 2.47467 4.79045 0.432278 0.37519 0.316193 0.270283 1.28785 0.221442 0.192032 1.34453 0.134242 0.131371 0.175013 0.124124 0.213071 0.119824 0.165879 0.261027 0.138106 0.1125 0.105463 0.103236 0.234739 0.100103 0.0986978 0.0979362 0.088356 0.0841986 0.081513 0.0787016 0.0665345 0.0649888 0.0575615 0.0464138 0.0346325 0.0267524 0.78304 0.02307 0.0215101 0.0209381 0.0193416 0.0149334 0.00813941 0.00796079 0.00628358 0.00500067 0.00780344 0.00440041 0.00302027 0.00132499 0.00132065 0.00107972 0.000321217 2.07499e-06 1.10696e-06 1.66651e-07 1.55431e-15
threshold=7.5000000000000009 1.0000000180025095e-35 1.0000000180025095e-35 92.500000000000014 5.5000000000000009 6.5000000000000009 2.5000000000000004 47.500000000000007 46.500000000000007 3.5000000000000004 1.5000000000000002 23.500000000000004 0 1 42.500000000000007 21.500000000000004 1.0000000180025095e-35 31.500000000000004 26.500000000000004 16.500000000000004 17.500000000000004 14.500000000000002 6.5000000000000009 3.5000000000000004 2 5.5000000000000009 93.500000000000014 3.5000000000000004 160.50000000000003 122.50000000000001 2.5000000000000004 1.5000000000000002 47.500000000000007 3 204.50000000000003 243.50000000000003 27.500000000000004 120.50000000000001 2.5000000000000004 3.5000000000000004 65.500000000000014 81.500000000000014 78.500000000000014 4 313.50000000000006 345.50000000000006 5 22.500000000000004 6 101.50000000000001 29.500000000000004 12.500000000000002 78.500000000000014 74.500000000000014 588.00000000000011 466.50000000000006 490.00000000000006 7 4.5000000000000009 100.50000000000001 248.50000000000003 232.50000000000003 229.50000000000003 81.500000000000014 22.500000000000004 238.50000000000003 8 67.500000000000014 36.500000000000007 412.50000000000006 4.5000000000000009 9 345.50000000000006 10 1.5000000000000002 11 64.500000000000014 57.500000000000007 823.00000000000011 109.50000000000001 6.5000000000000009 1.5000000000000002 12 13 88.500000000000014 84.500000000000014 272.50000000000006 86.500000000000014 5.5000000000000009 4.5000000000000009 14 15 16 17 18 19
decision_type=2 2 2 2 2 2 2 2 2 2 2 2 1 9 2 2 2 2 2 2 2 2 2 2 9 2 2 2 2 2 2 2 2 1 2 2 2 2 2 2 2 2 2 1 2 2 9 2 1 2 2 2 2 2 2 2 2 1 2 2 2 2 2 2 2 2 1 2 2 2 2 9 2 1 2 1 2 2 2 2 2 2 9 9 2 2 2 2 2 2 1 9 1 1 9 9
left_child=1 2 91 7 9 6 24 8 11 22 70 15 13 36 -15 19 18 -18 -14 21 -21 -2 23 30 74 26 -5 33 29 79 31 -3 -24 34 37 -36 -13 -28 41 40 -40 46 64 58 49 -46 76 48 -17 50 51 59 53 -48 55 69 -57 78 82 -27 61 -35 -53 -44 67 68 -65 -41 -52 -47 -11 -30 -62 84 -4 -76 77 -9 -56 -29 -6 90 -8 89 85 -43 -73 -75 -60 -45 -26 92 -1 94 -93 -95
right_child=3 4 5 25 80 -7 43 38 -10 10 -12 12 16 14 -16 47 17 -19 -20 20 -22 -23 32 -25 81 44 27 28 71 -31 -32 -33 -34 60 35 -37 -38 -39 39 42 -42 73 63 83 45 54 52 -49 -50 -51 65 62 -54 -55 57 56 -58 -59 88 -61 72 -63 -64 66 -66 -67 -68 -69 -70 -71 -72 86 -74 87 75 -77 -78 -79 -80 -81 -82 -83 -84 -85 -86 -87 -88 -89 -90 -91 -92 93 -94 95 -96 -97
leaf_value=-0.024598709504836346 -0.0025645216434651858 -0.0071849795828066764 0.0024058825685311404 0.017103186209625629 -0.017728159686023714 0.013685447924193418 -0.01676183598403631 -0.00265864982399471 0.019890767854999679 0.022566122116155368 -0.018614800515815193 -0.016465192031501433 0.014898160626101626 -0.0060418027720171895 0.047716311164845822 0.020384429243599195 -0.010010433630407116 0.015570766115148779 -0.0076613747471717874 -0.0088437302900311859 0.018892878125619576 0.010614852856832443 -0.019342019537704071 0.043729837496583386 -0.021179647001404331 -0.0057230822265090181 0.0046727379461455948 -0.0020317087581257689 0.0026224261599200951 0.03063532801160403 -0.020464224388645182 0.0050139154640164068 -0.0030040236420681311 0.00019048993336511706 0.018351794466526721 0.0016886531017521621 -0.0086108250092470067 -0.00058951289474953091 0.040675601918742324 -0.0050917753575710108 -0.0060940856354298675 -0.0032093715296004771 -0.012938313714428842 -0.010613677366382947 0.010879918428175801 0.00060233298324134264 -0.0074907525562958287 0.0058437343053770871 0.0016810671435747847 0.0047652764175929417 -0.0030880384227071258 0.0024793218820049843 -0.011084266284131929 -0.00087491471917483304 0.0017944820517752003 -0.0049357757770500769 0.00055290409901739195 0.0044643051925376655 -0.023213250905655031 -0.00046957477956727223 0.0033022777736227693 -0.0065873489253514108 -0.00055659755371239032 -0.005513036030043667 0.0019599205939010746 -0.0034850817188845011 -0.010259707669577525 -0.00086651122473962474 0.0005423058240237225 0.0033128217622624074 0.029510722031661052 -0.0012882759359795725 0.00098816765660915038 -0.00050848533910199164 -0.019094941339240459 0.012910694074255559 -0.0041783988962914706 0.0012461027149720718 6.8439735227699021e-05 -0.0051139344225414295 -0.021034948136561912 -0.016191862286266977 -0.012963938171521187 -0.0078278278621199179 -0.0036137243116449698 -0.0010419111832573906 -0.00025324941677099878 0.00068298048835937456 -0.022518130352557602 -0.012023053102024147 -0.018657345212070433 -0.024805804153597538 -0.024578377352210218 -0.024829266737201653 -0.024789428446742 -0.024829264669884568
leaf_weight=28.905593417584896 72.802238307893276 29.421712771058083 28.32153383269906 16.051621526479721 4.8032598011195669 10.569603789597748 4.3798723500221968 8.5934022665023821 13.616375476121901 7.2773675471544284 4.9389047734439364 24.338400729000568 13.375511258840559 23.190999142825607 6.6961133629083625 19.404234796762466 14.890656083822249 37.25898440182209 48.994496241211891 68.62609987705946 9.830671548843382 41.150504171848297 10.807154621928932 4.8982245735824099 2.1127598360180846 10.329445242881773 63.937280654907227 10.006208807229998 16.45482063293457 24.75308483839035 4.2972719725221387 29.387951636686921 10.751833111047743 166.70017796754837 41.645344614982605 195.89349985122681 85.389043465256691 122.33443540334702 9.0171944200992602 41.933132752776146 13.937743991613386 8.5375809967517906 11.978111296892164 3.3042980246245843 35.753009974956512 67.37637984752655 139.16710585355759 31.219461970031261 19.034654885530472 14.174264073371885 21.474609017372131 100.38178735971451 20.187617063522339 13.336349070072172 31.321195960044861 33.602660775184631 60.956436038017273 41.122988820075989 16.020399242639542 127.10027888417244 29.755442142486572 13.834651947021483 37.219831466674805 20.042559862136841 8.0068882554769498 40.937049984931946 17.499942660331726 15.683847606182097 48.977442890405655 34.099376797676086 6.2726110890507698 24.925191342830658 79.721122145652771 11.267015993595125 2.5019950717687589 8.0910930633544904 9.95765472948551 5.9820975363254538 40.01972508430481 10.359214276075361 11.805761341005564 1.6430561132729051 2.0143577046692362 1.5946456454694269 9.0893658995628339 8.085261255502699 17.464227616786957 10.075168073177336 11.983132041990759 3.3446041792631149 0.53089755028486285 16.911973796784878 22.174923822283745 4.7414631005376577 1.7107969187200094 1.087981872260573
leaf_count=1540 665 277 199 18 37 93 119 34 35 30 35 77 29 134 15 33 56 105 171 326 2 152 36 34 77 22 157 23 17 30 51 138 22 251 49 164 381 234 24 135 35 28 18 81 25 57 411 56 27 13 30 167 36 40 20 18 43 18 58 210 28 10 41 46 22 39 24 49 70 26 19 37 47 24 79 56 29 24 20 17 38 62 64 38 27 25 17 22 54 60 23 932 1214 261 94 60
internal_value=0 -0.00930099 -0.0145601 0.000515504 -0.00204722 -0.00664646 -0.00914988 -0.00193914 1.53448e-05 0.000724423 0.0139216 -0.000508929 -0.0027608 -0.00685178 0.00600253 0.00167477 0.00222664 0.00826639 -0.00282339 -0.000889132 -0.00536832 0.0021948 -0.00199989 0.000914821 0.00100848 0.00193385 0.0028849 0.00260582 0.00665268 0.0151825 -0.00240839 -0.00108903 -0.011194 0.00201642 0.00311863 0.00461004 -0.010353 0.00121674 -0.00464724 -0.00271243 0.0122781 -0.00574106 -0.0057009 -0.0194417 0.000869173 0.00189662 -0.00676843 0.00875675 0.0111227 -1.3768e-05 -0.000189068 0.000397638 -0.00739992 -0.0069122 0.000855517 0.000109144 -0.00139756 0.00215651 -0.0215494 -0.000864437 0.000405707 -0.000328906 0.00165814 -0.00898648 -0.00322156 -0.00163771 -0.00772563 -0.00394162 -0.000564266 0.00151315 0.0257809 0.00011247 0.00161714 -0.00143491 0.00320765 0.00535124 -0.00232337 -0.00105606 0.000826234 -0.00359953 -0.0200786 -0.0189555 -0.0155654 -0.0106466 -0.00267075 -0.00215513 -0.00086185 5.3979e-05 -0.0229158 -0.0113226 -0.0206731 -0.0246612 -0.0245899 -0.0248103 -0.0248043 -0.0248293
internal_weight=0 296.607 171.945 2490.88 124.662 96.4122 85.8426 912.196 529.818 108.053 18.4889 516.202 254.134 139.615 29.8871 262.068 114.52 52.1496 62.37 192.41 78.4568 113.953 89.5641 68.0052 43.2013 1578.68 833.836 817.785 103.963 45.1185 63.1069 58.8097 21.559 713.822 423.811 237.539 109.727 186.272 382.378 138.099 22.9549 244.279 115.144 42.6413 744.846 344.252 197.224 69.6584 38.4389 400.595 386.42 275.031 172.691 152.503 308.499 196.035 94.5591 112.464 34.3978 137.43 290.011 180.535 137.602 49.5206 65.6239 111.389 37.5425 57.617 70.4521 101.476 13.55 58.8442 109.477 47.0544 38.9146 10.5931 24.5332 14.5755 71.3409 20.3654 16.609 4.28671 6.39423 8.24355 25.7122 16.6228 42.3894 21.3422 28.0035 6.6489 2.64366 75.5327 51.0805 24.4522 18.6228 5.82944
internal_count=11116 5881 5164 5235 717 1063 970 3317 2264 642 84 2229 968 607 149 1261 361 161 200 1145 328 817 558 500 496 1918 1099 1081 141 70 466 415 58 940 604 213 458 391 1053 353 59 700 294 474 819 227 574 116 60 592 579 440 487 451 202 144 61 58 295 232 336 261 208 88 206 139 70 184 100 83 49 71 75 126 334 135 87 58 40 40 75 162 183 179 80 53 54 46 112 141 100 4101 2754 1347 1026 321
cat_boundaries=0 1 2 3 4 5 6 7 8 9 10 11 12 13 14 15 16 17 18 19 20
cat_threshold=1 2 2 1 1 1 1 1 1 1 1 1 2 2 1 2 1 1 1 1
is_linear=0
shrinkage=0.05


Tree=107
num_leaves=97
num_cat=23
split_feature=2 3 2 2 2 2 2 2 2 3 3 2 2 1 0 2 2 3 2 2 2 1 3 0 3 2 3 2 2 2 0 3 1 2 2 2 1 3 3 2 2 2 2 0 2 2 2 2 1 3 3 2 2 2 2 2 2 3 0 3 1 0 2 2 2 3 3 2 2 2 2 1 2 1 2 2 2 1 2 2 2 2 0 0 2 2 3 2 2 2 1 0 1 1 0 0
split_gain=9.8122 4.41761 5.47599 3.29871 2.42154 1.87082 3.51052 1.84808 2.05901 1.47713 2.93651 1.49863 0.967534 1.98722 2.41556 5.44018 1.79253 1.31811 2.61174 2.02488 1.02276 2.6758 1.25889 0.73247 0.604233 1.22988 0.732678 2.17167 5.21968 0.592749 0.645032 0.54327 0.479218 0.487238 0.722337 0.460702 0.316802 0.311638 2.34192 4.34307 0.416939 0.363339 0.261953 0.214132 0.213558 0.324973 0.197143 0.177782 1.23606 0.152432 1.55657 0.15773 0.121117 0.205783 0.11367 0.102245 0.0967209 0.0936256 0.0873861 0.0825475 0.082001 0.0801087 0.0671339 0.0571909 0.0494419 0.0563792 0.0436991 0.05268 0.0405224 0.0376257 0.0843211 0.0330702 0.0251107 0.745494 0.0221073 0.0205065 0.0185949 0.017412 0.0150707 0.0131398 0.00915648 0.00818941 0.00792532 0.00615858 0.00479631 0.00746921 0.00369119 0.00287148 0.00135038 0.00129984 0.00109147 0.000329148 2.12601e-06 1.13464e-06 1.70815e-07 1.55431e-15
threshold=7.5000000000000009 1.0000000180025095e-35 1.0000000180025095e-35 92.500000000000014 5.5000000000000009 6.5000000000000009 2.5000000000000004 47.500000000000007 46.500000000000007 6.5000000000000009 3.5000000000000004 3.5000000000000004 23.500000000000004 0 1 42.500000000000007 21.500000000000004 1.0000000180025095e-35 31.500000000000004 26.500000000000004 8.5000000000000018 2 6.5000000000000009 3 5.5000000000000009 93.500000000000014 3.5000000000000004 153.50000000000003 122.50000000000001 1.0000000180025095e-35 4 52.500000000000007 5 119.50000000000001 243.50000000000003 27.500000000000004 6 2.5000000000000004 3.5000000000000004 65.500000000000014 81.500000000000014 78.500000000000014 129.50000000000003 7 95.500000000000014 119.50000000000001 123.50000000000001 22.500000000000004 8 35.500000000000007 34.500000000000007 709.50000000000011 78.500000000000014 74.500000000000014 4.5000000000000009 649.50000000000011 81.500000000000014 22.500000000000004 9 58.500000000000007 10 11 125.50000000000001 203.50000000000003 109.50000000000001 12.500000000000002 196.50000000000003 306.50000000000006 4.5000000000000009 238.50000000000003 374.50000000000006 12 1.5000000000000002 13 64.500000000000014 57.500000000000007 109.50000000000001 14 6.5000000000000009 98.500000000000014 196.50000000000003 1.5000000000000002 15 16 88.500000000000014 84.500000000000014 15.500000000000002 86.500000000000014 5.5000000000000009 4.5000000000000009 17 18 19 20 21 22
decision_type=2 2 2 2 2 2 2 2 2 2 2 2 2 1 9 2 2 2 2 2 2 1 2 9 2 2 2 2 2 2 9 2 1 2 2 2 1 2 2 2 2 2 2 9 2 2 2 2 1 2 2 2 2 2 2 2 2 2 9 2 1 9 2 2 2 2 2 2 2 2 2 1 2 1 2 2 2 1 2 2 2 2 9 9 2 2 2 2 2 2 1 9 1 1 9 9
left_child=1 2 91 7 9 6 23 8 12 10 11 29 16 14 35 -16 20 19 -19 -15 21 -2 -22 72 25 -5 32 28 76 30 -3 86 33 79 -35 -14 54 40 39 -39 43 57 44 74 -26 64 -47 48 -18 50 51 63 53 -45 82 62 -43 61 -29 69 -58 -40 -34 -44 65 -46 67 -61 -13 -51 -71 84 -4 -74 75 -9 -28 -31 -6 -27 -60 90 -8 89 85 -42 -11 -73 -56 -38 -25 92 -1 94 -93 -95
right_child=3 4 5 24 78 -7 36 37 -10 31 -12 68 13 17 15 -17 47 18 -20 -21 22 -23 -24 81 42 26 27 58 -30 77 -32 -33 55 34 -36 -37 83 38 41 -41 71 56 49 52 45 46 -48 -49 -50 59 -52 -53 -54 -55 88 -57 60 -59 80 66 -62 -63 -64 -65 -66 -67 -68 -69 -70 70 -72 87 73 -75 -76 -77 -78 -79 -80 -81 -82 -83 -84 -85 -86 -87 -88 -89 -90 -91 -92 93 -94 95 -96 -97
leaf_value=-0.024592969733255424 -0.014214934415618954 0.00071832896922863427 0.0023404375322117715 0.016392104912316952 -0.017601148208884733 0.01316194704703281 -0.016625471393466772 -0.0025996274666980016 0.019010037277847509 -0.017274902482876841 0.040050953257290606 0.011709850100364044 -0.016326336110986939 0.014310684778240428 -0.0059279490555219803 0.044335993339258778 0.019472104539679611 -0.0098613458661106212 0.014946579953208453 -0.0075293399414638439 -0.0037474521110012304 0.031343853496410015 0.0074679004788653566 -0.021101524127074486 -0.0087885972179011732 -0.0028136926657716201 -0.001985343636047911 0.0033253498839006211 0.03121278595524565 -0.019666046677532915 -0.01926946112339141 -0.0025284238549894643 -0.0012433197776651975 0.0060969627335029867 0.0016439114896199343 -0.0084705678878201265 -0.010461994433259283 0.038064610860930916 -0.0047780674691558066 -0.0059795632196945545 -0.0031398738237916851 -0.012783465500981249 0.0016047297764458257 -0.0073603863417678345 -0.0011084599010455828 -0.0091006420724805831 -0.00099322391754860231 0.0056650124944741444 0.0016365401768260023 0.00085985080533673502 0.014530038472969093 0.0043665054491766817 -0.010931065641328451 -0.00085394738116944537 -0.023175299848559518 0.0038811351022086877 -0.0054062509494343103 0.0019074671925160564 -0.0018454542079040081 0.0022128967511584391 -0.010109458948075446 -6.1551190207933762e-05 0.00059031686263684511 0.00024869772690841392 0.0041158154211585951 0.0033845294437912449 0.0026962979033133458 -2.4566353824021739e-05 0.016433044852542936 -0.003402936831334552 2.5647448743842575e-05 -0.00049611552167145103 -0.018984392864782516 0.012426578333650136 -0.0040919308334990958 0.0012136303173514015 -0.0050128532354912596 -0.013973103801622842 -0.020954289597021621 -0.00084402090878601022 -0.00031361698569087209 -0.016050868867325849 -0.012809115965042315 -0.0076942215076236057 -0.003536918496551536 -0.0010171139847716334 -0.019097277889980786 0.00066556192318024824 -0.022465497606255515 -0.011868153706544806 -0.018541112163579669 -0.024805214709380831 -0.0245721345334537 -0.024829265582911902 -0.024788428912869146 -0.024829263492383
leaf_weight=28.20322472602129 5.4935437850654107 52.789592687040567 28.389753997325897 16.328516751527786 4.7188570350408563 10.715247903019188 4.3070695009082556 8.570585712790491 13.889927312731741 4.6469936110079306 5.2023936696350566 9.6953787729144096 23.940945282578468 13.576273664832113 23.051305942237381 7.0233728885650626 19.803838193416595 14.742337659001349 37.843675404787064 48.620565533638 148.87909922748804 7.7975392639636993 30.075261019170284 2.0684829391539088 9.6161554455757123 10.247735470533369 9.9858998060226458 17.786811351776123 23.156844735145569 3.6826163977384558 4.3705533202737561 10.190851360559462 66.039975613355637 169.93396720290184 196.22457557916641 84.65693025290966 3.2694127000868303 9.3915359824895877 46.209245547652245 13.853064537048338 8.5102245211601311 11.824133008718489 118.77520990371704 138.12853528559208 18.143626987934116 14.470700144767763 15.561748862266539 31.402434512972832 19.066680401563644 22.457155525684357 22.640611588954926 32.395509719848633 19.965088158845901 13.324686437845228 15.652796469628811 19.615375995635986 19.932368695735931 8.0225964188575727 14.796318233013151 35.349417269229889 17.32131627202034 11.181178972125052 204.47420710325241 225.13999676704407 15.400719076395033 11.349860072135924 28.556757271289825 102.84421491622925 8.5420409068465233 31.994805037975311 40.801613807678223 11.261288374662401 2.4546728469431383 8.1962314844131452 9.9161344021558744 5.9895566254854193 10.306373268365858 2.1142102163285017 11.560021415352821 48.734045684337616 28.634100317955017 1.61666614562273 1.9884121548384417 1.5822117216885088 9.0565788149833661 8.0768415927886945 6.9109843373298645 10.082051545381544 11.71630971878767 3.3046325594186783 0.52108425647020373 16.497620150446892 21.636544782668352 4.625185651704669 1.668908536434176 1.061300709843638
leaf_count=1540 73 201 199 18 37 93 119 34 35 24 36 47 77 29 134 15 33 56 105 171 982 51 39 77 16 28 23 19 26 63 151 20 118 286 164 381 81 24 142 35 28 18 199 411 42 18 31 56 27 31 13 16 36 40 58 8 46 22 23 42 24 42 210 216 33 26 15 66 31 28 27 24 79 56 29 24 17 51 38 126 33 62 64 38 27 25 18 22 54 60 23 932 1214 261 94 60
internal_value=0 -0.00915798 -0.0144104 0.00050163 -0.00200372 -0.00652701 -0.00900705 -0.001896 1.32216e-05 0.000702547 0.00363441 0.00130108 -0.000498169 -0.0027017 -0.00672966 0.00581024 0.00162929 0.0021646 0.00799175 -0.00276212 -0.0008687 0.0125132 -0.00186259 0.000981263 0.00188173 0.00280442 0.00253383 0.00644105 0.0149899 -0.00235498 -0.000809968 -0.0109442 0.00196208 0.00303121 0.00371057 -0.0102024 -0.019336 -0.00455386 -0.00265399 0.0118156 -0.00563126 -0.0055917 0.000846711 -0.00664584 -0.00177392 -0.000873654 -0.00489967 0.00846301 0.0107234 0.00118192 0.00179726 0.00103119 -0.0072705 -0.00678796 -0.021478 0.000395429 -0.00884355 -0.00315191 0.000373446 0.000244941 -0.00759303 -0.00385916 0.000142676 0.00071702 0.00181959 0.000620559 0.000915714 0.000547768 0.0139221 -0.000929309 -0.00148125 -0.00140135 0.00311714 0.00518741 -0.00227107 -0.00103098 -0.003523 -0.0175897 -0.0199823 -0.00118624 -0.000835499 -0.0188431 -0.0154201 -0.0104948 -0.0026115 -0.00210623 -0.0183646 5.26314e-05 -0.0228714 -0.0111688 -0.0205863 -0.024657 -0.0245839 -0.0248098 -0.0248037 -0.0248293
internal_weight=0 293.9 169.476 2492.24 124.424 95.783 85.0677 910.481 529.864 108.146 86.3968 81.1944 515.974 253.455 138.673 30.0747 262.518 114.783 52.586 62.1968 192.245 13.2911 178.954 43.2469 1581.76 836.265 819.936 104.666 43.4491 62.957 57.1601 21.7488 715.27 425.14 366.159 108.598 41.8208 380.617 137.735 23.2446 242.882 114.491 745.498 195.895 84.5428 74.9267 30.0324 70.273 38.8705 660.955 398.951 376.311 171.418 151.453 33.6646 290.13 49.0778 65.413 61.2172 262.004 37.2537 57.3904 270.514 343.915 44.8942 29.4935 166.75 138.194 18.2374 95.2536 72.7964 46.987 39.0407 10.6509 24.4763 14.5601 20.2923 5.79683 16.2789 58.9818 43.4304 4.20623 6.29548 8.15626 25.6436 16.5871 11.558 21.3433 27.3691 6.57405 2.58957 73.6928 49.8398 23.853 18.1665 5.68649
internal_count=11116 5881 5164 5235 717 1063 970 3317 2264 642 580 544 2229 968 607 149 1261 361 161 200 1145 124 1021 496 1918 1099 1081 141 66 466 352 62 940 604 450 458 474 1053 353 59 700 294 819 574 166 150 49 116 60 653 444 431 487 451 295 336 88 206 75 209 70 184 328 415 101 68 123 108 78 86 55 126 334 135 87 58 40 114 75 154 56 162 183 179 80 53 42 46 112 141 100 4101 2754 1347 1026 321
cat_boundaries=0 1 2 3 4 5 6 7 8 9 10 11 12 13 14 15 16 17 18 19 20 21 22 23
cat_threshold=1 2 1 2 2 1 1 1 1 1 1 2 1 1 1 2 2 1 2 1 1 1 1
is_linear=0
shrinkage=0.05


Tree=108
num_leaves=98
num_cat=18
split_feature=2 3 2 2 2 2 2 2 2 3 3 3 2 2 1 0 2 2 3 2 2 2 3 2 3 0 3 2 3 2 2 3 2 1 2 2 2 1 3 3 2 2 2 2 2 0 3 2 3 3 3 3 2 2 3 2 2 2 2 2 2 3 0 2 1 2 3 2 2 2 2 1 2 2 1 2 2 2 2 2 2 0 0 2 2 2 3 2 2 2 1 0 3 1 1 0 0
split_gain=9.42231 4.31085 5.45271 3.13704 2.35295 1.7835 3.43218 1.76826 1.9215 1.41398 8.66456 1.65612 1.6401 0.921945 1.90375 2.32152 4.94492 1.68867 1.24388 2.45129 1.91765 1.01376 2.45317 1.73364 0.831641 0.707164 0.571185 1.14389 0.688201 2.01826 4.75275 0.53358 0.453931 0.453199 0.46203 3.46078 0.469535 0.317308 0.299967 2.21712 3.94943 0.402037 0.351748 0.250202 1.19752 0.207 0.173394 0.382511 0.216393 0.125351 0.125734 0.163984 0.118134 0.198688 0.116445 0.246332 0.114823 0.0967919 0.09679 0.0947423 0.0938014 0.0894957 0.082858 0.0821416 0.0798292 0.0785138 0.0755434 0.0667266 0.165688 0.0638752 0.0430354 0.0315754 0.0309935 0.0235785 0.710132 0.0211812 0.0195487 0.017873 0.0152047 0.00873401 0.00823691 0.00788655 0.0060334 0.00575352 0.00459943 0.00714826 0.00370981 0.00273004 0.00137608 0.00127876 0.00110304 0.000337275 0.000328017 2.17781e-06 1.1631e-06 1.75131e-07 2.22045e-16
threshold=7.5000000000000009 1.0000000180025095e-35 1.0000000180025095e-35 92.500000000000014 5.5000000000000009 6.5000000000000009 2.5000000000000004 47.500000000000007 46.500000000000007 6.5000000000000009 4.5000000000000009 2.5000000000000004 3.5000000000000004 23.500000000000004 0 1 42.500000000000007 21.500000000000004 1.0000000180025095e-35 31.500000000000004 26.500000000000004 16.500000000000004 17.500000000000004 14.500000000000002 1.5000000000000002 2 5.5000000000000009 93.500000000000014 3.5000000000000004 153.50000000000003 122.50000000000001 52.500000000000007 27.500000000000004 3 204.50000000000003 243.50000000000003 120.50000000000001 4 2.5000000000000004 3.5000000000000004 65.500000000000014 81.500000000000014 78.500000000000014 313.50000000000006 345.50000000000006 5 1.0000000180025095e-35 22.500000000000004 1.5000000000000002 101.50000000000001 29.500000000000004 12.500000000000002 78.500000000000014 74.500000000000014 16.500000000000004 490.00000000000006 4.5000000000000009 649.50000000000011 100.50000000000001 81.500000000000014 229.50000000000003 22.500000000000004 6 238.50000000000003 7 67.500000000000014 36.500000000000007 454.50000000000006 505.00000000000006 125.50000000000001 383.50000000000006 8 4.5000000000000009 1.5000000000000002 9 64.500000000000014 57.500000000000007 109.50000000000001 6.5000000000000009 196.50000000000003 1.5000000000000002 10 11 1.5000000000000002 88.500000000000014 84.500000000000014 15.500000000000002 86.500000000000014 5.5000000000000009 4.5000000000000009 12 13 3.5000000000000004 14 15 16 17
decision_type=2 2 2 2 2 2 2 2 2 2 2 2 2 2 1 9 2 2 2 2 2 2 2 2 2 9 2 2 2 2 2 2 2 1 2 2 2 1 2 2 2 2 2 2 2 9 2 2 2 2 2 2 2 2 2 2 2 2 2 2 2 2 9 2 1 2 2 2 2 2 2 1 2 2 1 2 2 2 2 2 2 9 9 2 2 2 2 2 2 2 1 9 2 1 1 9 9
left_child=1 2 91 7 9 6 25 8 13 10 11 12 24 17 15 32 -17 21 20 -20 -16 23 -23 -2 -3 73 27 -5 33 30 77 86 -15 34 36 -36 -29 56 41 40 -40 45 61 49 -45 75 47 -19 -48 50 51 58 53 -47 55 -46 81 69 -28 -44 -53 65 -31 66 -61 -41 -52 70 -69 -35 -56 84 -14 -4 -75 76 -9 -30 -6 -64 90 -8 89 92 85 -43 -11 -73 -58 -39 -27 93 -13 -1 95 -93 -96
right_child=3 4 5 26 78 -7 37 38 -10 31 -12 83 72 14 18 16 -18 46 19 -21 -22 22 -24 -25 -26 80 43 28 29 62 -32 -33 -34 57 35 -37 -38 82 39 42 -42 71 59 44 54 52 48 -49 -50 -51 63 60 -54 -55 67 -57 88 -59 -60 64 -62 -63 79 -65 -66 -67 -68 68 -70 -71 -72 87 -74 74 -76 -77 -78 -79 -80 -81 -82 -83 -84 -85 -86 -87 -88 -89 -90 -91 -92 94 -94 -95 96 -97 -98
leaf_value=-0.024587085927474609 -0.002506214785021776 -0.0070080167210325138 0.0022769209350868222 0.015721909730761239 -0.017472798678919658 0.012665184903570546 -0.016487939583591304 -0.0025417635362603615 0.018184523328302993 -0.017143268151361114 0.088598547209753409 -0.021121816143719854 0.014662828084140765 -0.016186374944285178 0.01375455362132845 -0.0058155703600451508 0.041336469561333022 0.0044416510690996345 -0.0097130117070444288 0.014356487591658302 -0.0073985914518874193 -0.0086642350988944648 0.017755384637825097 0.010303385296920918 0.0049023393357902926 -0.021022027892849557 -0.0055251328464066057 0.0045524808948409715 -0.0019399455763682003 0.0032318814369975131 0.02949057353884459 -0.00247196650940975 -0.0083314118900492447 -0.0012139766646070637 0.017308872613419027 0.0016004276216864954 -0.0007226451675725297 -0.010310895133174503 0.035715575374893886 -0.0049137789675265872 -0.0058665126750682773 -0.0030716647592708671 -0.012628489974817728 0.010411692882110062 -0.0001479045122306093 -0.0072313343199499587 0.0018843458683721226 0.014586249149546286 0.010123184410284047 0.0045778198916097421 -0.0030557808403863062 0.0023887005609177984 -0.010778310034497286 -0.00083346504922910064 0.00013795222949704525 0.0057223972325108133 -0.023136521336567115 0.0037699219493245537 -0.00046822053991178378 -0.0053009607067997476 -0.00054912285076444704 0.0018565164643572609 -0.0018029994917848798 -0.003399625159403299 -0.0099598948669416057 -0.00075487618064750208 0.000501950069617726 -0.0033804298041588601 0.00052332797493505139 0.00057531564942285584 0.0026531273282328076 -0.0004840403896673839 0.01896128008613129 -0.018872371751197922 0.011966480370443929 -0.0040069011631435215 0.001182043026273612 -0.0049132671410734635 -0.020872234814021819 -0.00030592724884954525 -0.015908831091217233 -0.012654158143756764 -0.0075618720507165844 -0.018593983560354958 -0.003461475873748756 -0.0009928819422282823 -0.018986760271889207 0.0006485991463327772 -0.022411793818738202 -0.011713413049875677 -0.018423435772125671 -0.024804610399230806 -0.02191441542509218 -0.024565737658974827 -0.024829264534509406 -0.024787401858773497 -0.024829264898812705
leaf_weight=27.518084086477757 72.612080696970224 29.129559325054288 28.4562773630023 16.598381489515305 4.636526491492984 10.857213538140057 4.2360543850809336 8.5483343005180377 14.156500861048697 4.5674066282808798 2.8933349326252928 3.6673296354711038 8.8723665215075034 23.553250536322594 13.771956011652945 22.915063127875332 7.3417671769857398 15.687240093946455 14.597672894597052 38.413557231426239 48.255858570337296 67.864081166684628 10.093261599540709 41.515323311090469 29.498238459229469 2.0252920463681212 10.223524659872053 64.198970675468445 9.9660939276218432 17.846057236194611 23.891033053398132 10.165117144584654 83.942866504192352 65.957917988300323 42.676070272922516 196.54741638898849 123.01004511117935 3.2353864200413209 9.7559120059013384 41.558351591229439 13.770476326346396 8.4835455119609886 11.673941582441328 36.228038847446442 38.653728544712067 137.11558803915977 18.231213547289371 22.793512567877769 14.160016402602194 14.264618515968321 21.442794263362885 100.71600499749184 19.748036772012711 13.31331232190132 29.808825969696045 33.237053871154785 15.29420930147171 19.691654443740845 127.09321376681328 19.824900060892105 37.208373129367828 8.0379139184951764 14.769037306308745 40.773802280426025 17.147089302539825 15.611120522022246 49.055469989776611 34.11614990234375 133.7113493680954 204.59494650363922 39.600812315940857 11.255703061819078 7.9523020461201659 2.4085119217634183 8.2987179756164533 9.8756412118673307 5.9968299865722647 10.254838079214094 11.320309989154339 28.625121533870697 1.5909243877977131 1.9631047919392575 1.5700845494866369 2.6786797866225243 9.0246028900146467 8.0686308145523054 6.7802557870745659 10.088764101266859 11.456031367182732 3.2656445056200027 0.51151177100837264 16.09342722594738 2.0267649069428444 21.111366927623749 4.5117599610239267 1.6280475743114973 1.0352737829089189
leaf_count=1540 665 277 199 18 37 93 119 34 35 24 12 42 41 77 29 134 15 29 56 105 171 326 2 152 138 77 22 157 23 19 26 20 381 118 49 164 234 81 24 135 35 28 18 25 32 411 24 35 28 13 30 167 36 40 23 20 58 8 210 46 41 22 23 39 24 49 70 21 75 210 31 24 26 79 56 29 24 17 38 33 62 64 38 27 27 25 18 22 54 60 23 932 17 1214 261 94 60
internal_value=0 -0.00901566 -0.0142602 0.000488204 -0.00196029 -0.00640892 -0.00886518 -0.00185369 1.12762e-05 0.00068232 0.00352879 0.000592499 0.00293363 -0.000487551 -0.00264363 -0.00660883 0.00562579 0.00158518 0.00210449 0.00772848 -0.00270199 -0.000848655 -0.00524364 0.00215344 -0.00101539 0.000954824 0.00183119 0.00272656 0.00246416 0.00623748 0.0143916 -0.0107919 -0.0100525 0.00190948 0.00294679 0.00440272 0.00108634 -0.0192288 -0.00446192 -0.00259657 0.0113767 -0.00552295 -0.00548398 0.000824836 0.00181117 -0.00652467 0.00818162 0.0104507 0.005486 -2.51048e-05 -0.00019498 0.000378412 -0.00714242 -0.00666511 0.000803242 0.00256609 -0.0214053 0.000385438 -0.000844718 -0.00870162 0.00159615 -0.00308355 0.000363986 -0.00161331 -0.00746171 -0.00377812 -0.000580171 0.000269038 -0.000270232 0.000139105 0.00157295 -0.00136853 0.0166945 0.00302947 0.00502951 -0.00221983 -0.00100647 -0.00344784 -0.0198845 -0.00081545 -0.0187293 -0.0152739 -0.0103436 -0.020505 -0.00255342 -0.00205833 -0.0182448 5.13177e-05 -0.0228262 -0.0110154 -0.0204981 -0.0246527 -0.0214039 -0.0245778 -0.0248093 -0.024803 -0.0248293
internal_weight=0 291.255 167.067 2493.57 124.188 95.169 84.3118 908.804 529.905 108.231 86.7186 83.8252 75.4525 515.749 252.792 137.753 30.2568 262.957 115.039 53.0112 62.0278 192.085 77.9573 114.127 58.6278 43.2912 1584.76 838.628 822.029 105.352 44.112 21.5128 107.496 716.677 426.433 239.223 187.209 41.0205 378.899 137.38 23.5264 241.519 113.853 746.134 345.356 194.598 70.872 38.4808 32.3912 400.778 386.513 275.241 170.177 150.429 309.128 71.8908 32.9494 290.245 137.317 48.6459 137.924 65.2074 61.2402 111.272 36.972 57.1695 70.4983 237.237 167.827 270.553 69.4096 46.9212 16.8247 39.1635 10.7072 24.4208 14.5452 20.2209 15.9568 43.3942 4.12773 6.19916 8.07112 8.37277 25.5768 16.5522 11.3477 21.3445 26.7502 6.50103 2.5368 71.898 5.69409 48.6295 23.2685 17.7215 5.54703
internal_count=11116 5881 5164 5235 717 1063 970 3317 2264 642 580 568 482 2229 968 607 149 1261 361 161 200 1145 328 817 415 496 1918 1099 1081 141 66 62 458 940 604 213 391 474 1053 353 59 700 294 819 227 574 116 64 52 592 579 440 487 451 202 52 295 336 232 88 208 206 75 139 70 184 100 150 96 328 54 126 67 334 135 87 58 40 75 56 162 183 179 86 80 53 42 46 112 141 100 4101 59 2754 1347 1026 321
cat_boundaries=0 1 2 3 4 5 6 7 8 9 10 11 12 13 14 15 16 17 18
cat_threshold=1 2 2 1 1 1 1 1 1 1 2 2 1 2 1 1 1 1
is_linear=0
shrinkage=0.05


Tree=109
num_leaves=98
num_cat=20
split_feature=2 3 2 2 2 2 2 2 2 3 3 3 2 2 1 0 2 2 2 2 2 3 3 3 0 3 2 3 2 2 3 2 1 2 2 1 3 3 2 2 2 2 2 2 0 2 2 1 3 3 2 2 2 2 2 2 3 0 1 0 3 2 2 3 2 3 2 2 2 2 1 2 2 1 2 2 2 2 2 2 2 0 3 0 2 2 2 2 2 2 1 0 3 1 1 0 0
split_gain=9.04789 4.20425 5.42807 2.98321 2.28557 1.70068 3.35485 1.69169 1.79468 1.35293 7.49138 1.60249 1.53034 0.878472 1.82357 2.23107 4.50891 1.59146 1.23115 6.55733 0.970219 2.5006 1.15168 0.793384 0.682732 0.539954 1.06483 0.646736 1.87735 4.33754 0.524921 0.447067 0.428568 0.46871 0.655981 0.317708 0.288673 2.0997 3.60131 0.387564 0.340417 0.243795 0.202696 0.31142 0.200045 0.189518 0.182289 1.12657 0.140199 1.45372 0.144751 0.115956 0.115177 0.191786 0.0927641 0.0916417 0.0855395 0.0785712 0.0776846 0.0770582 0.0761549 0.0609624 0.060774 0.0566105 0.0459628 0.0509885 0.0443225 0.0827087 0.0353162 0.0785099 0.0301455 0.0279948 0.0221477 0.676792 0.0202906 0.0186347 0.0171752 0.0153351 0.0125002 0.00833044 0.00828182 0.0078445 0.00688043 0.00590815 0.00581613 0.00440983 0.00684013 0.00259558 0.00140207 0.00125744 0.00111442 0.000345606 0.000332897 2.23089e-06 1.19205e-06 1.79552e-07 2.66454e-15
threshold=7.5000000000000009 1.0000000180025095e-35 1.0000000180025095e-35 92.500000000000014 5.5000000000000009 6.5000000000000009 2.5000000000000004 47.500000000000007 46.500000000000007 6.5000000000000009 4.5000000000000009 2.5000000000000004 3.5000000000000004 23.500000000000004 0 1 42.500000000000007 21.500000000000004 42.500000000000007 41.500000000000007 8.5000000000000018 1.5000000000000002 6.5000000000000009 1.5000000000000002 2 5.5000000000000009 93.500000000000014 3.5000000000000004 153.50000000000003 122.50000000000001 47.500000000000007 27.500000000000004 3 119.50000000000001 243.50000000000003 4 2.5000000000000004 3.5000000000000004 65.500000000000014 81.500000000000014 78.500000000000014 129.50000000000003 95.500000000000014 119.50000000000001 5 123.50000000000001 22.500000000000004 6 35.500000000000007 34.500000000000007 709.50000000000011 4.5000000000000009 78.500000000000014 74.500000000000014 81.500000000000014 649.50000000000011 22.500000000000004 7 8 9 58.500000000000007 43.500000000000007 125.50000000000001 10.500000000000002 109.50000000000001 12.500000000000002 628.50000000000011 306.50000000000006 238.50000000000003 374.50000000000006 10 4.5000000000000009 1.5000000000000002 11 64.500000000000014 57.500000000000007 109.50000000000001 6.5000000000000009 98.500000000000014 196.50000000000003 1.5000000000000002 12 15.500000000000002 13 1.5000000000000002 88.500000000000014 84.500000000000014 86.500000000000014 5.5000000000000009 4.5000000000000009 14 15 3.5000000000000004 16 17 18 19
decision_type=2 2 2 2 2 2 2 2 2 2 2 2 2 2 1 9 2 2 2 2 2 2 2 2 9 2 2 2 2 2 2 2 1 2 2 1 2 2 2 2 2 2 2 2 9 2 2 1 2 2 2 2 2 2 2 2 2 9 1 9 2 2 2 2 2 2 2 2 2 2 1 2 2 1 2 2 2 2 2 2 2 9 2 9 2 2 2 2 2 2 1 9 2 1 1 9 9
left_child=1 2 91 7 9 6 24 8 13 10 11 12 23 17 15 31 -17 20 19 -16 21 -2 -22 -3 72 26 -5 32 29 76 82 -15 33 78 -35 51 39 38 -38 44 56 42 -27 64 74 -45 47 -19 49 50 63 81 53 -46 -42 62 59 -30 -56 -39 68 -20 -34 -43 65 -44 67 -62 -50 -70 85 -14 -4 -74 75 -9 -29 -6 -28 -59 90 -8 -11 89 92 86 -41 -72 -53 -37 -26 93 -13 -1 95 -93 -96
right_child=3 4 5 25 77 -7 35 36 -10 30 -12 84 71 14 18 16 -18 46 61 -21 22 -23 -24 -25 80 41 27 28 57 -31 -32 -33 55 34 -36 83 37 40 -40 70 54 48 43 45 52 -47 -48 -49 60 -51 -52 88 -54 -55 58 -57 -58 79 -60 -61 66 -63 -64 -65 -66 -67 -68 -69 69 -71 87 -73 73 -75 -76 -77 -78 -79 -80 -81 -82 -83 -84 -85 -86 -87 -88 -89 -90 -91 -92 94 -94 -95 96 -97 -98
leaf_value=-0.024581057071394713 -0.0099279883779703031 -0.0068826870461279992 0.0022152739646395616 0.015089351559045403 -0.017343131260058441 0.012193304466796 -0.016349268266438243 -0.0024850419402806705 0.017409405370173461 -0.017010368821534304 0.078981328412361315 -0.021042675679928319 0.014087986711788342 -0.0160453395336498 0.00056163452092586926 -0.0057046726822040572 0.038657169359838442 0.018395427696691204 -0.011458828713544636 0.048418090574251518 -0.0036263320499083994 0.033235981440819386 0.007047870980772683 0.0047569418772461011 -0.018304323710977444 -0.0086048375773629497 -0.0028519398851763232 -0.0018954984416572015 0.0031413375301719395 0.027912041223587866 -0.0027932539663327043 -0.0081933872429115606 -0.0011852907799620284 0.0057871457942990853 0.0015581627004486289 -0.010160423674881866 0.033591339510766073 -0.0046053428275175121 -0.0057549404682118166 -0.0030047300035990461 -0.012473435530361406 -0.0002139346524920456 -0.0010338992081367826 -0.0089560863626291006 -0.0071036165994956381 -0.00098766699553505034 0.0051070081609781888 0.0014935060434897362 0.00082993560225163231 0.013919271812881573 0.004153404813880609 -0.023096900053882086 -0.010626045531177082 -0.00081345702940853839 -0.0051971672150188629 0.0036623081318027852 0.0018070198823724735 -0.0017614456773260801 -0.009811057416833224 3.1355050146329974e-05 0.0022645476060306163 -0.0062003571167434917 0.00056070421595628701 0.0011343205985285933 0.0039820981544455526 0.0032344868726469655 0.002091510761866274 -0.00059597363028358961 -0.0032986365007769158 1.3860080864770723e-05 -0.00047225337040440681 0.018138780648890029 -0.018758882805706187 0.011528788469104091 -0.0039233006921449015 0.0011513147238405052 -0.0048151737463740206 -0.020788775731744959 -0.00093280452910920347 -0.00029842375186801606 -0.015765782108275811 -0.012499113285172031 -0.019585427331113077 -0.0074308033816631331 -0.018476959884218932 -0.0033873835830689767 -0.0009692035695468876 0.00063207964050921556 -0.022357002242265125 -0.011558878401427483 -0.020941143959123255 -0.024803993648679096 -0.021849832753327966 -0.024559183103695661 -0.024829263629085274 -0.024786351983013464 -0.024829266403284443
leaf_weight=26.849744096398354 6.5653134249150735 28.926132522523403 28.521144036203623 16.861402004957199 4.5562169887125465 10.995596643537281 4.1667832024395466 8.5266341269016284 14.41628512740135 4.4897737726569193 3.1613791063427916 3.5906812995672208 9.0034189820289612 23.175077743828297 84.863312363624573 22.78218570351601 7.6516095846891394 20.297128677368164 9.5229688584804553 7.8172616362571707 148.02864065393806 6.8628111779689789 30.471547871828079 29.643204094842076 0.50217426754534245 9.5072419941425306 10.265569448471068 9.9467790424823779 17.903826832771301 24.606084823608398 10.648993998765944 83.24640953540802 65.8778957426548 171.65358251333237 196.86222815513611 3.2021979056298724 10.110647037625315 45.814590752124786 13.689928308129309 8.4575269222259575 11.527444362640379 118.85455670952797 18.086775571107868 14.338916897773744 136.12763544917107 15.558121800422667 31.987768113613129 19.170285820960999 22.483337342739105 22.997479796409607 32.63370418548584 14.944416806101799 19.53632915019989 13.302220910787581 19.7200867831707 19.766030073165894 8.0528503209352476 14.742432773113249 16.977153748273849 11.139394000172613 37.310785710811615 13.084890633821486 204.712686419487 225.70501706004143 15.472195684909819 11.41054195165634 51.431978940963745 78.301580786705017 31.839813470840454 40.820972919464111 11.250255882740023 8.1045265682041645 2.3634838964790088 8.3986209630966169 9.8361496776342374 6.0039227604866019 10.204577028751372 11.086478151381016 48.915109217166901 28.616365909576416 1.5658149328082798 1.9384198915213335 6.1437615603208542 1.5582565553486345 2.6293326653540134 8.993418484926222 8.0606234669685346 10.095309704542158 11.202136930078268 3.2276157885789871 1.9831607677042478 15.699145041406155 1.9828327335417268 20.599069159477949 4.4011155366897583 1.5881884694099433 1.0098852217197443
leaf_count=1540 107 277 199 18 37 93 119 34 35 24 12 42 41 77 286 134 15 33 20 17 982 17 39 138 23 16 28 23 19 26 22 381 118 286 164 81 24 142 35 28 18 147 42 18 411 31 56 27 31 13 16 58 36 40 46 8 22 23 24 42 44 38 210 268 33 26 25 54 28 27 24 26 79 56 29 24 17 38 126 33 62 64 16 38 27 27 25 22 54 60 77 932 17 1214 261 94 60
internal_value=0 -0.0088748 -0.0141094 0.000475134 -0.00191944 -0.00629222 -0.0087243 -0.00181219 9.48227e-06 0.000660493 0.00342358 0.000575864 0.00285116 -0.000477092 -0.00258659 -0.00648932 0.0054487 0.00154238 0.00204622 0.00459815 -0.000829109 0.0121321 -0.00180415 -0.00099162 0.000929143 0.00178206 0.00265096 0.00239646 0.00604177 0.013826 -0.01064 -0.00990328 0.00185823 0.0028647 0.00352801 -0.0191201 -0.00437139 -0.00254017 0.0109596 -0.00541613 -0.00537774 0.000803562 -0.00172774 -0.000854423 -0.00640491 -0.0048094 0.00791219 0.0101858 0.001126 0.00171479 0.000970685 -0.0213312 -0.00701568 -0.00654367 -0.00856075 0.000375704 -0.00301647 0.00035477 -0.00733168 -0.00369847 0.000227296 -0.00841535 0.000135625 0.000669245 0.00177496 0.000617254 0.000870409 0.000327183 -0.000901816 -0.00143767 -0.00133643 0.016007 0.00294456 0.00487726 -0.00216963 -0.000982525 -0.00337401 -0.0197852 -0.0012657 -0.000795866 -0.018614 -0.0151268 -0.0184982 -0.010193 -0.0204154 -0.00249648 -0.00201142 5.0037e-05 -0.0227799 -0.0108624 -0.0204084 -0.0246483 -0.0213298 -0.0245716 -0.0248088 -0.0248024 -0.0248293
internal_weight=0 288.684 164.717 2494.85 123.967 94.5698 83.5742 907.166 529.943 108.324 87.0415 83.8801 75.6773 515.527 252.144 136.855 30.4338 263.383 115.288 92.6806 191.928 13.4281 178.5 58.5693 43.3344 1587.69 840.935 824.073 106.02 44.7574 21.2825 106.421 718.053 427.696 368.516 40.2398 377.222 137.032 23.8006 240.19 113.232 746.753 84.3738 74.8666 193.333 29.897 71.4552 39.4674 662.379 400.191 377.193 32.2518 168.966 149.43 48.2247 290.357 65.0068 61.2626 36.6972 56.954 262.188 22.6079 270.591 344.56 44.9695 29.4973 167.044 115.612 95.1441 72.6608 46.8571 17.1079 39.2832 10.7621 24.3667 14.5306 20.1514 15.6427 59.1807 43.3588 4.05115 6.1052 10.6335 7.98807 8.20285 25.5116 16.5182 21.3456 26.1466 6.42981 2.48534 70.1471 5.57351 47.4488 22.6983 17.2873 5.411
internal_count=11116 5881 5164 5235 717 1063 970 3317 2264 642 580 568 482 2229 968 607 149 1261 361 303 1145 124 1021 415 496 1918 1099 1081 141 66 62 458 940 604 450 474 1053 353 59 700 294 819 166 150 574 49 116 60 653 444 431 295 487 451 88 336 206 75 70 184 209 58 328 415 101 68 123 98 86 55 126 67 334 135 87 58 40 75 154 56 162 183 40 179 86 80 53 46 112 141 100 4101 59 2754 1347 1026 321
cat_boundaries=0 1 2 3 4 5 6 7 8 9 10 11 12 13 14 15 16 17 18 19 20
cat_threshold=1 2 2 1 1 1 1 1 1 2 1 1 2 2 2 2 1 1 1 1
is_linear=0
shrinkage=0.05


Tree=110
num_leaves=71
num_cat=18
split_feature=2 3 2 3 3 1 2 1 0 2 3 3 2 2 2 3 2 0 1 2 3 3 0 0 1 0 3 2 2 3 2 2 2 2 2 3 2 2 3 3 2 3 3 2 1 1 1 3 3 3 3 2 3 2 2 2 3 1 2 2 2 0 1 2 3 3 2 0 1 1
split_gain=7.10484 8.48737 3.04565 2.79795 1.94761 2.93861 1.81741 2.09159 1.77876 1.74959 1.72467 2.49359 0.890653 0.685279 2.00033 1.62395 2.2655 1.5159 1.53077 1.4552 4.76191 1.72535 0.963175 2.53879 1.48358 0.531125 0.512417 0.502478 0.428376 0.411217 0.200745 0.196398 0.526069 3.32727 1.05034 0.332046 0.251994 3.3974 0.43662 0.193368 0.168599 0.133588 0.403515 0.109596 0.0952146 0.0893512 0.069234 0.0627799 0.060822 0.0521272 0.0357595 0.0311157 0.0289795 0.0225457 0.0221293 0.0217101 0.0196089 0.0152354 0.0112043 0.00782362 0.00763176 0.00445171 0.00744652 0.00374567 0.00370065 0.00197353 0.000413808 3.23471e-06 6.69823e-06 6.41927e-06
threshold=1.0000000180025095e-35 1.0000000180025095e-35 69.500000000000014 28.500000000000004 2.5000000000000004 0 81.500000000000014 1 2 94.500000000000014 1.0000000180025095e-35 8.5000000000000018 64.500000000000014 5.5000000000000009 6.5000000000000009 1.5000000000000002 3.5000000000000004 3 4 7.5000000000000009 2.5000000000000004 1.0000000180025095e-35 5 6 7 8 1.5000000000000002 75.500000000000014 91.500000000000014 1.0000000180025095e-35 78.500000000000014 161.50000000000003 205.50000000000003 202.50000000000003 208.50000000000003 1.5000000000000002 123.50000000000001 122.50000000000001 1.5000000000000002 4.5000000000000009 67.500000000000014 2.5000000000000004 10.500000000000002 150.50000000000003 9 10 11 8.5000000000000018 1.5000000000000002 3.5000000000000004 8.5000000000000018 76.500000000000014 1.5000000000000002 1.5000000000000002 86.500000000000014 75.500000000000014 1.0000000180025095e-35 12 3.5000000000000004 4.5000000000000009 73.500000000000014 13 14 1.5000000000000002 1.5000000000000002 6.5000000000000009 68.500000000000014 15 16 17
decision_type=2 2 2 2 2 1 2 1 9 2 2 2 2 2 2 2 2 9 1 2 2 2 9 9 1 9 2 2 2 2 2 2 2 2 2 2 2 2 2 2 2 2 2 2 1 1 1 2 2 2 2 2 2 2 2 2 2 1 2 2 2 9 1 2 2 2 2 9 1 1
left_child=1 61 12 4 5 26 7 8 10 28 27 51 13 15 56 16 25 18 -18 20 21 -16 24 -24 -21 29 -3 -4 39 -2 60 36 33 47 -34 -36 37 38 -11 52 45 43 -43 -38 50 48 -41 -33 -14 58 -6 -12 54 -27 -8 -10 -15 -30 63 -19 -9 62 -1 -17 -7 -46 -42 69 -69 -63
right_child=2 3 6 -5 44 64 9 30 55 31 11 -13 40 14 19 49 17 59 -20 22 -22 -23 23 -25 -26 53 -28 -29 57 -31 -32 32 34 -35 35 -37 41 -39 -40 46 66 42 -44 -45 65 -47 -48 -49 -50 -51 -52 -53 -54 -55 -56 -57 -58 -59 -60 -61 -62 67 -64 -65 -66 -67 -68 68 -70 -71
leaf_value=-0.023367702195638575 3.6864606971591632e-05 -0.00062658860891344264 0.035783389212035284 0.018789612894582253 -0.017877669175901514 -0.023764168933635556 -0.0018178293979606347 -0.00037351695528230438 -0.00093159188010302329 0.0024909174556715322 -0.0034451541866424872 0.024247253079653811 -0.014654645171375207 -0.020241631581778996 0.010351076443599104 -0.018891012907156918 0.020425871980010318 -0.011756695892678224 -0.012456982308651113 -0.0057956937729846114 0.055662690272779682 -0.02159756232271013 -0.004419555186624337 0.010259193198825648 -0.00059941536617562254 -0.019861545765396286 0.010457910319207947 0.021045285127520196 -0.0090756242290344624 -0.019731777333425127 -0.0075584795582259862 0.0012416312944102921 -0.0089961915146501512 0.027192354055171654 -0.00019792612663287673 0.0018696423272930543 0.0013900657510753586 0.026316680367282859 -0.0022087068466057794 -0.0042271508981112068 -0.0042279697754659508 -0.0051224756895484197 0.0008985654917834662 -0.0019927609800654868 -0.023028809034536694 -0.0070239531813276416 -0.009631312557839819 0.0031851734956464582 -0.0098235537869652886 -0.011460094415928627 -0.0078681194923695442 -0.0080544543363470413 -0.0034784831294631252 -0.013840911546976141 0.00075393971990252899 -0.004837230164741674 -0.01635343345472692 -0.011163803754046702 -0.021305533295018948 -0.015845221602544445 0.0014074442964462015 -0.024735332177176255 -0.024642702752078083 -0.014743666772987671 -0.021652801703249482 -0.021751267580702699 -0.0036487686896212409 -0.024663348733279428 -0.024829265279423047 -0.024803549099424713
leaf_weight=26.248829228803515 45.083623442798853 18.338588915765285 9.4689661264419573 15.287401691079138 1.8898939415812495 8.3133697137236577 19.015625268220901 13.636382430791857 7.0853232443332654 86.8094162940979 7.7524812519550341 13.325302094221113 13.355358690023424 13.390553370118143 11.579041931778198 1.2118798978626713 30.173149969428778 2.3771054483950129 4.0095467045903197 319.773980807513 4.5914178267121306 6.6543766222894183 75.472368195652962 48.314089484512806 240.79900531470776 2.8700265437364569 24.165556311607361 14.85788509249687 18.064044326543808 2.7936208173632613 11.681645959615706 111.04343354701996 25.803033709526062 14.114280700683592 280.49445337057114 631.08807420730591 71.214786678552628 12.865395724773405 114.75035697221756 11.577170938253403 6.1787471473216993 57.705112457275391 53.741226136684418 36.069818109273911 6.4543287139385921 11.604925662279127 12.142558187246323 66.393004238605499 12.719890624284742 2.3705260939896107 1.6903531327843664 6.9383143782615662 12.798355400562285 3.3935673870146275 14.933478891849516 7.1473153680562973 4.2787639386951914 16.913470298051834 5.0306895188987255 2.3043329678475857 10.763087153434752 4.4412251561880112 20.314566660672426 0.98846087045967568 2.7658015899360171 5.6861708909273148 6.1563176512718201 1.5493068844079998 1.0015379227697849 15.42955735512078
leaf_count=1543 464 137 21 28 31 74 50 35 23 177 29 22 24 96 93 24 112 64 76 1294 12 25 499 127 815 117 70 32 35 48 21 173 21 15 239 521 143 14 234 29 21 93 91 58 33 21 16 102 26 28 10 17 33 122 40 19 39 20 31 35 29 270 1227 21 34 13 21 94 61 939
internal_value=0 -0.0111866 -0.00012473 -0.000571885 -0.00484273 -0.000302654 0.00106922 0.0075262 0.0127803 0.000671714 0.017042 0.00858468 -0.00253337 -0.00214173 -0.0026831 0.00168271 0.0037038 0.0129144 0.0165688 -0.00226791 0.0101516 -0.00130874 -0.00268213 0.00130959 -0.00356359 -0.00290787 0.00567546 0.0267819 -0.00556192 -0.00111663 -0.00216846 0.0010925 0.00143977 0.00382744 0.000951863 0.00123345 0.000187395 0.00140543 -0.000184634 -0.00331664 -0.00901268 -0.00100666 -0.00221903 0.000252736 -0.0203173 -0.0106737 -0.00699364 0.00196886 -0.012298 -0.0178945 -0.0131518 -0.00562208 -0.00145093 -0.0165996 -0.000686564 -0.00289292 -0.0193001 -0.0100854 -0.0200039 -0.0137692 0.0004121 -0.0242027 -0.023924 -0.0170279 -0.0232371 -0.0224305 -0.0039389 -0.0247815 -0.0247285 -0.0247883
internal_weight=0 153.576 2647.67 84.5915 69.3041 53.5833 1770.19 102.657 66.5756 1667.54 52.3429 28.0161 877.475 827.46 724.854 102.607 93.005 38.8641 34.1827 707.184 22.8248 18.2334 684.359 123.786 560.573 54.1408 42.5041 24.3269 105.445 47.8772 36.0811 1562.09 1128.94 191.551 937.386 911.583 433.156 214.425 201.56 70.4672 50.0152 218.731 111.446 107.285 15.7207 37.6802 23.7197 177.436 26.0752 9.60156 3.58025 14.6908 46.7475 6.26359 33.9491 14.2326 17.6693 34.9775 7.23103 4.68144 24.3995 68.985 46.5634 2.20034 11.0792 12.1405 12.3351 22.4216 2.55084 19.8708
internal_count=11171 4564 6607 430 402 315 2352 248 163 2104 121 68 4255 4142 3000 1142 1038 287 188 2865 130 118 2735 626 2109 751 207 53 223 512 85 1881 1071 290 781 760 810 425 411 168 113 385 184 201 87 71 45 275 50 104 41 46 123 239 90 42 135 55 76 99 64 4134 2770 45 108 46 42 1364 155 1209
cat_boundaries=0 1 2 3 4 5 6 7 8 9 10 11 12 13 14 15 16 17 18
cat_threshold=1 1 2 2 1 2 1 1 2 2 1 1 1 2 1 1 1 2
is_linear=0
shrinkage=0.05


Tree=111
num_leaves=71
num_cat=18
split_feature=2 3 2 3 3 1 2 1 2 0 2 2 3 2 2 2 3 2 0 1 2 3 3 0 0 1 0 3 2 3 2 2 2 2 2 3 2 2 3 3 2 3 3 2 1 1 1 3 3 3 3 3 3 2 2 2 3 1 2 2 2 0 1 3 2 3 2 0 1 1
split_gain=6.84272 8.36955 2.90169 2.62509 1.90045 2.84623 1.71047 1.95164 1.67031 1.64527 1.63988 2.48816 2.87225 0.858705 0.653187 1.94978 1.56406 2.1238 1.41904 1.42041 1.37421 4.23927 1.66212 0.920315 2.39678 1.42516 0.515806 0.479664 0.415279 0.399468 0.19272 0.186311 0.496905 3.05889 1.00586 0.314832 0.239394 3.14089 0.415165 0.186101 0.164221 0.127429 0.386247 0.10426 0.0958052 0.0875928 0.0672465 0.0600341 0.0594158 0.052108 0.0353721 0.0277159 0.0246351 0.0225589 0.0210815 0.0208279 0.0197308 0.0149404 0.0113016 0.00775812 0.0072468 0.00455642 0.00761426 0.00377161 0.0037492 0.00200847 0.000398264 3.31552e-06 6.86477e-06 6.57933e-06
threshold=1.0000000180025095e-35 1.0000000180025095e-35 69.500000000000014 28.500000000000004 2.5000000000000004 0 81.500000000000014 1 94.500000000000014 2 78.500000000000014 73.500000000000014 2.5000000000000004 64.500000000000014 5.5000000000000009 6.5000000000000009 1.5000000000000002 3.5000000000000004 3 4 7.5000000000000009 2.5000000000000004 1.0000000180025095e-35 5 6 7 8 1.5000000000000002 91.500000000000014 1.0000000180025095e-35 78.500000000000014 161.50000000000003 205.50000000000003 202.50000000000003 208.50000000000003 1.5000000000000002 123.50000000000001 122.50000000000001 1.5000000000000002 4.5000000000000009 67.500000000000014 2.5000000000000004 10.500000000000002 150.50000000000003 9 10 11 1.5000000000000002 13.500000000000002 3.5000000000000004 8.5000000000000018 1.5000000000000002 1.0000000180025095e-35 1.5000000000000002 86.500000000000014 75.500000000000014 1.0000000180025095e-35 12 3.5000000000000004 4.5000000000000009 73.500000000000014 13 14 1.5000000000000002 1.5000000000000002 6.5000000000000009 68.500000000000014 15 16 17
decision_type=2 2 2 2 2 1 2 1 2 9 2 2 2 2 2 2 2 2 9 1 2 2 2 9 9 1 9 2 2 2 2 2 2 2 2 2 2 2 2 2 2 2 2 2 1 1 1 2 2 2 2 2 2 2 2 2 2 1 2 2 2 9 1 2 2 2 2 9 1 1
left_child=1 61 13 4 5 27 7 9 28 10 11 12 -4 14 16 56 17 26 19 -19 21 22 -17 25 -25 -22 29 -3 39 -2 60 36 33 48 -34 -36 37 38 -10 51 45 43 -43 -38 50 47 -41 -15 -33 58 -6 54 -13 -28 -8 -11 -16 -30 64 -20 -9 62 -1 -7 -18 -46 -42 69 -69 -63
right_child=2 3 6 -5 44 63 8 30 31 55 -12 52 -14 40 15 20 49 18 59 -21 23 -23 -24 24 -26 -27 53 -29 57 -31 -32 32 34 -35 35 -37 41 -39 -40 46 66 42 -44 -45 65 -47 -48 -49 -50 -51 -52 -53 -54 -55 -56 -57 -58 -59 -60 -61 -62 67 -64 -65 -66 -67 -68 68 -70 -71
leaf_value=-0.023333147712514962 3.594786712084852e-05 -0.00061141877553141228 0.04294023712450809 0.017977682391518406 -0.017752272799934236 -0.023738554725323994 -0.00177596054655094 -0.00036438060086903127 0.0024229495516847007 -0.00090931846702729249 0.026702389038526116 -0.0072239534448530754 -0.0003557496194559087 -0.01450444202506909 -0.020147824802867365 0.0099888002718494084 -0.018777766799149664 0.01951087219530015 -0.011602098682617527 -0.012301896685332114 -0.0056850606707474364 0.051304703938365018 -0.02152700633104249 -0.0043291537040720798 0.0099010538213206399 -0.00058488719707880203 -0.019761893397336486 0.010090801950281961 -0.0089319995224378928 -0.019630196200962177 -0.007427444191435391 0.0013330614811367916 -0.0088531114204489659 0.025796825372925436 -0.00019305049268178255 0.0018197715635004221 0.0013536444810316186 0.024988246231462206 -0.0021586894839788957 -0.0041398782162504815 -0.0041406837320640344 -0.0050212691545651533 0.00087545771597184101 -0.0019472079551159851 -0.022986865274329468 -0.0068984493806941898 -0.0094842291504974342 -0.00967541797565959 0.0033490390958581468 -0.011306001440593395 -0.0077341405669844546 -0.0034040853510819836 -0.0032484408818228318 -0.013687765538328409 0.00073465883029573138 -0.0047402898868626571 -0.016213685718733103 -0.011010390775875727 -0.021229652878172883 -0.01570173392560192 0.0013705435518732096 -0.024732981196172524 -0.0246380493194591 -0.021583272115340446 -0.01459386621712116 -0.021683583322947633 -0.0035713448728351437 -0.024829264420778877 -0.024659205210273035 -0.024802903347781419
leaf_weight=25.642566081136465 45.085286397486925 18.327101696282625 8.3764588832855242 15.577362060546873 1.8564072921872141 8.1181383542716485 18.981089323759079 13.631289631128313 87.025920510292053 7.0787256807088834 22.210804969072342 7.5540278851985923 7.0584897100925437 13.161067724227907 13.122231088578703 11.699519697576767 1.1892011556774362 30.795800812542439 2.3493222109973422 3.9599097333848468 317.92602893337607 4.8542351387441149 6.5121993310749522 75.139550246298313 48.812304381281137 240.65471045672894 2.813585687428712 24.419602155685425 17.900843441486359 2.7390379682183257 11.593683272600172 126.36513292789459 25.571945786476135 14.503346979618071 280.43894147872925 632.26908648014069 71.313848406076431 13.208464801311491 114.49718633294106 11.528335779905319 6.1526788026094419 57.410275489091873 53.789537489414215 35.998011350631714 6.3073915950953943 11.523698747158049 12.026170790195465 12.595547810196875 51.421075940132141 2.3435146845877171 1.6771054342389105 12.753913968801497 8.0488647967576963 3.3469207994639874 14.944742202758787 7.1128255724906921 4.2093603312969199 16.725701332092285 4.9246416948735714 2.2681079991161823 10.778246223926542 4.3327173963189125 19.820078752934933 2.7065579779446116 0.97399425506591786 5.5638250410556793 6.1338955461978912 0.97697662189602852 1.5115632005035906 15.05155658349395
leaf_count=1543 464 137 21 28 31 74 50 35 177 23 32 21 21 24 96 93 24 112 64 76 1294 12 25 499 127 815 117 70 35 48 21 197 21 15 239 521 143 14 234 29 21 93 91 58 33 21 16 26 78 28 10 33 26 122 40 19 39 20 31 35 29 270 1227 34 21 13 21 61 94 939
internal_value=0 -0.011035 -0.00012225 -0.000560991 -0.00474771 -0.0002972 0.00104111 0.00728013 0.000654346 0.0122981 0.0163298 0.00890719 0.0231407 -0.00247761 -0.0020939 -0.00262417 0.00163556 0.00359592 0.0124264 0.0158863 -0.00221721 0.0097859 -0.00128071 -0.00262285 0.00127471 -0.00348774 -0.00284452 0.00550236 -0.00545464 -0.00109039 -0.00211943 0.00106398 0.00140182 0.00371733 0.000927287 0.00120131 0.000182364 0.001368 -0.00018015 -0.00324529 -0.00886962 -0.000982758 -0.00216891 0.000246366 -0.0202248 -0.0105218 -0.00686853 -0.0121429 0.00191614 -0.0177694 -0.0129974 -0.00141701 -0.00517316 -0.0164619 -0.000670002 -0.00282941 -0.0191923 -0.00993593 -0.0199064 -0.0136159 0.00040169 -0.0241873 -0.023902 -0.0231997 -0.0168939 -0.022376 -0.00385645 -0.0247803 -0.024726 -0.0247873
internal_weight=0 151.889 2647.4 84.5535 68.9761 53.5714 1772.12 103.443 1668.67 67.4402 53.2486 31.0378 15.4349 875.286 825.719 722.93 102.789 93.358 39.3731 34.7557 705.599 23.066 18.2117 682.533 123.952 558.581 53.9848 42.7467 104.861 47.8243 36.0032 1563.81 1130.57 192.29 938.28 912.708 433.243 214.732 201.523 70.2343 49.5669 218.512 111.2 107.312 15.4047 37.2803 23.5545 25.7566 177.786 9.43135 3.53351 46.6797 15.6029 6.16051 33.9258 14.1916 17.3316 34.6265 7.08784 4.61743 24.4095 67.3355 45.4626 10.8247 2.1632 11.8712 12.2866 21.8728 2.48854 19.3843
internal_count=11171 4564 6607 430 402 315 2352 248 2104 163 121 89 42 4255 4142 3000 1142 1038 287 188 2865 130 118 2735 626 2109 751 207 223 512 85 1881 1071 290 781 760 810 425 411 168 113 385 184 201 87 71 45 50 275 104 41 123 47 239 90 42 135 55 76 99 64 4134 2770 108 45 46 42 1364 155 1209
cat_boundaries=0 1 2 3 4 5 6 7 8 9 10 11 12 13 14 15 16 17 18
cat_threshold=1 1 2 2 1 2 1 1 2 2 1 1 1 2 1 1 2 2
is_linear=0
shrinkage=0.05


Tree=112
num_leaves=60
num_cat=13
split_feature=2 3 2 3 3 1 2 1 2 0 2 2 3 2 3 3 3 3 2 2 2 2 3 2 2 3 2 2 2 2 3 2 2 3 2 3 3 2 1 1 2 1 3 3 3 3 3 1 2 1 2 0 1 3 3 2 0 1 1
split_gain=6.58911 8.25195 2.76436 2.46469 1.85409 2.75713 1.60992 1.82194 1.59453 1.52319 1.48018 2.30081 2.55428 0.827705 0.631072 2.25521 0.781673 1.19128 5.31641 1.0438 2.42087 0.933106 0.449246 0.402448 0.184984 0.179065 0.176753 0.469452 2.81667 0.963178 0.298534 0.227434 2.9078 0.394769 0.159895 0.121546 0.369671 0.0991828 0.0963703 0.0858315 0.0852929 0.0652923 0.0592293 0.0565934 0.0349743 0.0265041 0.0238021 0.0208259 0.0199778 0.0146446 0.00717386 0.00466343 0.00778529 0.00384341 0.00204368 0.000383209 3.3983e-06 7.03555e-06 6.74451e-06
threshold=1.0000000180025095e-35 1.0000000180025095e-35 69.500000000000014 28.500000000000004 2.5000000000000004 0 81.500000000000014 1 94.500000000000014 2 78.500000000000014 73.500000000000014 2.5000000000000004 64.500000000000014 23.500000000000004 22.500000000000004 3.5000000000000004 2.5000000000000004 22.500000000000004 18.500000000000004 19.500000000000004 5.5000000000000009 1.5000000000000002 91.500000000000014 78.500000000000014 4.5000000000000009 161.50000000000003 205.50000000000003 202.50000000000003 208.50000000000003 1.5000000000000002 123.50000000000001 122.50000000000001 1.5000000000000002 67.500000000000014 2.5000000000000004 10.500000000000002 150.50000000000003 3 4 14.500000000000002 5 1.5000000000000002 8.5000000000000018 8.5000000000000018 1.5000000000000002 1.0000000180025095e-35 6 75.500000000000014 7 72.500000000000014 8 9 1.5000000000000002 6.5000000000000009 68.500000000000014 10 11 12
decision_type=2 2 2 2 2 1 2 1 2 9 2 2 2 2 2 2 2 2 2 2 2 2 2 2 2 2 2 2 2 2 2 2 2 2 2 2 2 2 1 1 2 1 2 2 2 2 2 1 2 1 2 9 1 2 2 2 9 1 1
left_child=1 51 13 4 5 22 7 9 23 10 11 12 -4 14 15 16 17 21 -19 40 -21 -2 -3 25 50 45 31 28 43 -29 -31 32 33 -10 39 37 -37 -33 44 42 -18 -27 -15 -28 -6 47 -13 -8 -11 -25 -9 52 -1 -7 -40 -36 58 -58 -53
right_child=2 3 6 -5 38 53 8 24 26 48 -12 46 -14 34 -16 -17 19 18 -20 20 -22 -23 -24 49 -26 41 27 29 -30 30 -32 35 -34 -35 55 36 -38 -39 54 -41 -42 -43 -44 -45 -46 -47 -48 -49 -50 -51 -52 56 -54 -55 -56 -57 57 -59 -60
leaf_value=-0.023297827324099536 0.0025205320016725222 -0.0005966083218391687 0.040091796094127538 0.017214988733642578 -0.017625518622003487 -0.023712352847372532 -0.0018534813656369894 0.0015576161856688576 0.0023569989374141332 -0.00088755777937740568 0.025344580096503561 -0.0070963130900860913 -0.00034704134021385906 -0.014353594752807092 -0.01081116550397293 0.021784764518169502 -0.012667897968325721 0.028511874035791571 -0.0097171436379245805 0.019987934956863532 -0.0063384474771758367 -0.0027860011028724252 0.0097402017879389558 -0.0087893689801710403 -0.0072977118311899902 -0.004054049308084764 0.0011745931073979003 -0.0087110445621849403 0.024507533087738845 -0.0001882939821045031 0.0017713204690591412 0.0013182261026306627 0.023758817544178672 -0.0021096978464732893 -0.0040548413344603657 -0.0049215577197659916 0.00085296420593123159 -0.0019026083852133379 -0.022944023986189357 -0.006774326837021373 -0.019111083598174879 -0.009338000983016374 -0.0095280866081088548 0.0030155019707168913 -0.0076014122338537056 -0.0033310279581445466 -0.0031782227434770279 0.00062628639424742365 -0.0046448362315277851 -0.010857398750064773 -0.00023829821303179103 -0.024730567577078005 -0.024633278481186679 -0.021512450874752474 -0.021614628877917826 -0.0034952897422006165 -0.024654959264978529 -0.024829265623257272 -0.024802243462171115
leaf_weight=25.051170453429222 97.808723732829094 18.315899416804314 8.7439801990985888 15.859939292073248 1.8237426094710829 7.927694868296383 17.501605480909348 8.5641270875930804 87.237035840749741 7.072291895747183 22.811875998973846 7.4996545612812033 7.0559790134429923 12.971551626920702 20.040403284132481 9.9858306944370252 9.6513843685388583 16.369937771931291 20.462217085063457 9.6984455063939077 87.65665290504694 541.36716458201408 24.667262673377991 17.74166539311409 11.507891178131102 11.480708539485931 111.32970345020294 25.346553981304169 14.882354974746702 280.38480770587921 633.42071986198425 71.410447299480438 13.542679488658903 114.25028932094574 6.127254977822302 57.122725069522858 53.836648792028427 35.927984207868576 6.1640581600368005 11.444476574659346 10.979359067976473 11.912650853395462 12.474268227815626 66.797568678855896 1.6641844809055326 12.710572361946104 8.0227610468864423 16.401529759168625 7.0791885405778885 16.542555332183838 15.855225145816801 4.226871058344841 19.337717525660992 2.6487675867974758 5.4444799199700356 6.1120283603668213 1.4747450351715115 0.95301768463104974 14.682825637981297
leaf_count=1543 1088 137 21 28 31 74 55 25 177 23 32 21 21 24 39 3 86 81 80 5 332 2401 70 35 21 29 173 21 15 239 521 143 14 234 21 93 91 58 33 21 27 16 26 102 10 33 26 35 19 20 39 270 1227 34 13 21 94 61 939
internal_value=0 -0.0108838 -0.000119824 -0.000550235 -0.0046541 -0.000291807 0.00101374 0.00704302 0.000637448 0.0118384 0.0156565 0.00860073 0.0220325 -0.00242291 -0.00204702 -0.00182856 -0.00212553 -0.00147012 0.00727363 -0.00588075 -0.00371583 -0.00197398 0.0053355 -0.00534884 -0.00207141 -0.00317525 0.00103625 0.00136493 0.00361083 0.00090337 0.00117005 0.000177483 0.00133164 -0.000175773 -0.00872756 -0.000959395 -0.0021198 0.000240158 -0.0201308 -0.0103706 -0.0160969 -0.00674481 -0.011988 0.00186493 -0.0128427 -0.00138384 -0.00507125 -0.000653829 -0.00276711 -0.00978722 0.000391548 -0.0241716 -0.0238796 -0.0231614 -0.0223205 -0.00377541 -0.0247791 -0.0247234 -0.0247862
internal_weight=0 150.242 2647.14 84.516 68.6561 53.5596 1773.99 104.213 1669.78 68.2857 54.1343 31.3224 15.8 873.15 824.02 803.98 793.994 676.008 36.8322 117.986 97.3551 639.176 42.9832 104.291 35.9272 70.0071 1565.49 1132.16 193.01 939.152 913.806 433.328 215.03 201.487 49.1296 218.298 110.959 107.338 15.0965 36.8903 20.6307 23.3934 25.4458 178.127 3.48793 46.6137 15.5224 33.9031 14.1515 34.2842 24.4194 65.7263 44.3889 10.5765 11.6085 12.2393 21.3375 2.42776 18.9097
internal_count=11171 4564 6607 430 402 315 2352 248 2104 163 121 89 42 4255 4142 4103 4100 3650 161 450 337 3489 207 223 85 168 1881 1071 290 781 760 810 425 411 113 385 184 201 87 71 113 45 50 275 41 123 47 90 42 55 64 4134 2770 108 46 42 1364 155 1209
cat_boundaries=0 1 2 3 4 5 6 7 8 9 10 11 12 13
cat_threshold=1 1 2 2 1 1 1 1 2 1 1 1 2
is_linear=0
shrinkage=0.05


Tree=113
num_leaves=60
num_cat=12
split_feature=2 3 2 3 3 1 2 1 2 0 3 2 2 3 3 3 3 2 2 2 2 3 2 2 3 2 2 2 2 2 3 2 3 3 3 2 2 2 2 1 1 2 1 3 3 3 3 2 1 3 2 0 1 3 3 2 0 1 1
split_gain=6.34393 8.13461 2.63311 2.31566 1.80852 2.67115 1.51583 1.70209 1.52209 1.41178 1.4012 3.70375 0.797686 0.609115 2.10581 0.750711 1.12714 4.92373 1.01879 2.27881 0.889345 0.420971 0.394202 0.391535 0.223033 0.177529 0.167695 0.443602 2.59749 0.922225 0.283102 0.216634 0.308704 4.50893 0.7569 0.199848 0.241379 0.155624 0.101508 0.0969091 0.0892177 0.0851346 0.0840691 0.0584086 0.0535333 0.0345666 0.0205669 0.019159 0.0145563 0.00865043 0.00711351 0.00477275 0.00795972 0.00391605 0.00207917 0.000368632 3.48286e-06 7.21043e-06 6.91269e-06
threshold=1.0000000180025095e-35 1.0000000180025095e-35 69.500000000000014 28.500000000000004 2.5000000000000004 0 81.500000000000014 1 94.500000000000014 2 1.0000000180025095e-35 79.500000000000014 64.500000000000014 23.500000000000004 22.500000000000004 3.5000000000000004 2.5000000000000004 22.500000000000004 18.500000000000004 19.500000000000004 5.5000000000000009 1.5000000000000002 75.500000000000014 92.500000000000014 3.5000000000000004 78.500000000000014 161.50000000000003 205.50000000000003 202.50000000000003 208.50000000000003 1.5000000000000002 147.50000000000003 4.5000000000000009 5.5000000000000009 1.5000000000000002 152.50000000000003 150.50000000000003 67.500000000000014 72.500000000000014 3 4 14.500000000000002 5 1.5000000000000002 13.500000000000002 8.5000000000000018 1.5000000000000002 75.500000000000014 6 3.5000000000000004 73.500000000000014 7 8 1.5000000000000002 6.5000000000000009 68.500000000000014 9 10 11
decision_type=2 2 2 2 2 1 2 1 2 9 2 2 2 2 2 2 2 2 2 2 2 2 2 2 2 2 2 2 2 2 2 2 2 2 2 2 2 2 2 1 1 2 1 2 2 2 2 2 1 2 2 9 1 2 2 2 9 1 1
left_child=1 51 12 4 5 21 7 9 23 10 22 38 13 14 15 16 20 -18 41 -20 -2 -3 -4 24 46 50 31 28 44 -29 -31 32 34 -34 -10 36 -33 42 -12 45 -26 -17 43 -14 -28 -6 48 -11 -8 -37 -9 52 -1 -7 -41 -39 58 -58 -53
right_child=2 3 6 -5 39 53 8 25 26 47 11 -13 37 -15 -16 18 17 -19 19 -21 -22 -23 -24 -25 40 -27 27 29 -30 30 -32 35 33 -35 -36 49 -38 55 -40 54 -42 -43 -44 -45 -46 -47 -48 -49 -50 -51 -52 56 -54 -55 -56 -57 57 -59 -60
leaf_value=-0.023261726957954122 0.0024516829993330986 -0.0005821441267247038 0.031069500582246053 0.016497392461398697 -0.017497423479476467 -0.023685552077948716 -0.0017747394724771091 -0.00037725626195663007 0.0018121518288889442 -0.00086629871408656174 0.00034473532287835067 0.035367503389489824 -0.014202146678388773 -0.01065879083461178 0.02078026792909974 -0.012512858889722329 0.027012494163197804 -0.0095695813750952055 0.019101026557516044 -0.0062208721537790369 -0.0027245030113481265 0.0094051229403739195 0.018475972091532619 -0.010570342888640529 -0.0041625483456758979 -0.0071693037982484874 0.0012617609871135244 -0.0085700249957795689 0.023313104708606407 -0.00018365380187432051 0.0017242439783939076 -0.0010906205671600327 0.03356472368826019 -0.00020610398089047503 -0.0042343183416708166 0.00027197421768555049 -0.010026095435527401 -0.0039704333615773633 -0.0068356003128085168 -0.022900268691287973 -0.0096350188451328825 -0.019000751835176251 -0.0066516015892626379 -0.0093815988088976447 0.0031702666126880389 -0.0074699571013879494 -0.0033798605029043724 -0.0045508646813032672 0.00018339417846449687 -0.0010003545818919682 0.0013408956734780794 -0.02480156345618878 -0.02462839212812401 -0.021440324963648449 -0.021544388775391145 -0.0034205908491687972 -0.02482926632076779 -0.024650608688771149 -0.024728095964411785
leaf_weight=24.474280213937163 98.055564094334841 18.304975606501102 10.267474949359896 16.135331377387047 1.7918798197060826 7.7419217601418477 19.756063848733902 13.638467609882357 142.0979445874691 7.0660175532102567 8.1654844582080894 8.4322493076324445 12.786693185567858 19.824910245835781 10.205757170915602 9.5298928543925303 16.843392763286829 20.264345459640026 9.8942475244402868 87.102802999317646 539.86101349070668 24.908701777458191 15.739407747983931 25.895032674074173 15.045157998800278 11.424215316772459 126.71045869588852 25.126717448234558 15.251590847969053 280.33201915025711 634.54370576143265 15.854180514812471 10.81823220849037 114.44752106070518 81.410618185997009 30.668520867824554 14.443282604217528 6.1024602651596052 12.391927123069761 6.0242399834096414 14.748712688684464 10.771523885428904 11.367210149765013 12.35597689449787 51.749390661716461 1.6515823006629942 10.025094598531721 7.0463832169771194 18.265758872032166 23.669603526592255 10.790456920862196 14.323138020001348 18.86718472559005 2.5923946350812912 5.3280624598264694 6.0907024145126343 0.92964628338813782 1.4388298019766836 4.1236200090497777
leaf_count=1543 1088 137 21 28 31 74 62 35 288 23 28 7 24 39 3 86 81 80 5 332 2401 70 32 39 36 21 197 21 15 239 521 26 16 228 146 53 16 21 33 33 20 27 21 26 78 10 27 19 39 37 29 939 1227 34 13 21 61 94 270
internal_value=0 -0.0107331 -0.000117348 -0.000539618 -0.0045619 -0.000286476 0.000987141 0.00681555 0.000621005 0.0114016 0.0150217 0.00746253 -0.00236907 -0.00200084 -0.00178697 -0.00207765 -0.00143608 0.00703521 -0.00576971 -0.0036379 -0.00192886 0.00517459 0.0234479 -0.00524453 -0.0034728 -0.00202437 0.00100927 0.00132907 0.00350779 0.000880091 0.00113963 0.000172746 0.000723412 0.00271042 -0.000390211 -0.00209649 -0.0053503 -0.00858654 -0.00398354 -0.0200353 -0.00687156 -0.0159552 -0.0102199 -0.0118332 0.00181519 -0.012688 -0.00136524 -0.00270602 -0.000834048 -0.00028225 0.000381666 -0.0241555 -0.0238567 -0.0231223 -0.0222639 -0.00369578 -0.0247778 -0.0247207 -0.0247851
internal_weight=0 148.636 2646.88 84.4791 68.3438 53.548 1775.82 104.962 1670.86 69.1089 54.9965 28.9897 871.056 822.353 802.529 792.323 675.024 37.1077 117.298 96.9971 637.917 43.2137 26.0069 103.736 77.8408 35.8531 1567.12 1133.71 193.711 940.002 914.876 433.41 348.774 125.266 223.509 84.6356 30.2975 48.703 20.5574 14.7958 29.7939 20.3014 36.5099 25.1427 178.46 3.44346 48.0469 14.1124 38.0218 54.3381 24.4289 64.1567 43.3415 10.3343 11.3523 12.1932 20.8152 2.36848 18.4468
internal_count=11171 4564 6607 430 402 315 2352 248 2104 163 121 68 4255 4142 4103 4100 3650 161 450 337 3489 207 53 223 184 85 1881 1071 290 781 760 810 678 244 434 132 42 113 61 87 56 113 71 50 275 41 128 42 101 90 64 4134 2770 108 46 42 1364 155 1209
cat_boundaries=0 1 2 3 4 5 6 7 8 9 10 11 12
cat_threshold=1 1 2 2 1 1 1 2 1 1 2 1
is_linear=0
shrinkage=0.05


Tree=114
num_leaves=60
num_cat=14
split_feature=2 3 2 3 3 1 2 1 2 0 2 3 2 3 3 3 3 2 2 2 2 3 2 2 3 0 2 2 1 2 2 2 2 3 1 2 3 3 1 2 2 1 2 3 3 2 3 2 2 1 2 0 1 3 3 2 0 1 1
split_gain=6.10682 8.01758 2.50796 2.17701 1.76373 2.58816 1.42779 1.59123 1.45284 1.30996 1.29954 1.04511 0.768572 0.587781 1.96816 0.720834 1.0667 4.56745 0.99405 2.14661 0.847604 0.39467 0.380312 0.170345 0.165909 0.16504 0.222529 1.28222 3.37501 0.305038 0.157361 0.15141 0.127148 0.11748 0.0974209 0.0849418 0.0827348 0.0760566 0.0613969 0.0463153 0.117895 0.038475 0.0383325 0.0341493 0.026244 0.0256512 0.0238237 0.0202876 0.0183704 0.0142725 0.0070415 0.00488442 0.00813746 0.00398951 0.00211491 0.000354523 3.56975e-06 7.38951e-06 7.08508e-06
threshold=1.0000000180025095e-35 1.0000000180025095e-35 69.500000000000014 28.500000000000004 2.5000000000000004 0 81.500000000000014 1 94.500000000000014 2 72.500000000000014 1.0000000180025095e-35 64.500000000000014 23.500000000000004 22.500000000000004 3.5000000000000004 2.5000000000000004 22.500000000000004 18.500000000000004 19.500000000000004 5.5000000000000009 1.5000000000000002 91.500000000000014 78.500000000000014 4.5000000000000009 3 119.50000000000001 123.50000000000001 4 157.50000000000003 248.50000000000003 67.500000000000014 77.500000000000014 10.500000000000002 5 14.500000000000002 2.5000000000000004 1.0000000180025095e-35 6 113.50000000000001 123.50000000000001 7 305.50000000000006 8.5000000000000018 22.500000000000004 102.50000000000001 1.5000000000000002 86.500000000000014 75.500000000000014 8 72.500000000000014 9 10 1.5000000000000002 6.5000000000000009 68.500000000000014 11 12 13
decision_type=2 2 2 2 2 1 2 1 2 9 2 2 2 2 2 2 2 2 2 2 2 2 2 2 2 9 2 2 1 2 2 2 2 2 1 2 2 2 1 2 2 1 2 2 2 2 2 2 2 1 2 9 1 2 2 2 9 1 1
left_child=1 51 12 4 5 21 7 9 22 10 -4 32 13 14 15 16 20 -18 35 -20 -2 -3 24 50 46 26 33 28 -28 -29 39 36 -12 37 43 -17 -14 -10 -26 45 -41 -35 -32 -6 -44 -27 47 -8 -11 -24 -9 52 -1 -7 -36 -33 58 -58 -53
right_child=2 3 6 -5 34 53 8 23 25 48 11 -13 31 -15 -16 18 17 -19 19 -21 -22 -23 49 -25 38 30 27 29 -30 -31 42 55 -34 41 54 -37 -38 -39 -40 40 -42 -43 44 -45 -46 -47 -48 -49 -50 -51 -52 56 -54 -55 -56 -57 57 -59 -60
leaf_value=-0.023224838311241003 0.0023848806118398555 -0.00056802662102956958 -0.0015840177410218273 0.015821201689852366 -0.017368006051489911 -0.023658138679767064 -0.0017052794018411498 0.00152648858037154 0.00017451995461373272 -0.00084553063211390391 0.029050035568576205 0.0098881760162005446 -0.011855395788632012 -0.010506943103178954 0.019842269696386847 -0.012357777320328519 0.02563086430764501 -0.0094228515733537528 0.018269876393791556 -0.0061047509790697245 -0.0026641964630032492 0.0090846535156568053 -0.0085122971660417535 -0.0070422391395021161 -0.0038826442625629915 -0.0014261519807270283 0.022517943425456814 -0.0009359940703614737 -0.0051645216472310613 0.001478859506020302 0.0025579986000825814 -0.0038874501974914648 0.021807580308978333 0.00085580188864670538 -0.022855584789192165 -0.018888946987977714 -0.0068644008765748783 -0.0026182324959448233 -0.0090412790675016563 -0.005564759439168605 -0.00095112299212021768 0.004902903487171182 0.0011429515838642019 -0.0073397982168048994 -0.00036791038462900914 0.0017818100664220246 -0.0031639428950450232 0.00075996207488080358 -0.0044583700905206618 -0.010573054077541871 -0.00025192655892240486 -0.024800867733370053 -0.024623383352263051 -0.021366880968803289 -0.021472851175928356 -0.0033472350607546804 -0.024646149871798823 -0.024829265333027088 -0.024725563901549879
leaf_weight=23.911536104977131 98.296259496361017 18.294322961941361 10.333642929792402 16.403730541467667 1.7607992663979533 7.5607047975063306 18.923071384429932 8.5742416381835955 40.77818900346756 7.0598989874124509 11.072839647531511 21.043323412537575 23.210428059101105 19.614722661674023 10.4200541973114 9.4113895706832427 17.304575763642788 20.07134922593832 10.085053794085978 86.562629222869873 538.39216151461005 25.144076585769653 17.440401315689087 11.342604756355284 11.386762738227844 9.2241070568561572 23.983926951885223 152.78980830311775 20.354918986558914 907.44000518321991 34.371666193008423 6.0782789438962919 13.386216819286345 16.536964982748032 5.8878508545458299 10.568789035081862 12.928401067852972 60.619353204965591 11.688762634992599 15.624881893396376 121.67482605576515 9.1064980328083056 95.978537082672119 1.6392910107970236 41.029080629348755 19.206960290670395 12.6125470995903 14.929964303970335 7.0143888294696808 16.212608993053436 15.864017158746718 13.972270729020234 18.408191241323948 2.5374044142663479 5.2145000696182251 6.0699042081832886 1.4037953522056368 0.90684804506599914 4.0229011327028319
leaf_count=1543 1088 137 34 28 31 74 50 25 93 23 23 40 44 39 3 86 81 80 5 332 2401 70 35 21 29 24 20 269 27 864 39 21 24 40 33 27 27 131 16 27 187 18 70 10 27 45 33 40 19 20 39 939 1227 34 13 21 94 61 270
internal_value=0 -0.0105829 -0.000114928 -0.000529145 -0.0044711 -0.000281211 0.000961241 0.00659725 0.000604957 0.0109863 0.0144226 0.0180577 -0.00231628 -0.0019556 -0.00174623 -0.00203073 -0.00140277 0.00680657 -0.00566012 -0.00356129 -0.00188469 0.00501937 -0.00514172 -0.0019783 -0.00303016 0.000982987 0.0012513 0.00147923 0.00980958 0.00113085 2.72378e-06 -0.0084466 0.0250863 -0.000730459 -0.0199383 -0.0158125 -0.0100699 -0.00149509 -0.00649572 -0.0010958 -0.00147616 0.00229301 0.00106504 -0.0125331 0.0006905 0.000741027 -0.0013091 -0.000618051 -0.00264611 -0.00950508 0.000372036 -0.024139 -0.0238332 -0.0230824 -0.0222061 -0.00361753 -0.0247765 -0.024718 -0.024784
internal_weight=0 147.068 2646.62 84.4427 68.0389 53.5365 1777.61 105.691 1671.91 69.9103 55.836 45.5024 869.014 820.727 801.112 790.692 674.064 37.3759 116.628 96.6477 636.688 43.4384 103.194 35.7809 69.5411 1568.72 1231.61 1104.57 44.3388 1060.23 337.11 48.287 24.4591 127.041 14.5024 19.9802 36.1388 101.398 23.0755 165.731 137.3 25.6435 171.379 3.40009 137.008 28.4311 46.4656 33.853 14.0743 33.653 24.4383 62.6255 42.3197 10.0981 11.1024 12.1482 20.3058 2.31064 17.9952
internal_count=11171 4564 6607 430 402 315 2352 248 2104 163 121 87 4255 4142 4103 4100 3650 161 450 337 3489 207 223 85 168 1881 1462 1180 47 1133 419 113 47 282 87 113 71 224 45 283 214 58 136 41 97 69 123 90 42 55 64 4134 2770 108 46 42 1364 155 1209
cat_boundaries=0 1 2 3 4 5 6 7 8 9 10 11 12 13 14
cat_threshold=1 1 2 2 1 2 1 1 1 2 1 1 1 1
is_linear=0
shrinkage=0.05


Tree=115
num_leaves=61
num_cat=14
split_feature=2 3 2 1 3 3 2 1 2 0 2 2 3 2 3 3 3 3 2 2 2 2 3 2 3 3 2 0 2 2 1 2 2 2 3 1 2 1 3 3 2 2 3 2 1 3 3 2 3 2 1 2 0 1 3 3 2 0 1 1
split_gain=5.87767 7.90087 2.38887 2.11115 2.0424 2.53884 1.34567 1.48893 1.38668 1.21704 1.20655 2.12157 3.00111 0.74034 0.567061 1.84111 0.692012 1.00971 4.24327 0.969595 2.02339 0.807791 0.552714 0.3702 0.370186 0.208043 0.163425 0.156563 0.211171 1.20311 3.12217 0.290465 0.149652 0.147254 0.111707 0.0850256 0.0847145 0.0832683 0.0726165 0.0569511 0.0444825 0.119878 0.040847 0.0362929 0.0362891 0.0353495 0.0249199 0.0224892 0.0190604 0.0176112 0.014007 0.00698319 0.00499851 0.00831863 0.00406378 0.00215089 0.000340873 3.65877e-06 7.573e-06 7.26206e-06
threshold=1.0000000180025095e-35 1.0000000180025095e-35 69.500000000000014 0 28.500000000000004 2.5000000000000004 81.500000000000014 1 94.500000000000014 2 78.500000000000014 73.500000000000014 1.5000000000000002 64.500000000000014 23.500000000000004 22.500000000000004 3.5000000000000004 2.5000000000000004 22.500000000000004 18.500000000000004 19.500000000000004 5.5000000000000009 14.500000000000002 92.500000000000014 1.5000000000000002 3.5000000000000004 78.500000000000014 3 119.50000000000001 123.50000000000001 4 161.50000000000003 248.50000000000003 67.500000000000014 10.500000000000002 5 14.500000000000002 6 1.0000000180025095e-35 1.5000000000000002 115.50000000000001 125.50000000000001 2.5000000000000004 305.50000000000006 7 1.0000000180025095e-35 22.500000000000004 102.50000000000001 1.5000000000000002 75.500000000000014 8 73.500000000000014 9 10 1.5000000000000002 6.5000000000000009 68.500000000000014 11 12 13
decision_type=2 2 2 1 2 2 2 1 2 9 2 2 2 2 2 2 2 2 2 2 2 2 2 2 2 2 2 9 2 2 1 2 2 2 2 1 2 1 2 2 2 2 2 2 1 2 2 2 2 2 1 2 9 1 2 2 2 9 1 1
left_child=1 52 13 4 5 24 7 9 23 10 11 12 -4 14 15 16 17 21 -19 36 -21 -2 42 25 -3 48 51 28 34 30 -30 -31 40 37 38 -27 -18 39 -10 -15 47 -42 54 -34 -36 -13 -45 -29 50 -11 -8 -9 53 -1 -5 -7 -35 59 -59 -54
right_child=2 3 6 22 -6 55 8 26 27 49 -12 45 -14 33 -16 -17 19 18 -20 20 -22 -23 -24 -25 -26 35 -28 32 29 31 -32 -33 43 56 44 -37 -38 -39 -40 -41 41 -43 -44 46 -46 -47 -48 -49 -50 -51 -52 -53 57 -55 -56 -57 -58 58 -60 -61
leaf_value=-0.023187139924080405 0.0023200558124569361 -0.00055424009282165965 0.04141062768005388 -0.023630102843721912 0.022319208559770529 -0.022809955777662882 -0.0017008579103901167 -0.00038922655708980457 0.00017015675219298623 -0.00082524300822289949 0.022278773534623882 -0.0078946134749659329 -0.0012647896682636639 -0.013921590695139886 -0.01035566600454284 0.018964622035154154 -0.012202701326691108 0.024353962084383108 -0.0092769931020554725 0.017489609144286846 -0.0059900928311813414 -0.0026050656273648529 -0.0025675825469757998 -0.010279996987755073 0.00877795451400268 -0.0039807035552269238 -0.006916536507336677 -0.0013927517759064181 0.021463696141685674 -0.00078910643560128283 -0.0050626998692633075 0.0014633645111425428 0.0024880315775007212 -0.003805881462803785 0.00083383000639923165 -0.0093590722239671586 -0.018775674220637723 -0.0063419302487016591 -0.0025600026266801908 -0.0091096671988884544 -0.0054536101615417984 -0.0009028515922701718 -0.015956127999037957 0.0011132835796561315 0.0047574864365050717 -0.0031755022425006031 -0.00035890915741671505 0.0015714981493223264 -0.0032342064650269162 -0.0043673464064229754 0.00022222766876025401 0.0013124127512980708 -0.024722967286960613 -0.02461824958963902 -0.021292104985857943 -0.021399999467599143 -0.0032752091191099401 -0.024641580619159831 -0.024829264639904453 -0.024800154869276267
leaf_weight=23.362593239173293 98.530965283513069 18.283934069797397 8.2506188452243823 7.383931543678047 11.941416472196577 5.7548067495226842 19.692955106496811 13.645147591829302 40.785306453704834 7.0539320856332761 24.296479940414429 7.8531890213489524 8.2282496094703657 12.457807064056398 19.409710645675659 10.628876179456709 9.29580130800605 17.75383985042572 19.88310818374157 10.271000176668165 86.035795733332634 536.95968632400036 5.5194880664348593 25.378269851207733 25.373541593551636 14.913931369781494 11.263007819652556 9.2109614610672015 24.530122220516205 170.51879769563675 20.250066429376602 890.91104185581207 34.459701299667358 6.0546956658363325 16.551123410463333 14.485634714365005 10.371029399335383 11.176804095506666 60.460845321416855 12.142231985926626 16.476832300424576 118.90518805384636 2.5622008740901938 96.088298618793488 9.1512558758258837 8.0217530727386457 41.013988018035889 20.956521570682526 9.957477539777754 6.9831856936216354 18.237444221973419 10.80221366882324 3.9246523194015026 17.960454817861319 2.4837630465626717 5.1037235036492348 6.0496207624673843 1.3696201499551561 0.88460893742740165 13.630007760599257
leaf_count=1543 1088 137 17 74 18 33 62 35 93 23 32 21 25 24 39 3 86 81 80 5 332 2401 14 39 70 36 21 24 20 299 27 834 39 21 40 20 27 21 131 26 29 182 37 70 18 26 27 48 27 19 39 29 270 1227 34 13 21 94 61 939
internal_value=0 -0.0104331 -0.000112458 -0.000518817 0.00359073 -0.000511638 0.000936187 0.00638854 0.00058942 0.0105926 0.0138584 0.00753498 0.0201019 -0.00226453 -0.00191128 -0.00170634 -0.00198477 -0.00137017 0.00658717 -0.00555198 -0.00348601 -0.00184144 -0.0157344 -0.00504039 0.00486959 -0.0033199 -0.00193319 0.000957503 0.00121854 0.00144019 0.00946818 0.0011015 2.61827e-06 -0.00830773 -0.000712905 -0.00663071 -0.0156689 -0.00992057 -0.0014602 -0.0115465 -0.00106982 -0.00145671 -0.0215811 0.00103747 0.00223084 -0.00551 0.000672879 0.000666431 -0.00128731 -0.00258737 -0.000776213 0.000362653 -0.0241222 -0.0238092 -0.0230416 -0.0221472 -0.00354066 -0.0247752 -0.0247152 -0.0247829
internal_weight=0 145.539 2646.35 84.4068 66.4574 54.516 1779.33 106.398 1672.94 70.6874 56.6503 32.3538 16.4789 867.021 819.14 799.73 789.101 673.128 37.6369 115.974 96.3068 635.491 17.9494 102.666 43.6575 77.2874 35.7104 1570.27 1233.16 1106.21 44.7802 1061.43 337.111 47.8812 126.949 29.3996 19.6668 35.7768 101.246 24.6 165.55 135.382 12.4299 171.562 25.7024 15.8749 137.102 30.1675 47.8879 14.0371 37.9304 24.4474 61.1319 41.323 9.86769 10.8585 12.1043 19.8089 2.25423 17.5547
internal_count=11171 4564 6607 430 271 253 2352 248 2104 163 121 89 42 4255 4142 4103 4100 3650 161 450 337 3489 159 223 207 184 85 1881 1462 1180 47 1133 419 113 282 56 113 71 224 50 283 211 145 136 58 47 97 72 128 42 101 64 4134 2770 108 46 42 1364 155 1209
cat_boundaries=0 1 2 3 4 5 6 7 8 9 10 11 12 13 14
cat_threshold=1 1 2 2 1 1 1 1 1 2 1 1 1 2
is_linear=0
shrinkage=0.05


Tree=116
num_leaves=60
num_cat=13
split_feature=2 3 2 1 3 3 2 1 2 0 2 3 2 3 3 3 3 3 2 2 2 2 2 3 2 3 0 2 2 3 2 2 1 2 2 2 2 1 1 3 2 2 3 2 3 2 3 2 2 1 2 0 1 3 3 2 0 1 1
split_gain=5.6563 7.78436 2.27526 2.0335 1.89272 2.45881 1.26802 1.39347 1.32347 1.13129 1.18195 0.898959 0.712985 0.547277 0.546942 1.72365 0.664216 0.955959 3.94752 0.945432 1.9084 0.769819 0.35896 0.347377 0.15676 0.15355 0.148533 0.212994 3.47616 0.47109 0.435246 0.455945 0.263605 0.143161 0.14232 0.123171 0.0844529 0.0814495 0.0576331 0.0560888 0.0423807 0.114911 0.0412947 0.0343658 0.0236636 0.0215268 0.0213756 0.0194127 0.0168805 0.0138935 0.00691211 0.00511505 0.0085033 0.00413883 0.00218709 0.000327672 3.74983e-06 7.76115e-06 7.44285e-06
threshold=1.0000000180025095e-35 1.0000000180025095e-35 69.500000000000014 0 28.500000000000004 2.5000000000000004 81.500000000000014 1 94.500000000000014 2 72.500000000000014 1.0000000180025095e-35 64.500000000000014 14.500000000000002 23.500000000000004 22.500000000000004 3.5000000000000004 2.5000000000000004 22.500000000000004 18.500000000000004 19.500000000000004 5.5000000000000009 91.500000000000014 1.5000000000000002 78.500000000000014 4.5000000000000009 3 316.50000000000006 312.50000000000006 2.5000000000000004 490.00000000000006 456.50000000000006 4 67.500000000000014 248.50000000000003 77.500000000000014 14.500000000000002 5 6 1.5000000000000002 115.50000000000001 125.50000000000001 2.5000000000000004 305.50000000000006 22.500000000000004 108.50000000000001 1.5000000000000002 86.500000000000014 75.500000000000014 7 72.500000000000014 8 9 1.5000000000000002 6.5000000000000009 68.500000000000014 10 11 12
decision_type=2 2 2 1 2 2 2 1 2 9 2 2 2 2 2 2 2 2 2 2 2 2 2 2 2 2 9 2 2 2 2 2 1 2 2 2 2 1 1 2 2 2 2 2 2 2 2 2 2 1 2 9 1 2 2 2 9 1 1
left_child=1 51 12 4 5 23 7 9 22 10 -4 35 14 42 15 16 17 21 -19 36 -21 -2 25 -3 50 46 27 28 29 -10 31 -29 -32 37 40 -12 -18 39 -27 -14 45 -42 53 -36 -45 -28 47 -8 -11 -24 -9 52 -1 -5 -7 -35 58 -58 -53
right_child=2 3 6 13 -6 54 8 24 26 48 11 -13 33 -15 -16 -17 19 18 -20 20 -22 -23 49 -25 -26 38 34 30 -30 -31 32 -33 -34 55 43 -37 -38 -39 -40 -41 41 -43 -44 44 -46 -47 -48 -49 -50 -51 -52 56 -54 -55 -56 -57 57 -59 -60
leaf_value=-0.023148619059033721 0.0022571401120901721 -0.00054078290468734724 -0.0018756438454778667 -0.02360142712031801 0.021278547106827087 -0.022763365727045431 -0.0016499616379240406 0.0014965321534499418 0.0025111782927483765 -0.00080542577340373702 0.026876689354089836 0.009171343490870577 -0.013768676528235263 -0.0025103500585668004 -0.010205003331945548 0.018141913199075092 -0.012047679256674902 0.023170622251745182 -0.0091320434643959638 0.016755902842774614 -0.0058769057243208793 -0.0025470944916491304 -0.0082392685741616862 0.0084842407290305604 -0.0067922129579150838 -0.0037172845055973023 -0.00019859351929383398 -0.00019069079400006489 0.026450820039199293 5.2178831311150615e-05 0.0004031440875209379 -0.0060610905998626898 0.0038638858398271272 -0.0037257163984202126 0.0024201497734002522 0.019894758009155154 -0.01866094000561451 -0.0062243123123940473 -0.0087480854252271235 -0.0089658125305205512 -0.0053476541642775832 -0.00088123986594518223 -0.01581341136563896 0.0010844182302234217 -0.00035012495281227103 0.0027516864263673248 -0.0030029988783907917 0.00076288518390030952 -0.0042777867188024997 -0.010291014362378824 -0.00026465780179704853 -0.024720308270141558 -0.024612991540650525 -0.021215984037011297 -0.021325821312605027 -0.0032044994061676576 -0.024829266471762059 -0.0246368988717716 -0.024799423400542708
leaf_weight=22.827113914303482 98.759827652946115 18.273803621530533 10.464931964874266 7.2114944569766539 12.210936069488524 5.6250258106738311 18.877911508083344 8.5839985013008135 375.03122642636299 7.0481133460998517 11.538261324167253 21.486978217959404 12.285576164722444 5.5053346753120413 19.209747642278671 10.832372501492499 9.183056693524124 18.191524241119623 19.699505679309368 10.452216379344462 85.521973982453346 535.56269482895732 17.153377413749695 25.597251176834106 11.185375809669493 11.297575712203979 21.510625034570698 172.38369292020798 13.910304069519041 405.22605779767036 133.6604722738266 40.929730653762817 93.526997208595276 6.0316962003707868 34.545544743537903 13.958738863468168 10.178122982382773 11.106145888566969 11.475652009248734 12.032122626900671 16.387218624353409 118.79788258671761 2.5216425098478785 96.195331156253815 40.999270439147949 8.6769974231719953 12.519544064998625 14.928259104490278 6.9527541846036911 15.898086845874785 15.872238904237745 3.8288127165287733 17.523697771131992 2.4314375333487988 4.9956643953919411 6.0298393815755844 0.86291515547782183 1.3362829219549923 13.296139231882991
leaf_count=1543 1088 137 34 74 18 33 50 25 576 23 23 40 24 14 39 3 86 81 80 5 332 2401 35 70 21 29 54 140 8 587 82 22 47 21 39 24 27 21 16 26 29 182 37 70 27 18 33 40 19 20 39 270 1227 34 13 21 61 94 939
internal_value=0 -0.0102841 -0.000110076 -0.000508958 0.00348623 -0.000500811 0.000911744 0.00618635 0.000574296 0.0102146 0.0133206 0.0167053 -0.00221381 -0.0155905 -0.00186787 -0.00166727 -0.00193974 -0.00133827 0.0063765 -0.0054453 -0.00341204 -0.00179911 -0.00494056 0.00472501 -0.00188903 -0.00289066 0.000932708 0.00118669 0.00167578 0.0012341 0.000304906 -0.00131708 0.00182784 -0.00817003 2.51664e-06 0.0230543 -0.0155243 -0.00977201 -0.00625235 -0.0113923 -0.00104442 -0.00142266 -0.0215102 0.00101063 0.000655719 0.000649422 -0.00123809 -0.000584487 -0.00252978 -0.00922618 0.00035351 -0.0241049 -0.0237846 -0.0229999 -0.0220872 -0.00346515 -0.0247738 -0.0247124 -0.0247817
internal_weight=0 144.048 2646.1 84.3726 66.7027 54.4917 1781.02 107.091 1673.93 71.4498 57.4489 46.984 865.076 17.6699 817.591 798.381 787.549 672.214 37.891 115.335 95.9742 634.323 102.15 43.8711 35.6416 69.0989 1571.78 1234.67 794.168 780.257 440.501 213.313 227.187 47.4854 337.113 25.497 19.3612 35.4238 22.7732 24.3177 165.373 135.185 12.1646 171.74 137.195 30.1876 46.3257 33.8062 14.0009 33.0515 24.4562 59.675 40.3508 9.64293 10.6207 12.0615 19.3242 2.1992 17.125
internal_count=11171 4564 6607 430 271 253 2352 248 2104 163 121 87 4255 159 4142 4103 4100 3650 161 450 337 3489 223 207 85 168 1881 1462 1171 1163 291 162 129 113 419 47 113 71 45 50 283 211 145 136 97 72 123 90 42 55 64 4134 2770 108 46 42 1364 155 1209
cat_boundaries=0 1 2 3 4 5 6 7 8 9 10 11 12 13
cat_threshold=1 1 2 2 1 1 1 1 2 1 1 2 2
is_linear=0
shrinkage=0.05


Tree=117
num_leaves=57
num_cat=14
split_feature=2 3 2 1 3 3 2 1 2 0 2 3 2 3 3 3 3 2 2 3 2 2 2 3 3 2 2 2 1 2 2 2 3 2 3 2 1 3 3 0 1 3 1 3 2 1 2 2 0 1 3 3 2 0 1 1
split_gain=5.44239 7.66828 2.16707 1.95864 1.75606 2.38148 1.19576 1.30537 1.26305 1.05294 1.09225 0.813145 0.686483 0.541746 0.527413 1.61491 0.637416 0.921573 1.80094 0.905238 3.67706 0.733606 0.349605 0.326115 0.193912 0.150343 0.144598 0.632046 1.9335 0.327642 0.425749 0.139131 0.111182 0.109038 0.0848989 0.0841569 0.080943 0.0800686 0.0516364 0.0457683 0.0427108 0.0417366 0.0241516 0.0176676 0.0161773 0.0134759 0.00685575 0.0058186 0.00523408 0.00869145 0.00421466 0.0022235 0.00031491 3.84328e-06 7.9538e-06 7.62909e-06
threshold=1.0000000180025095e-35 1.0000000180025095e-35 69.500000000000014 0 28.500000000000004 2.5000000000000004 81.500000000000014 1 94.500000000000014 2 72.500000000000014 1.0000000180025095e-35 64.500000000000014 14.500000000000002 23.500000000000004 22.500000000000004 3.5000000000000004 18.500000000000004 19.500000000000004 2.5000000000000004 22.500000000000004 5.5000000000000009 92.500000000000014 1.5000000000000002 3.5000000000000004 78.500000000000014 119.50000000000001 123.50000000000001 3 161.50000000000003 205.50000000000003 67.500000000000014 2.5000000000000004 77.500000000000014 10.500000000000002 14.500000000000002 4 2.5000000000000004 1.0000000180025095e-35 5 6 2.5000000000000004 7 1.5000000000000002 75.500000000000014 8 73.500000000000014 109.50000000000001 9 10 1.5000000000000002 6.5000000000000009 68.500000000000014 11 12 13
decision_type=2 2 2 1 2 2 2 1 2 9 2 2 2 2 2 2 2 2 2 2 2 2 2 2 2 2 2 2 1 2 2 2 2 2 2 2 1 2 2 9 1 2 1 2 2 1 2 2 9 1 2 2 2 9 1 1
left_child=1 48 12 4 5 23 7 9 22 10 -4 33 14 41 15 16 19 35 -19 21 -21 -2 24 -3 43 46 34 28 -28 32 -31 37 -29 -12 38 -18 -26 -14 40 -40 -10 50 47 45 -11 -8 -9 -36 49 -1 -5 -7 -33 55 -55 -50
right_child=2 3 6 13 -6 51 8 25 26 44 11 -13 31 -15 -16 -17 17 18 -20 20 -22 -23 -24 -25 36 -27 27 29 -30 30 -32 52 -34 -35 42 -37 -38 -39 39 -41 -42 -43 -44 -45 -46 -47 -48 -49 53 -51 -52 -53 -54 54 -56 -57
leaf_value=-0.023109261558511091 0.0021960721721195871 -0.0005276449095844431 -0.00183255066991133 -0.023572104790646409 0.020307805699155589 -0.022715799496780719 -0.0016299691858322669 -0.00040034060707089383 -0.0011118592418372382 -0.00078606855532406354 0.025505515464598484 0.0088609373884665065 -0.011415903460597123 -0.0024542514436785307 -0.010054998647630334 0.017369361362211202 -0.011892759417583087 0.016064911113702621 -0.0057651965962436597 0.022071221042956765 -0.0089880393551258746 -0.0024902674732240788 -0.0099921855803103785 0.0082027983885120826 -0.0038049911301144927 -0.0066692845984260164 0.014419782188109865 0.00023263327871258382 -0.0050649878305816685 0.0033304474842914609 0.00076384757058401299 -0.0036469439754789725 -0.0020265774465169036 0.019013776141651013 -0.00010302046705926 -0.018544752217181874 -0.0090868527069362121 -0.0064393839510342365 -0.0025276011696000623 0.00010621689964383304 0.0018222485326912447 -0.01566970692329658 0.0036568154933283047 -0.0030943542156785971 -0.0041896835176909539 0.00025840376514064159 0.0012850369779426683 0.0016625145449254916 -0.024798675141292623 -0.024607601992555656 -0.021138504892405166 -0.021250305830155445 -0.0031350917220778203 -0.024829266636687192 -0.024632100896789827 -0.02471757942836068
leaf_weight=22.304766176268458 98.982993185520172 18.263923041522503 10.445321708917616 7.0432853847742098 12.473551183938978 5.4984276015311462 19.632780581712723 13.651355534791948 27.208794683218002 7.042438939213751 11.852576673030855 21.684949368238449 22.449931859970093 5.4915316551923743 19.014708675444126 11.030686631798742 9.0730859898030776 10.62882775813341 85.020843364298344 18.617954446002841 19.52042768150568 534.20029981434345 24.885978996753693 25.815348029136658 14.78928679227829 11.109659671783445 31.11226612329483 107.37066185474396 21.551225274801254 194.93140536546707 944.27190989255905 6.0092657059431058 110.50573033094406 14.239225178956984 9.4929668605327624 9.9899509474635106 14.235147744417191 12.62960661947727 60.373003721237183 22.694539427757263 22.792999237775803 2.4820803701877585 11.770955622196199 9.8934067189693433 6.9230753928422928 18.211146503686905 10.81353774666786 9.1789369285106641 12.970457009039816 17.097651558928192 2.3803956601768732 4.8902556300163269 6.0105477422475815 0.84175340551882982 1.3037632703781157 3.7353237345814749
leaf_count=1543 1088 137 34 74 18 33 62 35 71 23 23 40 44 14 39 3 86 5 332 81 80 2401 39 70 36 21 28 201 29 290 781 21 184 24 25 27 20 27 131 54 44 37 23 27 19 39 29 20 939 1227 34 13 21 61 94 270
internal_value=0 -0.0101357 -0.000107692 -0.000499213 0.00338521 -0.000490185 0.000888032 0.0059933 0.000559563 0.00985645 0.012814 0.0160161 -0.0021641 -0.0154457 -0.00182535 -0.00162902 -0.00189563 -0.00534009 -0.00333938 -0.00130706 0.00617411 -0.00175767 -0.00484221 0.0045854 -0.0031726 -0.00184578 0.000908571 0.00107182 0.00644612 0.000863264 0.00120302 -0.00803349 -0.000913226 0.0219627 -0.000498922 -0.0153787 -0.0063955 -0.00962422 -0.00104386 -0.00180803 0.000225635 -0.0214381 0.00188308 -0.00121307 -0.00247333 -0.000721252 0.0003446 0.0007649 -0.0240872 -0.0237594 -0.0229574 -0.0220259 -0.00339099 -0.0247725 -0.0247095 -0.0247805
internal_weight=0 142.593 2645.84 84.3388 66.9415 54.468 1782.67 107.762 1674.9 72.1876 58.2221 47.7768 863.179 17.3973 816.08 797.065 786.034 114.713 95.6497 671.322 38.1384 633.183 101.648 44.0793 76.7618 35.5746 1573.26 1409.74 52.6635 1357.08 1139.2 47.0994 217.876 26.0918 163.512 19.063 29.0244 35.0795 133.069 83.0675 50.0018 11.9058 30.4429 47.7373 13.9655 37.8439 24.4649 18.6719 58.2537 39.4024 9.42368 10.3887 12.0198 18.8513 2.14552 16.7058
internal_count=11171 4564 6607 430 271 253 2352 248 2104 163 121 87 4255 159 4142 4103 4100 450 337 3650 161 3489 223 207 184 85 1881 1513 57 1456 1071 113 385 47 368 113 56 71 300 185 115 145 68 128 42 101 64 45 4134 2770 108 46 42 1364 155 1209
cat_boundaries=0 1 2 3 4 5 6 7 8 9 10 11 12 13 14
cat_threshold=1 1 2 1 1 2 1 1 1 2 1 1 2 1
is_linear=0
shrinkage=0.05


Tree=118
num_leaves=77
num_cat=17
split_feature=2 3 2 1 3 3 2 1 2 0 2 2 3 2 3 0 0 1 2 2 2 3 2 2 2 2 2 2 3 3 2 0 2 2 3 2 2 1 2 2 3 2 2 2 1 1 3 3 3 2 2 2 2 2 3 3 3 2 2 2 2 3 2 1 1 3 2 3 0 1 3 3 2 0 1 1
split_gain=5.23572 7.55265 2.06399 1.88645 1.63104 2.30675 1.1279 1.2235 1.20534 0.980834 1.04115 2.02375 2.49144 0.66081 0.536124 0.514679 2.14529 2.63188 3.02772 21.242 1.23004 1.82541 2.12952 1.82438 1.63531 0.850182 0.544909 0.338591 0.306281 0.186438 0.144165 0.141259 0.2001 3.20665 0.438238 0.41325 0.436613 0.248936 0.136635 0.136604 0.140697 0.135163 0.130135 0.11468 0.080539 0.0784951 0.0545533 0.0426384 0.0421724 0.0414273 0.114161 0.0325199 0.0267226 0.0266689 0.0237126 0.023261 0.0224542 0.0207993 0.0184819 0.0173219 0.0222368 0.0168873 0.0155008 0.0128423 0.0106445 0.00929796 0.0067856 0.00631098 0.00535566 0.00888317 0.00429123 0.0022601 0.000302577 3.93913e-06 8.15119e-06 7.81934e-06
threshold=1.0000000180025095e-35 1.0000000180025095e-35 69.500000000000014 0 28.500000000000004 2.5000000000000004 81.500000000000014 1 94.500000000000014 2 78.500000000000014 73.500000000000014 1.5000000000000002 64.500000000000014 14.500000000000002 3 4 5 22.500000000000004 21.500000000000004 5.5000000000000009 1.5000000000000002 3.5000000000000004 6.5000000000000009 7.5000000000000009 42.500000000000007 23.500000000000004 92.500000000000014 1.5000000000000002 3.5000000000000004 78.500000000000014 6 316.50000000000006 312.50000000000006 2.5000000000000004 490.00000000000006 456.50000000000006 7 248.50000000000003 5.5000000000000009 18.500000000000004 67.500000000000014 48.500000000000007 41.500000000000007 8 9 1.5000000000000002 1.0000000180025095e-35 2.5000000000000004 115.50000000000001 125.50000000000001 305.50000000000006 1.5000000000000002 8.5000000000000018 1.0000000180025095e-35 3.5000000000000004 22.500000000000004 102.50000000000001 3.5000000000000004 60.500000000000007 51.500000000000007 1.5000000000000002 75.500000000000014 10 11 1.0000000180025095e-35 72.500000000000014 1.0000000180025095e-35 12 13 1.5000000000000002 6.5000000000000009 68.500000000000014 14 15 16
decision_type=2 2 2 1 2 2 2 1 2 9 2 2 2 2 2 9 9 1 2 2 2 2 2 2 2 2 2 2 2 2 2 9 2 2 2 2 2 1 2 2 2 2 2 2 1 1 2 2 2 2 2 2 2 2 2 2 2 2 2 2 2 2 2 1 1 2 2 2 9 1 2 2 2 9 1 1
left_child=1 68 13 4 5 28 7 9 27 10 11 12 -4 15 48 26 20 18 19 -18 21 22 -17 65 -25 -20 39 29 -3 61 66 32 33 34 -10 36 -34 -37 49 52 53 44 43 55 46 -31 -15 -13 70 57 -51 -40 67 -41 -19 -28 -53 -33 -23 60 -44 63 -11 -8 -54 -22 -9 -2 69 -1 -5 -7 -43 75 -75 -70
right_child=2 3 6 14 -6 71 8 30 31 62 -12 47 -14 41 -16 16 17 54 25 -21 23 58 -24 24 -26 -27 42 -29 -30 45 -32 38 35 -35 -36 37 -38 -39 51 40 -42 72 59 -45 -46 -47 -48 -49 -50 50 -52 56 64 -55 -56 -57 -58 -59 -60 -61 -62 -63 -64 -65 -66 -67 -68 -69 73 -71 -72 -73 -74 74 -76 -77
leaf_value=-0.023069048326586756 -0.020099045506095686 -0.00051481911845351037 0.03698839412111235 -0.023542119111924126 0.019400416202105905 -0.022667241410627967 -0.0015921242574050973 0.0014676898657445467 0.0024050369205526308 -0.00076716153765392673 0.019925343846851649 -0.0086034333711479515 -0.0012481648414001062 -0.013486582903948463 -0.0023992701305140226 -0.0013981774692322208 -0.014337656049647089 -0.012802596449477767 0.002380608024311461 0.18624492417656802 -0.020891249880772261 -0.016393607545588253 0.014680283321206382 0.011049379370677287 -0.0030243552874222169 0.018959620444362911 -0.0026338667322616579 -0.0098431876781134367 0.0079329511959367102 -0.0037248416002769132 -0.0065477656542151296 -0.0013572178273090478 -0.00020480853291461221 0.025074070382874538 3.6087425778422158e-05 0.00037371526105438806 -0.0059614071436064515 0.0037314084270934698 0.0023335256762246235 -0.010120753287388207 -0.021617442808232676 -0.0035695522296686905 0.0028226921447533711 -0.0084407711507417885 -0.0059237699572368095 -0.008943151675424043 -0.0087002582026444279 -0.0034948294112865175 -0.015525048613597422 -0.0053354766078026646 -0.00088246731417097575 0.0010365670939676214 -0.0099152936056272414 -0.0062007316287180725 -0.0084111424888758928 0.0018091035806909969 -0.00036025042561995714 0.0014937006593449184 -0.021361721765425824 0.0034771926348059349 -0.001372815098142471 -0.0030269945945730296 -0.0041030288105063 0.0002519217486065028 -0.014165092260123106 -0.017974574945609705 -0.00027654033957847979 -0.014629881444708281 -0.024714784712218645 -0.024602078438607032 -0.021059657082985198 -0.021173438249769007 -0.0030669717617842537 -0.024627182931378534 -0.024829265747929045 -0.024797907072978565
leaf_weight=21.795231004245579 2.163619881495833 18.254289565607905 8.8408412337303179 6.8792017214000243 12.729450911283491 5.374934293329714 19.600805759429932 8.5934134125709551 376.49285200238228 7.0369052439928037 25.574115335941315 8.196252644062044 8.2224486321210843 11.98003274202347 5.4780704975128165 48.452539540827274 4.3188773598521939 7.8332022130489332 19.721786387264729 1.9008595347404478 11.349024847149847 2.9743862859904748 35.816589843481779 21.450393229722977 546.71010526269674 12.720291689038275 16.696443259716041 24.63855192065239 26.027977228164673 14.733120560646057 11.035812854766844 9.1970171928405779 172.48252332210541 14.294066667556761 405.48829829692841 133.81654405593872 40.713489651679993 93.960817933082581 34.655713081359863 5.5410612560808721 1.7728993892669667 5.9873900413513166 5.1534454375505474 9.7858103364706022 10.929590553045271 14.106381058692932 11.834020897746084 8.141820162534712 2.4434900507330886 16.376981556415558 118.80397191643715 96.373290538787842 1.9417597092688084 19.996466066688299 5.059479258954525 3.5770615935325614 41.016236305236816 21.018458425998688 5.0508650355041027 6.0552991926670066 8.1573684364557248 9.8628401756286603 6.8941305875778198 18.215853095054626 6.1090734433382732 3.5989438295364371 15.879920393228529 0.6975117977708577 3.6441272869706154 16.682054495438933 2.3306057658046484 4.7874325290322304 5.9917336702346802 1.272041147574785 0.82111062109470379 12.652762577869
leaf_count=1543 91 137 17 74 18 33 62 25 576 23 32 21 25 24 14 512 62 36 34 3 71 39 188 93 2109 27 112 39 70 36 21 24 140 8 587 82 22 47 39 98 1 21 23 34 21 20 26 26 37 29 182 70 54 216 17 24 27 48 23 24 35 27 19 39 168 25 39 23 270 1227 34 13 21 94 61 939
internal_value=0 -0.00998793 -0.000105328 -0.00048959 0.00328752 -0.000479759 0.000864997 0.0058075 0.000545251 0.00951442 0.0123331 0.00651995 0.018563 -0.00211538 -0.0153001 -0.00178371 -0.00134731 0.0084839 0.0150077 0.0469639 -0.00209774 0.0032656 0.00543559 -0.00294665 -0.00249301 0.00888111 -0.00540321 -0.00474536 0.00445056 -0.00310389 -0.00180345 0.000885118 0.00113243 0.00160563 0.00117664 0.000277976 -0.00130413 0.0017588 -2.16791e-05 -0.0098863 -0.00799687 -0.00789812 -0.00193628 -0.00399559 -0.00947722 -0.00627729 -0.0111081 -0.00605764 -0.0213646 -0.00104783 -0.00142194 0.000964812 -0.0146151 -0.00705129 -0.0110793 -0.00184995 0.000619562 0.000625935 -0.0195204 0.00126011 0.000251527 -0.00118442 -0.002418 -0.000703868 -0.0131401 -0.020189 0.000335918 -0.0187657 -0.0240692 -0.0237337 -0.0229139 -0.0219635 -0.00331817 -0.024771 -0.0247065 -0.0247793
internal_weight=0 141.173 2645.59 84.3055 67.1741 54.4446 1784.26 108.416 1675.85 72.9065 58.9755 33.4014 17.0633 861.328 17.1314 814.605 726.957 51.5545 38.6618 6.21974 675.403 92.2944 84.2691 583.108 568.16 32.4421 87.6478 101.158 44.2823 76.519 35.5091 1574.69 1237.25 796.275 781.981 440.973 213.196 227.777 337.442 38.2224 27.3104 46.7228 49.4254 30.0593 34.7436 28.8395 23.8141 16.3381 11.6533 165.396 135.181 172.045 10.912 25.5375 12.8927 20.2735 137.39 30.2155 8.02525 19.3661 13.3108 47.6795 13.931 37.8167 8.05083 14.948 24.4733 2.86113 56.8673 38.4773 9.20981 10.1624 11.9791 18.39 2.09315 16.2969
internal_count=11171 4564 6607 430 271 253 2352 248 2104 163 121 89 42 4255 159 4142 3239 179 126 65 3060 762 700 2298 2202 61 903 223 207 184 85 1881 1462 1171 1163 291 162 129 419 651 315 113 252 170 71 56 50 47 145 283 211 136 336 314 53 136 97 72 62 82 58 128 42 101 222 96 64 114 4134 2770 108 46 42 1364 155 1209
cat_boundaries=0 1 2 3 4 5 6 7 8 9 10 11 12 13 14 15 16 17
cat_threshold=1 1 2 1 2 1 2 1 1 1 1 2 2 1 1 1 2
is_linear=0
shrinkage=0.05


Tree=119
num_leaves=59
num_cat=14
split_feature=2 3 2 1 3 3 2 2 1 0 2 3 2 3 3 3 3 2 2 3 2 2 2 3 2 2 2 1 2 2 3 2 2 3 2 3 1 3 3 3 0 3 1 1 3 2 2 1 2 2 0 1 3 3 2 0 1 1
split_gain=5.03561 7.4375 1.96711 1.81683 1.51646 2.2345 1.06367 1.15018 1.14692 0.914031 1.00038 0.7059 0.635724 0.530413 0.504981 1.49538 0.603577 0.898023 1.70688 0.870721 3.45447 0.717714 0.329681 0.287768 0.138219 0.137265 0.599267 1.80925 0.309364 0.404489 0.136526 0.131264 0.106622 0.106537 0.0844456 0.0823053 0.0786764 0.057017 0.0536578 0.0478757 0.0446891 0.0426014 0.0399954 0.0227722 0.0179238 0.0186562 0.0148502 0.0134276 0.00673108 0.00554329 0.0054798 0.00907848 0.00436852 0.00229687 0.000290663 4.03707e-06 8.3533e-06 8.01432e-06
threshold=1.0000000180025095e-35 1.0000000180025095e-35 69.500000000000014 0 28.500000000000004 2.5000000000000004 81.500000000000014 94.500000000000014 1 2 72.500000000000014 1.0000000180025095e-35 64.500000000000014 14.500000000000002 23.500000000000004 22.500000000000004 3.5000000000000004 18.500000000000004 19.500000000000004 2.5000000000000004 22.500000000000004 41.500000000000007 91.500000000000014 1.5000000000000002 78.500000000000014 119.50000000000001 123.50000000000001 3 161.50000000000003 205.50000000000003 4.5000000000000009 67.500000000000014 77.500000000000014 17.500000000000004 14.500000000000002 10.500000000000002 4 11.500000000000002 1.5000000000000002 1.0000000180025095e-35 5 2.5000000000000004 6 7 1.5000000000000002 86.500000000000014 75.500000000000014 8 73.500000000000014 109.50000000000001 9 10 1.5000000000000002 6.5000000000000009 68.500000000000014 11 12 13
decision_type=2 2 2 1 2 2 2 2 1 9 2 2 2 2 2 2 2 2 2 2 2 2 2 2 2 2 2 1 2 2 2 2 2 2 2 2 1 2 2 2 9 2 1 1 2 2 2 1 2 2 9 1 2 2 2 9 1 1
left_child=1 50 12 4 5 23 8 22 9 10 -4 32 14 41 15 16 19 34 -19 21 -21 -2 30 -3 48 35 27 -27 33 -30 44 36 -12 -28 -18 39 38 -32 -14 42 -41 52 -9 49 45 -8 -11 -24 -10 -37 51 -1 -5 -7 -33 57 -57 -52
right_child=2 3 6 13 -6 53 7 25 24 46 11 -13 31 -15 -16 -17 17 18 -20 20 -22 -23 47 -25 -26 26 28 -29 29 -31 37 54 -34 -35 -36 43 -38 -39 -40 40 -42 -43 -44 -45 -46 -47 -48 -49 -50 -51 55 -53 -54 -55 -56 56 -58 -59
leaf_value=-0.02302796949877749 -0.0026356844484595795 -0.00050229882896620588 -0.0020873804740594751 -0.023511456807675205 0.01855061028373706 -0.022617673950179454 -0.0015827364802917241 -0.0011207219633904567 -0.00041064473062350315 -0.00074869492190221033 0.023728785145407869 0.0082413997454100565 -0.013332572784396932 -0.0023453899820379555 -0.0098527018964677318 0.016547288473033158 -0.011679455144488959 0.015536352461511979 -0.005603669892385801 0.021248574892303817 -0.0088054392560052482 0.0013036454465584389 -0.0078402376812104334 0.0076740781816042204 -0.0064276699478801186 0.013848929422442008 -0.0014033920657682407 -0.0049700228004687791 0.0032161379263341804 0.00071902937916526802 -0.008094779401210497 -0.0034935290172077808 0.017425061588327673 0.001564201230544489 -0.018406276666918905 -0.00010007049226232557 -0.0058114457248835414 -0.0029948505138167499 -0.0085593196050301034 -0.0024946862145398996 0.00010850829797320722 -0.015379473069036229 0.0017152388143473346 0.0035520437879000624 -0.0027603234143208327 0.00078470355111011835 -0.0040178136612501313 -0.0098834629905309255 0.0012587141128986431 0.0016225799136483931 -0.024797119465516857 -0.024596421843302758 -0.02097942875841298 -0.021095206048478338 -0.0030001249642680819 -0.024829266332676188 -0.024622146170269633 -0.024711919945336322
leaf_weight=21.298190814442933 478.7335170134902 18.2448934558779 10.562364697456358 6.7191423922777194 12.978818982839583 5.254469992592929 18.823319524526596 27.218966454267502 13.657116025686266 7.0315088331699354 12.286260187625887 22.091190040111542 11.819547593593599 5.4649428874254218 18.757866106927395 11.249845147132872 8.9259105436503905 10.76800476759672 84.306527748703957 18.950348192825913 19.297982148826122 152.44138692319393 16.750485897064209 26.235276699066162 10.963788747787474 31.571452498435974 181.54947078227997 21.448169529438019 195.72592097520828 945.92840057611465 12.706928461790087 5.9660557657480222 14.774603694677351 36.288731932640076 9.7745730653405172 9.4918344020843524 10.865037500858305 9.6367276310920698 11.731508404016493 60.28403040766716 22.692453980445862 2.405847715213894 22.884884655475616 11.81440904736519 12.381875991821287 14.915542930364607 6.8659017235040665 15.464568018913267 10.82444855570793 9.1927944421768171 12.342859173193574 16.276648323051631 2.2820372134447098 4.6871317699551582 5.9733851253986359 0.80097407661378384 1.2410969436168682 3.5551672987639895
leaf_count=1543 3003 137 34 74 18 33 50 71 35 23 23 40 24 14 39 3 86 5 332 81 80 486 35 70 21 28 327 29 290 781 23 21 24 58 27 25 21 22 26 131 54 37 44 23 33 40 19 20 29 20 939 1227 34 13 21 61 94 270
internal_value=0 -0.00984085 -0.000103443 -0.000480091 0.00319303 -0.000469531 0.000842485 0.000531281 0.00562728 0.00918535 0.0118732 0.0148732 -0.0020687 -0.0151536 -0.00174405 -0.0015526 -0.00181259 -0.00517946 -0.00320938 -0.00124035 0.00608499 -0.00168426 -0.00464998 0.00432029 -0.00176201 0.000862256 0.00102105 0.00623605 0.000817665 0.00114714 -0.00268733 -0.00776399 0.0202871 -0.000909033 -0.0151955 -0.000508914 -0.00933111 -0.0058952 -0.0109549 -0.00104583 -0.00178276 -0.0212898 0.0001746 0.00183388 -0.00113324 -0.00053612 -0.00236378 -0.00882107 0.000327457 0.00074747 -0.0240506 -0.0237074 -0.0228695 -0.0218999 -0.00324668 -0.0247696 -0.0247034 -0.0247781
internal_weight=0 139.787 2645.39 84.2726 67.4006 54.4218 1785.83 1676.77 109.057 73.6118 59.7144 49.1521 859.561 16.872 813.206 794.448 783.198 113.775 95.0745 669.423 38.2483 631.175 100.679 44.4802 35.4454 1576.09 1412.51 53.0196 1359.49 1141.65 68.4644 46.3555 27.0609 217.838 18.7005 163.579 34.4161 22.3437 23.5511 133.08 82.9765 11.407 50.1039 30.499 46.1207 33.7389 13.8974 32.2151 24.4816 18.6846 55.5149 37.5748 9.00118 9.9416 11.9394 17.9401 2.04207 15.898
internal_count=11171 4564 6607 430 271 253 2352 2104 248 163 121 87 4255 159 4142 4103 4100 450 337 3650 161 3489 223 207 85 1881 1513 57 1456 1071 168 113 47 385 113 368 71 45 50 300 185 145 115 68 123 90 42 55 64 45 4134 2770 108 46 42 1364 155 1209
cat_boundaries=0 1 2 3 4 5 6 7 8 9 10 11 12 13 14
cat_threshold=1 1 2 1 1 2 1 1 1 2 1 1 2 1
is_linear=0
shrinkage=0.05


Tree=120
num_leaves=78
num_cat=23
split_feature=2 3 2 3 2 0 2 3 3 1 3 3 3 2 2 2 3 1 2 2 2 1 3 2 3 3 0 0 2 1 1 3 2 2 2 2 2 0 2 2 3 3 1 2 2 3 2 2 2 2 2 2 1 3 1 1 1 0 2 1 1 3 1 1 2 3 2 1 2 2 2 2 2 3 1 0 0
split_gain=9.9776 3.53844 3.15887 2.52292 2.20588 1.81582 1.70044 2.48943 5.18524 5.1443 1.72858 1.55677 3.23663 1.47853 1.45474 2.04799 1.27616 4.55302 1.22253 1.15025 1.43134 2.98125 2.31675 1.28331 2.79538 8.43924 5.84456 4.47832 2.69832 2.98778 1.68217 1.11903 0.852177 0.612652 2.22226 1.00241 0.5134 0.289705 0.239521 0.46607 0.223605 0.193713 0.1085 0.446864 0.452681 0.0839606 0.0576745 0.0572624 0.329662 0.0380292 0.0334636 0.0327252 0.0270917 0.0191081 0.0188457 0.0137173 0.0134755 0.0100634 0.00936999 0.00890244 0.00568902 0.00545772 0.00400249 0.00296661 0.00265786 0.00224672 0.0014685 0.00144083 0.0011154 0.00423532 0.000354795 0.000170615 0.000155618 1.53158e-05 7.30722e-06 3.61149e-06 3.79152e-07
threshold=6.5000000000000009 1.0000000180025095e-35 1.0000000180025095e-35 1.5000000000000002 16.500000000000004 0 15.500000000000002 1.0000000180025095e-35 3.5000000000000004 1 2.5000000000000004 5.5000000000000009 12.500000000000002 13.500000000000002 1.0000000180025095e-35 4.5000000000000009 2.5000000000000004 2 7.5000000000000009 18.500000000000004 19.500000000000004 3 17.500000000000004 24.500000000000004 1.5000000000000002 3.5000000000000004 4 5 27.500000000000004 6 7 1.0000000180025095e-35 5.5000000000000009 79.500000000000014 64.500000000000014 84.500000000000014 21.500000000000004 8 12.500000000000002 14.500000000000002 104.50000000000001 8.5000000000000018 9 1.5000000000000002 2.5000000000000004 2.5000000000000004 13.500000000000002 4.5000000000000009 1.5000000000000002 1.5000000000000002 1.0000000180025095e-35 13.500000000000002 10 1.0000000180025095e-35 11 12 13 14 8.5000000000000018 15 16 3.5000000000000004 17 18 2.5000000000000004 1.0000000180025095e-35 17.500000000000004 19 4.5000000000000009 3.5000000000000004 7.5000000000000009 10.500000000000002 1.5000000000000002 1.0000000180025095e-35 20 21 22
decision_type=2 2 2 2 2 9 2 2 2 1 2 2 2 2 2 2 2 1 2 2 2 1 2 2 2 2 9 9 2 1 1 2 2 2 2 2 2 9 2 2 2 2 1 2 2 2 2 2 2 2 2 2 1 2 1 1 1 9 2 1 1 2 1 1 2 2 2 1 2 2 2 2 2 2 1 9 9
left_child=1 2 57 14 5 6 7 18 9 10 -9 45 -13 -11 56 52 17 -8 -2 41 21 -21 -23 24 26 36 30 -28 29 31 -22 -25 37 34 -30 -35 -26 42 54 -40 -14 53 47 -44 -45 50 -10 48 -4 67 -5 58 -16 60 -20 64 -3 59 62 -1 -6 72 70 65 -51 71 -55 -39 69 -52 -7 -60 -47 -53 76 -76 -59
right_child=4 3 32 11 19 51 16 8 46 13 -12 12 40 -15 15 -17 -18 -19 38 20 23 22 -24 28 25 -27 27 -29 33 -31 -32 -33 -34 35 -36 -37 -38 49 39 -41 -42 -43 43 44 -46 61 -48 -49 -50 55 68 73 -54 66 -56 -57 -58 74 63 -61 -62 -63 -64 -65 -66 -67 -68 -69 -70 -71 -72 -73 -74 -75 75 -77 -78
leaf_value=-0.022635041981969705 0.01605728002046523 0.014477348165479593 -0.0050171261012878082 -0.012769694792846599 -0.0080230634244023522 -0.0098187258817241038 0.043603258819601087 0.0033808665720443977 -0.010624142806443124 0.039211897012065011 0.034537520176275864 0.032697182377805799 -0.012444653543829872 0.076617943320979556 -0.022338597131940183 0.012798636240052959 0.04214762559471668 -0.0177474845534084 -0.0065639156582042437 0.039780537209434974 -0.019794810800676771 -0.016991403154927188 0.018722840348740201 0.016726316019598824 0.045525135621530211 -0.018557065496620961 -0.0062767671337563766 0.061248735524113765 0.00048171759104925202 -0.00028956694369953193 -0.0043769184024107502 0.038098795851257479 -0.020432495991388962 -0.0065172285536216294 0.0082168576653745221 0.00077710113716671666 0.027014256106605364 -0.020666926584139562 0.0032981024906048508 -0.012483747620218888 -0.0016807327691980144 -0.019537850962676646 -0.020580614525879795 0.0081144964966324337 -0.011004209333888872 -0.020343330883455538 -0.017880068475403563 -0.0040750034444159075 -0.017087877562325059 -0.016404645836843569 -0.014738360248811337 -0.0110700426447443 -0.015864136619278175 -0.011003111094194596 -0.0098663351430315384 -0.0083951381007333018 0.017124740696251164 -0.024807144498365769 -0.0062366255855185486 -0.024213177329217794 -0.0052415214216100505 -0.017485145930128333 -0.0058692663077923547 -0.0032346061906128247 -0.013509987503119462 -0.0043873482056351809 -0.0094318637401645204 -0.017755904943980268 -0.018079188357531049 -0.018563348160193512 -0.0086338900511635352 -0.0070391473686375163 -0.019802284271491992 -0.010910872046026563 -0.024706714837728225 -0.02482926578507122 -0.024779354085811771
leaf_weight=20.28727325797081 9.3740601986646634 17.792084619402885 25.82332643866539 25.758688181638721 3.2985207587480545 1.5918877050280553 6.3451929688453674 16.572060421109203 6.3415119089186174 7.1765816658735258 6.0868225097656241 6.1627037189900902 13.30503272265196 4.1806009113788605 6.6942801903933304 9.3597778119146806 6.2705395221710196 5.7778665125370043 7.8259087651968002 7.3541172444820404 44.57764907181263 8.5069952905178106 9.7396469116210938 22.436805874109272 6.2550329938530949 14.494466774165629 4.9266310706734657 4.8949981182813627 336.24722868204117 26.668920710682869 29.332167640328407 8.4240254759788495 12.634650249034165 48.419588804244995 128.27656327188015 1727.1291743516922 9.3374266624450666 2.1166654005646688 18.324180871248249 6.2819474190473548 7.5699041187763205 5.1886043250560752 2.6585513353347805 9.3491722345352155 4.6290887109935275 2.6835155636072141 4.820415087044239 16.780817329883575 7.2428994812071315 1.0311586800962684 1.5049064699560395 3.2019077390432349 2.1297684144228697 3.1816469728946686 9.6433819085359591 1.3309116307646034 6.5859904978424337 12.130314474925399 1.2083109840750705 15.971785627305506 4.1523506343364733 3.2934039011597633 1.2035592384636404 1.5746408291161049 3.4336165264248848 1.7890369221568105 2.7919610142707825 0.53188360482454333 2.1577878408133984 1.3941725343465805 1.0476516522467136 1.4655665084719656 2.6330364011228085 2.8623468354344368 3.404159527271986 0.73009648919105608 1.36549612879753
leaf_count=1504 60 143 113 91 24 31 21 81 40 52 9 31 38 9 53 37 7 28 102 27 116 41 1 47 22 32 39 11 1316 60 60 49 91 105 319 2099 27 88 91 38 11 8 80 61 109 36 17 41 219 43 34 29 42 26 161 40 75 946 23 1234 43 40 21 23 92 31 19 26 15 16 19 25 20 23 265 57 106
internal_value=0 -0.00906481 -0.0142822 -0.00229567 0.00138649 0.00770913 0.00990117 0.00724873 0.0158131 0.0255164 0.0117504 -0.00838233 0.000858194 0.0529811 0.00720903 -0.00349406 0.0238353 0.0143634 -0.000271699 0.00104928 0.00114385 0.0129043 0.00207206 0.001019 -0.0041634 0.00890852 -0.00886049 0.0273772 0.00127572 0.0119679 -0.013676 0.0225603 -0.00842048 0.00100113 0.00261775 0.000578183 0.03444 -0.00639497 -0.00390966 -0.000731006 -0.00854132 -0.0113331 -0.00528695 -0.00179062 0.00178308 -0.0147194 -0.0137577 -0.00645387 -0.00766113 -0.0151187 -0.0134997 -0.00810354 -0.0207759 -0.00816198 -0.00838691 -0.0128504 0.0151926 -0.0238066 -0.00632896 -0.0233302 -0.00647292 -0.0190846 -0.00825886 -0.00510051 -0.0141785 -0.00575885 -0.0102687 -0.0200823 -0.0172185 -0.0165778 -0.00934846 -0.00667649 -0.0200754 -0.0109949 -0.0247865 -0.0247284 -0.0248043
internal_weight=0 250.477 141.452 109.025 2586.6 130.966 115.021 96.6275 45.178 34.0161 22.6589 66.4632 27.0376 11.3572 42.5619 18.1838 18.3936 12.1231 51.4495 2455.63 2437.02 25.6008 18.2466 2411.42 113.818 30.0869 83.7314 9.82163 2297.6 57.5298 73.9098 30.8608 87.5627 2240.07 464.524 1775.55 15.5925 74.9281 42.0754 24.6061 20.8749 18.6131 66.4839 16.6368 13.9783 39.4255 11.1619 49.847 33.0662 8.44424 30.8156 15.9449 8.82405 13.4245 17.4693 5.79569 24.3781 53.8891 9.88065 36.2591 7.45087 8.60996 3.8431 6.03756 4.46478 4.46291 5.97361 2.64855 5.05687 2.89908 2.63954 2.67388 5.31655 6.06425 17.6301 4.13426 13.4958
internal_count=11229 5797 5115 682 5432 941 716 660 208 151 90 332 80 61 350 132 56 49 452 4491 4371 69 42 4302 307 81 226 50 3995 156 176 96 1003 3839 1635 2204 49 912 392 129 49 120 623 250 170 252 57 373 332 289 156 225 95 112 263 175 218 4112 173 2738 67 96 71 102 135 79 45 114 65 50 50 48 56 52 1374 322 1052
cat_boundaries=0 1 2 3 4 5 6 7 8 9 10 11 12 13 14 15 16 17 18 19 20 21 22 23
cat_threshold=2 1 2 2 2 1 1 1 2 1 1 2 1 1 2 1 2 1 1 1 1 1 1
is_linear=0
shrinkage=0.05


Tree=121
num_leaves=72
num_cat=20
split_feature=2 3 2 3 2 0 3 3 1 3 3 3 3 2 2 2 2 2 1 2 3 3 0 2 2 1 1 2 3 2 2 2 2 2 0 3 3 1 2 2 3 2 2 2 2 2 1 3 3 1 1 0 2 1 1 3 1 1 2 3 1 2 2 2 2 2 2 3 1 0 0
split_gain=9.56115 3.45253 3.1486 2.4074 2.07144 1.70866 1.55873 10.0418 2.04824 2.84646 5.48664 1.51357 3.11128 1.40298 1.35766 1.97069 1.10413 1.3385 2.68123 1.22551 2.66731 7.82746 5.52555 4.26977 2.52751 2.74342 1.6622 1.04703 0.982815 0.839845 0.580035 2.08901 0.958324 0.43728 0.283081 0.209401 0.191645 0.104548 0.433957 0.431011 0.0837571 0.0554754 0.323115 0.0379654 0.0332548 0.0319329 0.0273446 0.0186357 0.0181544 0.013521 0.0122158 0.0102899 0.00909034 0.00908699 0.00551948 0.00549578 0.0038979 0.0028618 0.002708 0.00217333 0.00145359 0.00144062 0.00111779 0.00423598 0.000347039 0.000165566 0.000157266 1.50594e-05 7.48967e-06 3.70139e-06 3.88651e-07
threshold=6.5000000000000009 1.0000000180025095e-35 1.0000000180025095e-35 1.5000000000000002 16.500000000000004 0 7.5000000000000009 6.5000000000000009 1 2.5000000000000004 1.0000000180025095e-35 5.5000000000000009 11.500000000000002 15.500000000000002 1.0000000180025095e-35 4.5000000000000009 18.500000000000004 19.500000000000004 2 24.500000000000004 1.5000000000000002 3.5000000000000004 3 22.500000000000004 27.500000000000004 4 5 14.500000000000002 1.0000000180025095e-35 5.5000000000000009 79.500000000000014 64.500000000000014 84.500000000000014 21.500000000000004 6 104.50000000000001 8.5000000000000018 7 1.5000000000000002 2.5000000000000004 2.5000000000000004 4.5000000000000009 1.5000000000000002 1.5000000000000002 1.0000000180025095e-35 13.500000000000002 8 1.0000000180025095e-35 45.500000000000007 9 10 11 8.5000000000000018 12 13 3.5000000000000004 14 15 4.5000000000000009 1.0000000180025095e-35 16 17.500000000000004 4.5000000000000009 3.5000000000000004 7.5000000000000009 10.500000000000002 1.5000000000000002 1.0000000180025095e-35 17 18 19
decision_type=2 2 2 2 2 9 2 2 1 2 2 2 2 2 2 2 2 2 1 2 2 2 9 2 2 1 1 2 2 2 2 2 2 2 9 2 2 1 2 2 2 2 2 2 2 2 1 2 2 1 1 9 2 1 1 2 1 1 2 2 1 2 2 2 2 2 2 2 1 9 9
left_child=1 2 51 14 5 6 7 8 13 10 -10 40 -13 27 50 46 36 18 -18 20 22 33 26 -24 25 28 -19 -2 -21 34 31 -26 -32 -22 37 48 47 41 -39 -40 44 42 -4 60 -5 52 -16 54 -14 58 -3 53 56 -1 -6 66 64 59 -45 65 -36 -49 63 -46 -7 -54 -42 -47 69 -53 -70
right_child=4 3 29 11 16 45 -8 -9 9 -11 -12 12 35 -15 15 -17 17 19 -20 24 21 -23 23 -25 30 -27 -28 -29 -30 -31 32 -33 -34 -35 43 -37 -38 38 39 -41 55 -43 -44 49 62 67 -48 61 -50 -51 -52 68 57 -55 -56 -57 -58 -59 -60 -61 -62 -63 -64 -65 -66 -67 -68 -69 70 -71 -72
leaf_value=-0.022584808090257119 0.0026245239816869914 0.013912391085620302 -0.0049174763101386236 -0.012614710418212683 -0.007887684051917641 -0.0096706156971939072 -0.015332166836563766 0.095215634199869392 0.007984881428486211 -0.014773045454494399 0.050716034801225579 0.032305802356714743 -0.013828438680870081 -0.018152116024637364 -0.022282334138837803 0.01232011972634576 0.037260776284136474 -0.019694161043524373 0.0020121158992415697 0.016037026710947106 0.042394051668678136 -0.01843958482671286 0.054202123485004854 -0.011454977707077867 0.00046952776901802251 -0.0002824598177736403 -0.0042872032755422781 0.020784516682480086 0.035746408850548687 -0.02034173562076599 -0.0063974950849605963 0.007946435251723654 0.0007572101001090078 0.025632489008640874 -0.020580008140563738 -0.0016417934203362405 -0.019433452127610662 -0.020492269835679845 0.007848257147838501 -0.010851234996926619 -0.020251137174408452 -0.003990256264841981 -0.016954457115349219 -0.01319030441016783 -0.014588534968013864 -0.01091688114898254 -0.01572077861029713 -0.010850140404040422 -0.010148768208530643 -0.0082565906941378438 0.016412406693913102 -0.024703649615548589 -0.0061203077132870425 -0.024198076898688005 -0.0051385823267411264 -0.017355603605694693 -0.0057576582513347262 -0.0031646427599824022 -0.015865812143918755 -0.0042974653280142584 -0.01762918883184093 -0.0092859506001987998 -0.017956043531951519 -0.018445946499748064 -0.0084934557783729187 -0.0069134784263700086 -0.01970174719168119 -0.010758178936706478 -0.024806589064701786 -0.024829265047551508 -0.024778101879169994
leaf_weight=19.833229184150696 51.677709240466356 18.051540531218052 25.694092392921448 25.431849300861362 3.2721623331308365 1.5763338543474656 5.9709924235939971 3.4214569255709639 21.239169798791409 5.8439503088593474 11.622901566326616 6.0863002873957184 6.9252348355948943 7.0444387644529334 6.5463970452547091 9.4803399890661222 7.6525647267699242 43.703920766711235 18.287389233708385 22.815246462821964 6.5463756993413034 14.227972388267515 5.7522010207176191 4.3477861955761909 336.4092436209321 26.66119908541441 29.204063817858696 9.3774780184030515 8.7511628940701467 12.379111908376215 48.10505348443985 129.3349365144968 1728.4718472063541 9.5931084379553777 2.0733694657683355 7.5571916699409476 5.0882139801979056 2.6043957471847561 9.4253448992967588 4.5784285664558402 2.6294754985719901 16.712574481964111 7.1201851535588494 3.0262530986219645 1.482889285311102 3.1666579619050017 2.0962480548769236 3.1468308418989182 6.4964843243360519 1.3197851814329622 6.6997453141957548 3.3210842637345195 1.2007986530661594 15.589702989906071 4.1306428313255328 3.2363188080489635 1.1965158991515639 1.569555740803479 1.3756681084632871 1.7812049835920332 0.5225228983908895 2.7657514661550522 2.1191272251307964 1.3685306832194328 1.0386452600359917 1.4552863724529741 2.5814090482890606 2.8312858492136002 11.833097733557224 0.7121919561177491 1.3320757895708091
leaf_count=1504 358 143 113 91 24 31 16 2 188 30 56 28 27 32 53 37 27 116 42 47 22 32 27 23 1316 60 60 34 49 91 105 319 2099 27 88 11 8 80 61 109 36 41 219 113 34 29 42 26 14 40 75 265 23 1234 43 40 21 23 22 31 26 19 15 16 19 25 20 23 946 57 106
internal_value=0 -0.00892289 -0.014131 -0.00224679 0.00134922 0.00745072 0.00954937 0.0108972 0.00819611 0.0173804 0.0230984 -0.00824551 0.000832026 0.002976 0.00697561 -0.00342243 0.00102156 0.00111359 0.0124108 0.000992192 -0.00408266 0.00859686 -0.00872131 0.0259384 0.00124229 0.0115268 -0.0135227 0.00541372 0.0215011 -0.00828234 0.000975226 0.00254583 0.000563479 0.0324312 -0.00627724 -0.00829899 -0.0111795 -0.00518387 -0.00175089 0.0017346 -0.0145695 -0.00633508 -0.00752931 -0.0149709 -0.0133458 -0.00796752 -0.0206908 -0.00802542 -0.0120474 -0.0126956 0.0145891 -0.023782 -0.00621154 -0.0232948 -0.00635373 -0.0189739 -0.00812147 -0.00499965 -0.0140264 -0.00564872 -0.019986 -0.0101185 -0.0170863 -0.0164399 -0.00920306 -0.00655489 -0.019979 -0.010842 -0.0247854 -0.0247258 -0.0248037
internal_weight=0 248.242 139.453 108.789 2590.28 132.014 116.198 110.227 106.806 38.706 32.8621 65.9148 27.0652 68.0996 42.8743 18.123 2458.27 2439.86 25.94 2413.92 113.375 30.3675 83.008 10.1 2300.55 58.2276 72.908 61.0552 31.5664 86.8317 2242.32 465.744 1776.58 16.1395 74.4526 20.9789 18.4036 66.135 16.6082 14.0038 38.8496 49.5269 32.8143 8.3176 30.4024 15.8163 8.64265 13.3154 13.4217 5.72171 24.7513 52.6214 9.81834 35.4229 7.40281 8.4472 3.8115 6.00685 4.40192 4.43729 2.59589 5.91258 4.97055 2.85142 2.61498 2.65609 5.21088 5.99794 17.1984 4.03328 13.1652
internal_count=11229 5797 5115 682 5432 941 716 700 698 274 244 332 80 424 350 132 4491 4371 69 4302 307 81 226 50 3995 156 176 392 96 1003 3839 1635 2204 49 912 52 120 623 250 170 252 373 332 289 156 225 95 112 41 175 218 4112 173 2738 67 96 71 102 135 79 114 45 65 50 50 48 56 52 1374 322 1052
cat_boundaries=0 1 2 3 4 5 6 7 8 9 10 11 12 13 14 15 16 17 18 19 20
cat_threshold=2 1 2 2 1 1 2 1 1 1 1 2 1 2 1 1 1 2 1 1
is_linear=0
shrinkage=0.05


Tree=122
num_leaves=72
num_cat=21
split_feature=2 3 2 3 2 0 3 3 1 3 3 3 3 2 2 2 2 2 1 2 3 3 0 0 2 1 1 2 3 2 2 2 2 2 0 3 3 1 2 2 3 2 2 2 2 2 1 3 3 1 1 0 1 2 3 1 1 1 2 3 1 2 2 2 2 2 2 3 1 0 0
split_gain=9.16132 3.3676 3.13737 2.29731 1.94589 1.60864 1.47407 8.48777 1.88945 2.63696 4.79741 1.4712 2.88475 1.34772 1.26805 1.89691 1.05977 1.25324 2.41835 1.1702 2.54553 7.27638 5.23031 3.79327 2.36883 2.52294 1.64189 0.966734 0.866859 0.827404 0.549221 1.96446 0.9161 0.374987 0.276505 0.203623 0.189524 0.100714 0.421391 0.410444 0.0835193 0.0537259 0.316581 0.0378865 0.0330327 0.0311469 0.0275921 0.0181675 0.0179056 0.0133216 0.0110952 0.0105209 0.00927445 0.00881586 0.00553225 0.00535305 0.00379453 0.0027599 0.00270026 0.00210165 0.001466 0.00141262 0.00111974 0.00423491 0.000339304 0.000160607 0.000158887 1.48006e-05 7.67662e-06 3.79364e-06 3.98376e-07
threshold=6.5000000000000009 1.0000000180025095e-35 1.0000000180025095e-35 1.5000000000000002 16.500000000000004 0 7.5000000000000009 6.5000000000000009 1 2.5000000000000004 1.0000000180025095e-35 5.5000000000000009 11.500000000000002 15.500000000000002 1.0000000180025095e-35 4.5000000000000009 18.500000000000004 19.500000000000004 2 24.500000000000004 1.5000000000000002 3.5000000000000004 3 4 27.500000000000004 5 6 14.500000000000002 1.0000000180025095e-35 5.5000000000000009 79.500000000000014 64.500000000000014 84.500000000000014 21.500000000000004 7 104.50000000000001 8.5000000000000018 8 1.5000000000000002 2.5000000000000004 2.5000000000000004 4.5000000000000009 1.5000000000000002 1.5000000000000002 1.0000000180025095e-35 13.500000000000002 9 1.0000000180025095e-35 45.500000000000007 10 11 12 13 8.5000000000000018 3.5000000000000004 14 15 16 2.5000000000000004 1.0000000180025095e-35 17 17.500000000000004 4.5000000000000009 3.5000000000000004 7.5000000000000009 10.500000000000002 1.5000000000000002 1.0000000180025095e-35 18 19 20
decision_type=2 2 2 2 2 9 2 2 1 2 2 2 2 2 2 2 2 2 1 2 2 2 9 9 2 1 1 2 2 2 2 2 2 2 9 2 2 1 2 2 2 2 2 2 2 2 1 2 2 1 1 9 1 2 2 1 1 1 2 2 1 2 2 2 2 2 2 2 1 9 9
left_child=1 2 51 14 5 6 7 8 13 10 -10 40 -13 27 50 46 36 18 -18 20 22 33 26 -24 25 28 -19 -2 -21 34 31 -26 -32 -22 37 48 47 41 -39 -40 44 42 -4 60 -5 53 -16 55 -14 58 -3 52 -1 56 66 -6 64 -55 -45 65 -36 -49 63 -46 -7 -59 -42 -47 69 -53 -70
right_child=4 3 29 11 16 45 -8 -9 9 -11 -12 12 35 -15 15 -17 17 19 -20 24 21 -23 23 -25 30 -27 -28 -29 -30 -31 32 -33 -34 -35 43 -37 -38 38 39 -41 54 -43 -44 49 62 67 -48 61 -50 -51 -52 68 -54 57 -56 -57 -58 59 -60 -61 -62 -63 -64 -65 -66 -67 -68 -69 70 -71 -72
leaf_value=-0.022533541644181448 0.0025525652380406494 0.013377132305084444 -0.004819320548741849 -0.012459651146890526 -0.0077535257069065713 -0.0095233114485663486 -0.015185433847404764 0.084312778790926024 0.0077239087897112675 -0.014623381546374587 0.046980211004657511 0.030489507345307622 -0.013675257543448333 -0.01802980443865726 -0.022224946118306079 0.011865242226768595 0.034989825656193109 -0.019592026906871909 0.0019581623717136172 0.015386878762704951 0.039603748034050312 -0.018320669255112759 -0.0066163605751974166 0.053893306630262643 0.00045765213064853172 -0.00027552610937073876 -0.0041989464502854559 0.019846239025902983 0.033619291737009567 -0.020249516363491725 -0.0062791998679025823 0.0076870166390588246 0.00073784314677661643 0.024355463811326382 -0.020491652161502467 -0.0016036931600087398 -0.019327566118515251 -0.020402476730888137 0.0075927984701994709 -0.010698730394705057 -0.020157480555134701 -0.003906938416174525 -0.016819806205855319 -0.016151593998167839 -0.01443804268146303 -0.010764169281058049 -0.015576454225053866 -0.010697638862883283 -0.0099990207363194542 -0.0081191905963459987 0.015741056006672662 -0.024700506946297454 -0.024182619209309194 -0.0030959733452120323 -0.017224761797686765 -0.0050371395819533834 -0.0056475335256501724 -0.006005452083068321 -0.013191060221405504 -0.0042090408667361879 -0.017501132271283089 -0.0091409438189458559 -0.017831511920623051 -0.018327107309867453 -0.0083541171153964523 -0.0067891886972618921 -0.019599724515514037 -0.010605982199391364 -0.024806018745486751 -0.024829265200795585 -0.02477681776510901
leaf_weight=19.390319347381592 51.813516069203615 18.304436139762402 25.56805257499218 25.113048039376739 3.246454119682312 1.5611631982028467 5.8801423236727706 3.763246923685073 21.409440867602825 5.7582519501447669 12.227572873234747 6.2861336581409004 6.8301286920905131 6.9177209585905066 6.4021410215646046 9.5978612191975099 7.9430840387940407 42.851629465818405 18.324222706258301 23.184085011482239 6.8298698589205804 13.968018248677252 5.0184919983148575 5.3523615002632123 336.56723453104496 26.653669714927673 29.079128563404083 9.5744240134954435 9.0696439146995527 12.129843432456253 47.798283994197845 130.36678221821785 1729.7811608612537 9.8421822562813741 2.0311355739831907 7.5447947680950156 4.9902871549129477 2.551569044589999 9.4996087253093702 4.529015537351369 2.5767611078917962 16.646019071340561 7.0004837028682223 1.001088725402951 1.4614131469279519 3.132275938987731 2.0635511204600334 3.1128718815743923 6.4308863133192062 1.3089331053197382 6.8106117099523571 3.2400465849786997 15.216989055275915 1.5645964965224266 3.1806351058185101 4.1094716340303439 1.1896465793251993 1.1934718340635302 3.3395235612988472 1.7735667414963243 0.51339194364845786 2.7401877120137215 2.0814157538115978 1.3435182496905327 1.0298609510064125 1.4452600069344042 2.5310484729707241 2.8009896613657475 11.543169762939215 0.69472649227827821 1.2994750253856189
leaf_count=1504 358 143 113 91 24 31 16 2 188 30 56 28 27 32 53 37 27 116 42 47 22 32 39 11 1316 60 60 34 49 91 105 319 2099 27 88 11 8 80 61 109 36 41 219 43 34 29 42 26 14 40 75 265 1234 23 40 43 21 23 92 31 26 19 15 16 19 25 20 23 946 57 106
internal_value=0 -0.00878194 -0.0139793 -0.0021988 0.00131307 0.00720304 0.00921356 0.0105007 0.00792158 0.0166419 0.0219942 -0.0081098 0.000806707 0.00289213 0.00675145 -0.003352 0.000994653 0.00108422 0.0119467 0.000966135 -0.00400298 0.00829946 -0.00858306 0.0246125 0.00120978 0.0111073 -0.0133691 0.00524979 0.0205138 -0.00814533 0.000950021 0.00247607 0.000549158 0.0306021 -0.00616095 -0.00816146 -0.0110263 -0.00508227 -0.00171195 0.00168754 -0.014419 -0.00621772 -0.00739878 -0.0148223 -0.0131915 -0.0078327 -0.0206043 -0.00789006 -0.0118925 -0.0125406 0.0140182 -0.0237568 -0.0232586 -0.00609558 -0.0188617 -0.00623599 -0.00798525 -0.00490028 -0.0138739 -0.00554008 -0.0198883 -0.00996885 -0.0169529 -0.0163008 -0.00905859 -0.00643471 -0.0198811 -0.0106895 -0.0247843 -0.0247232 -0.0248031
internal_weight=0 246.062 137.503 108.558 2593.86 133.035 117.344 111.464 107.701 39.3953 33.637 65.3798 27.0919 68.3057 43.1786 18.0636 2460.83 2442.63 26.2673 2416.36 112.942 30.6401 82.3016 10.3709 2303.42 58.9074 71.9308 61.3879 32.2537 86.1187 2244.51 466.934 1777.58 16.6721 73.9888 20.8058 18.1993 65.7947 16.5802 14.0286 38.2878 49.2146 32.5685 8.19407 29.9994 15.6908 8.46569 13.209 13.261 5.64955 25.115 51.3847 34.6073 9.75757 8.28844 7.35593 3.78067 5.9769 4.34061 4.4123 2.54453 5.85306 4.88635 2.80493 2.59102 2.63873 5.10781 5.93327 16.7774 3.93477 12.8426
internal_count=11229 5797 5115 682 5432 941 716 700 698 274 244 332 80 424 350 132 4491 4371 69 4302 307 81 226 50 3995 156 176 392 96 1003 3839 1635 2204 49 912 52 120 623 250 170 252 373 332 289 156 225 95 112 41 175 218 4112 2738 173 96 67 71 102 135 79 114 45 65 50 50 48 56 52 1374 322 1052
cat_boundaries=0 1 2 3 4 5 6 7 8 9 10 11 12 13 14 15 16 17 18 19 20 21
cat_threshold=2 1 2 2 1 1 1 2 1 1 1 1 2 1 2 1 2 1 2 1 1
is_linear=0
shrinkage=0.05


Tree=123
num_leaves=72
num_cat=20
split_feature=2 3 2 3 2 0 3 3 3 3 1 3 3 2 2 2 2 2 1 2 3 3 0 2 2 1 1 2 2 3 2 2 2 2 0 3 3 1 2 2 3 2 2 2 2 2 1 3 3 1 0 1 1 2 3 1 1 2 1 3 1 2 2 2 2 2 2 3 1 0 0
split_gain=8.77746 3.28367 3.1252 2.19236 1.82893 1.51534 1.42967 2.67937 1.39495 7.261 1.74516 2.44721 4.21698 1.29481 1.18523 1.82645 1.0171 1.1741 2.18752 1.11726 2.42965 6.77797 4.95654 3.67669 2.22127 2.32354 1.62128 0.893676 0.814865 0.767573 0.520105 1.84798 0.875659 0.323549 0.269983 0.197939 0.187351 0.0969966 0.409156 0.390918 0.0832473 0.0520143 0.310066 0.0377925 0.0327974 0.0303679 0.0278337 0.0177039 0.0176521 0.0131192 0.0107565 0.0100958 0.00946478 0.00854663 0.00556705 0.00518978 0.00369244 0.00274862 0.00266088 0.00203168 0.00147806 0.00138454 0.00112125 0.00423211 0.000331597 0.000160477 0.000155739 1.45395e-05 7.86828e-06 3.88805e-06 4.08387e-07
threshold=6.5000000000000009 1.0000000180025095e-35 1.0000000180025095e-35 1.5000000000000002 16.500000000000004 0 5.5000000000000009 11.500000000000002 7.5000000000000009 6.5000000000000009 1 2.5000000000000004 1.0000000180025095e-35 15.500000000000002 1.0000000180025095e-35 4.5000000000000009 18.500000000000004 19.500000000000004 2 24.500000000000004 1.5000000000000002 3.5000000000000004 3 22.500000000000004 27.500000000000004 4 5 14.500000000000002 5.5000000000000009 1.0000000180025095e-35 79.500000000000014 64.500000000000014 84.500000000000014 21.500000000000004 6 104.50000000000001 8.5000000000000018 7 1.5000000000000002 2.5000000000000004 2.5000000000000004 4.5000000000000009 1.5000000000000002 1.5000000000000002 1.0000000180025095e-35 13.500000000000002 8 1.0000000180025095e-35 45.500000000000007 9 10 11 12 8.5000000000000018 3.5000000000000004 13 14 4.5000000000000009 15 1.0000000180025095e-35 16 17.500000000000004 4.5000000000000009 3.5000000000000004 7.5000000000000009 1.5000000000000002 10.500000000000002 1.0000000180025095e-35 17 18 19
decision_type=2 2 2 2 2 9 2 2 2 2 1 2 2 2 2 2 2 2 1 2 2 2 9 2 2 1 1 2 2 2 2 2 2 2 9 2 2 1 2 2 2 2 2 2 2 2 1 2 2 1 9 1 1 2 2 1 1 2 1 2 1 2 2 2 2 2 2 2 1 9 9
left_child=1 2 50 14 5 8 40 -8 9 10 13 12 -12 27 51 46 36 18 -18 20 22 33 26 -24 25 29 -19 -2 34 -21 31 -26 -32 -22 37 48 47 41 -39 -40 44 42 -4 60 -5 53 -16 55 -9 57 52 -3 -1 56 65 -6 64 -45 59 66 -36 -49 63 -46 -7 -42 -55 -47 69 -52 -70
right_child=4 3 28 6 16 45 7 35 -10 -11 11 -13 -14 -15 15 -17 17 19 -20 24 21 -23 23 -25 30 -27 -28 -29 -30 -31 32 -33 -34 -35 43 -37 -38 38 39 -41 54 -43 -44 49 62 67 -48 61 -50 -51 68 -53 -54 58 -56 -57 -58 -59 -60 -61 -62 -63 -64 -65 -66 -67 -68 -69 70 -71 -72
leaf_value=-0.022481222650965835 0.0024827610426641413 0.012869446566653234 -0.0047226532628468054 -0.012304565575725485 -0.0076206137113008819 -0.0093768517696448932 0.028828315852071247 -0.013521675879761589 -0.015037870504937739 0.075487960198057258 0.0074734386986424137 -0.014473040749343791 0.043684606251073066 -0.017906099166099875 -0.022166415855478686 0.011432427315892595 0.0019057598562749448 -0.019488407997472881 0.032932959686235642 0.014772815401130013 0.037101828865685513 -0.018200328735478909 0.048084412242159119 -0.011611582129705256 0.00044608215387693717 -0.00026876064805378207 -0.0041121387270207877 0.018968340028426425 -0.020155833077144265 0.03168695475497936 -0.0061623538735864599 0.007438021907048115 0.00071898557332638387 0.023172017412768253 -0.017371752376336078 -0.0015664165546665249 -0.019220198419401931 -0.020311231977097 0.0073475567451610256 -0.010546739754935107 -0.020062353240979224 -0.0038250354245057462 -0.01668394817066806 -0.012867313823366902 -0.014286925765495015 -0.010611952602226624 -0.015431200182145341 -0.010545652525777615 -0.0098499891374733591 -0.0079829658797359714 -0.024697287992425272 0.015107437939939086 -0.024166790021283122 -0.0058920663942492214 -0.017092641542140689 -0.0049371924562413381 -0.0055388975887489325 -0.015601541140373413 -0.0030285835020024952 -0.004122066565494931 -0.020401851068531859 -0.0089968805747006834 -0.017705611921655054 -0.018206843234516292 -0.0082159050644850917 -0.019496215853342973 -0.0066662944650371578 -0.010454327624980093 -0.024805436271062943 -0.024829265556762181 -0.02477550206219295
leaf_weight=18.958273410797119 51.945942092686892 18.550941608846188 25.445127844810486 24.802089355885986 3.2213800027966499 1.546366333961485 6.4807465374469784 6.7373608313500899 5.7915244959294787 4.0942962914705268 21.575445994734764 5.6746594086289397 12.815734557807444 6.7941136360168448 6.2614235766232031 9.7124202325940114 18.360139511525631 42.020247876644135 8.2259306758642214 23.5435741096735 7.1057858541607919 13.714444711804388 6.2348306477069837 4.3992990627884865 336.72130052745342 26.64632673561573 28.957282990217209 9.7663382440805417 11.886690255254505 9.3797423318028432 47.499089449644089 131.37277512252331 1731.0579395890236 10.084836073219774 0.50448518246412277 7.5327048301696768 4.894763082265853 2.5000381469726589 9.5720118880271894 4.4808192402124396 2.5253401156514865 16.581111997365952 6.883721971884369 2.9445396941155195 1.44046477228403 3.0987404137849799 2.0316572971642017 3.0797489546239376 6.3669041842222214 1.2983486652374265 3.1609961437061429 6.9186659362167147 14.853416271507738 1.1863260082900535 3.1263185739517212 4.0888237655162829 1.1829469315707686 1.3362706899642942 1.5597600229084481 1.7661173865199087 1.9899377599358543 2.7152538672089577 2.0446299612522125 1.3191196918487549 1.0212932340800762 2.4819236323237419 1.4354811161756513 2.7714394144713879 11.260351713746786 0.67768932133913073 1.2676737960428006
leaf_count=1504 358 143 113 91 24 31 28 27 16 2 188 30 56 32 53 37 42 116 27 47 22 32 27 23 1316 60 60 34 91 49 105 319 2099 27 26 11 8 80 61 109 36 41 219 113 34 29 42 26 14 40 265 75 1234 23 40 43 21 22 23 31 88 19 15 16 19 20 25 23 946 57 106
internal_value=0 -0.00864198 -0.0138271 -0.00215166 0.00127799 0.0069661 -0.00797518 0.000782341 0.00889349 0.0101237 0.00765875 0.0159478 0.0209674 0.0028109 0.00653606 -0.00328276 0.000968504 0.00105567 0.0115058 0.000940807 -0.00392433 0.00801539 -0.00844571 0.0233884 0.00117817 0.0107078 -0.0132152 0.0050917 -0.00800948 0.0195916 0.000925492 0.0024084 0.000535209 0.0289299 -0.0060461 -0.0080251 -0.0108734 -0.00498215 -0.00167379 0.00164187 -0.0142678 -0.00610181 -0.00726955 -0.0146729 -0.013037 -0.00769912 -0.0205164 -0.00775592 -0.0117377 -0.0123855 -0.023731 0.0134774 -0.0232217 -0.00598108 -0.0187481 -0.00611969 -0.00785023 -0.0137208 -0.0048024 -0.00543293 -0.019789 -0.00981997 -0.0168182 -0.0161607 -0.00891508 -0.0197817 -0.00631597 -0.0105375 -0.0247832 -0.0247206 -0.0248024
internal_weight=0 243.934 135.602 108.333 2597.35 134.027 64.8576 27.1177 118.458 112.667 108.572 40.0658 34.3912 68.5064 43.4751 18.0055 2463.32 2445.32 26.5861 2418.74 112.517 30.9051 81.6117 10.6341 2306.22 59.5696 70.9775 61.7123 85.4231 32.9233 2246.65 468.094 1778.56 17.1906 73.5364 20.637 18 65.4628 16.5529 14.0528 37.7399 48.91 32.3288 8.07358 29.6063 15.5685 8.29308 13.1052 13.1043 5.57916 50.1784 25.4696 33.8117 9.69829 8.13358 7.3102 3.75061 4.28081 5.94768 4.38792 2.49442 5.795 4.80421 2.75958 2.56766 5.00726 2.62181 5.87018 16.3667 3.83869 12.528
internal_count=11229 5797 5115 682 5432 941 332 80 716 700 698 274 244 424 350 132 4491 4371 69 4302 307 81 226 50 3995 156 176 392 1003 96 3839 1635 2204 49 912 52 120 623 250 170 252 373 332 289 156 225 95 112 41 175 4112 218 2738 173 96 67 71 135 102 79 114 45 65 50 50 56 48 52 1374 322 1052
cat_boundaries=0 1 2 3 4 5 6 7 8 9 10 11 12 13 14 15 16 17 18 19 20
cat_threshold=2 1 1 2 1 1 2 1 1 1 2 1 1 2 1 1 2 2 1 1
is_linear=0
shrinkage=0.05


Tree=124
num_leaves=76
num_cat=21
split_feature=2 3 2 3 2 0 3 3 2 3 3 1 3 2 2 2 2 2 2 1 2 3 3 0 2 2 1 1 1 2 3 2 2 2 2 0 2 2 3 3 1 2 2 3 2 2 2 3 2 2 2 1 3 1 0 1 1 2 3 1 1 2 1 3 1 2 2 2 2 2 2 3 1 0 0
split_gain=8.40894 3.20079 3.1121 2.09229 1.71983 1.42818 1.38898 3.22851 1.32357 2.10587 4.17009 3.24712 1.59669 1.21243 1.15834 1.10859 1.7591 0.976042 1.10058 1.98392 1.06663 2.31934 6.32553 4.70169 3.2906 2.08394 2.14281 1.60037 0.931442 0.802239 0.682104 0.498172 1.90249 1.56246 0.280726 0.263518 0.23115 0.508998 0.216983 0.185131 0.0933931 0.397244 0.372373 0.0829411 0.0607278 0.0503405 0.303574 0.0425944 0.0376835 0.0325492 0.0295963 0.0280692 0.0172451 0.0129141 0.0109966 0.00965799 0.00920241 0.00828271 0.00560013 0.00502971 0.00359169 0.00274063 0.0025647 0.00196342 0.00148974 0.00135642 0.00112231 0.00422756 0.000323923 0.000162034 0.000150966 1.42763e-05 8.0645e-06 3.98469e-06 4.1853e-07
threshold=6.5000000000000009 1.0000000180025095e-35 1.0000000180025095e-35 1.5000000000000002 16.500000000000004 0 5.5000000000000009 10.500000000000002 15.500000000000002 1.0000000180025095e-35 3.5000000000000004 1 2.5000000000000004 8.5000000000000018 7.5000000000000009 1.0000000180025095e-35 4.5000000000000009 18.500000000000004 19.500000000000004 2 24.500000000000004 1.5000000000000002 3.5000000000000004 3 22.500000000000004 27.500000000000004 4 5 6 5.5000000000000009 1.0000000180025095e-35 43.500000000000007 55.500000000000007 41.500000000000007 21.500000000000004 7 14.500000000000002 13.500000000000002 104.50000000000001 8.5000000000000018 8 1.5000000000000002 2.5000000000000004 2.5000000000000004 13.500000000000002 4.5000000000000009 1.5000000000000002 40.500000000000007 1.5000000000000002 1.0000000180025095e-35 13.500000000000002 9 1.0000000180025095e-35 10 11 12 13 8.5000000000000018 3.5000000000000004 14 15 2.5000000000000004 16 1.0000000180025095e-35 17 17.500000000000004 4.5000000000000009 3.5000000000000004 7.5000000000000009 1.5000000000000002 10.500000000000002 1.0000000180025095e-35 18 19 20
decision_type=2 2 2 2 2 9 2 2 2 2 2 1 2 2 2 2 2 2 2 1 2 2 2 9 2 2 1 1 1 2 2 2 2 2 2 9 2 2 2 2 1 2 2 2 2 2 2 2 2 2 2 1 2 1 9 1 1 2 2 1 1 2 1 2 1 2 2 2 2 2 2 2 1 9 9
left_child=1 2 54 15 5 8 43 -8 9 14 11 12 -11 -13 -2 56 51 39 19 -19 21 23 34 27 -25 26 30 -20 -10 35 -22 33 -33 -27 -23 40 37 -16 47 52 45 -42 -43 49 -12 46 -4 -9 64 -5 57 -17 59 61 55 -1 -3 60 69 -6 68 -50 -59 70 -37 -54 67 -51 -7 -45 -64 -52 74 -74 -56
right_child=4 3 29 6 17 50 7 38 28 10 44 13 -14 -15 36 16 -18 18 20 -21 25 22 -24 24 -26 31 -28 -29 -30 -31 -32 32 -34 -35 -36 48 -38 -39 -40 -41 41 42 -44 58 -46 -47 -48 -49 53 66 71 -53 65 -55 72 -57 -58 62 -60 -61 -62 -63 63 -65 -66 -67 -68 -69 -70 -71 -72 -73 73 -75 -76
leaf_value=-0.022427840085282261 0.01499524245306782 0.012387392959000702 -0.0046274720502933646 -0.012149502593464007 -0.0074889721752345222 -0.0092312749586801485 0.033392195188462363 -0.014847495616780074 0.034504780873447639 0.002695425809444655 -0.010126815785249252 0.062409144060614555 0.03208451403471925 0.030667007417898785 -0.0078350059026257128 -0.022106730678659245 0.011020227072582704 0.0018548580356193244 -0.019383302060278523 0.031061662208671487 0.014192081171040524 0.034846175648052057 -0.018078574585505797 0.04466135839375545 -0.011457209515092239 0.00098634443422988675 -0.00026215754879989177 -0.0040267712835696879 0.012057942417751717 -0.020060680501267639 0.029924203967833414 -0.0057769001997601092 0.0010503947034329764 0.013180972367605688 0.022072519532199908 -0.017241071541713563 -0.012891478764561225 0.0041315487061944151 -0.0015299485563313191 -0.0191113478307674 -0.02021852710611368 0.0071120027564099148 -0.010395309010269128 -0.019965752021654924 -0.017686616758970024 -0.0037445395968677487 -0.016546912879354787 -0.0092703429536223556 -0.015896087489342011 -0.014135227061394143 -0.010460275414058848 -0.015285052156915042 -0.010394225413168248 -0.0078479442072170794 -0.024804836746893998 -0.024150585986647682 0.014508630882048965 -0.0029624581902912596 -0.016959265396697662 -0.0048387388167685039 -0.0054317536642284336 -0.012870562584412579 -0.0057801577051220972 -0.0040365339053984057 -0.020310596360064184 -0.0088537957058487278 -0.017578360628721087 -0.018085164814329903 -0.0080788494005716149 -0.019391221322453567 -0.0065448102192379402 -0.010303259031053781 -0.024693988283951557 -0.024829263429502185 -0.024774155327506181
leaf_weight=18.536822438240051 9.6240467056632024 18.791224740445614 25.325242429971695 24.498781226575378 3.1969244778156281 1.5319340713322145 5.9247512258589294 6.9499248825013655 7.3546891212463379 16.984750956296924 6.1270031630992872 4.6007641106843939 6.3491667360067359 8.6914594024419767 20.502301823347807 6.1241573654115218 9.8240943476557714 18.395163044333458 41.209268614649773 8.5013450756669062 23.893961310386658 7.3743753135204377 13.467095248401163 6.5419536754488927 4.3485116437077522 120.43321049213409 26.639166504144669 28.838450983166695 12.436097823083403 11.649502351880072 9.6817169860005361 107.56174667179585 1987.1462421268225 33.594190135598183 10.321250572800635 0.49579705484211445 6.4965050369501105 15.684149622917174 7.520914524793624 4.8015831708908072 2.4497714638710049 9.6426016539335233 4.4338092915713778 2.4751807097345582 4.689858078956604 16.517809271812439 6.7698268536478272 6.7469901889562607 0.97245574742555607 1.420031262561678 3.0660306066274634 2.0005470737814903 3.0474416129291058 1.2880252506583927 10.984470022842288 14.498759385198353 7.0239829104393747 1.5550433211028576 3.073335625231266 4.0686861351132411 1.1764128431677821 3.2500229720026255 1.1793566606938841 1.75885234773159 1.9497506171464913 2.6909346282482147 2.0087470784783363 1.2953199967741966 1.0129367262125015 2.434004157781601 1.4259435907006262 2.7426167577505112 3.0838840734213591 0.66106998547911588 1.2366523575037689
leaf_count=1504 60 143 113 91 24 31 25 28 22 81 40 17 9 44 298 53 37 42 116 27 47 22 32 27 23 591 60 60 34 91 49 379 2787 82 27 26 38 56 11 8 80 61 109 36 17 41 219 16 43 34 29 42 26 40 946 1234 75 23 40 43 21 92 23 31 88 19 15 16 19 20 25 23 265 57 106
internal_value=0 -0.00850304 -0.0136745 -0.00210536 0.00124393 0.00673919 -0.0078417 0.000758879 0.00858805 0.00624458 0.0138728 0.0219287 0.0106922 0.0416537 -0.000674297 0.00632901 -0.00321469 0.000943083 0.00102792 0.0110864 0.00091618 -0.00384678 0.00774383 -0.00830939 0.0222535 0.00114742 0.010327 -0.0130611 0.0203997 -0.00787482 0.0187285 0.000901621 0.000699818 0.00364606 0.0273957 -0.0059327 -0.00420743 -0.00264839 -0.00835347 -0.0107211 -0.0048835 -0.0016364 0.00159752 -0.0141161 -0.0134045 -0.00598737 -0.00714164 -0.0121002 -0.0145229 -0.0128823 -0.00756679 -0.020427 -0.00762303 -0.0122305 -0.0237046 -0.0231839 0.0129646 -0.00586806 -0.018633 -0.00600486 -0.00771644 -0.0135674 -0.00470601 -0.00532728 -0.0196883 -0.00967186 -0.0166823 -0.0160195 -0.00877257 -0.0196809 -0.00619867 -0.0103861 -0.0247821 -0.0247179 -0.0248017
internal_weight=0 241.858 133.746 108.112 2600.74 134.99 64.348 27.1426 119.541 99.75 47.443 36.6261 23.3339 13.2922 52.307 43.764 17.9488 2465.75 2447.95 26.8965 2421.05 112.101 31.1627 80.9382 10.8905 2308.95 60.2148 70.0477 19.7908 84.7446 33.5757 2248.74 2094.71 154.027 17.6956 73.0951 42.683 36.1865 21.2178 17.8056 65.1391 16.5262 14.0764 37.2054 10.8169 48.6129 32.0951 13.6969 7.95605 29.2229 15.4491 8.1247 13.004 5.5105 49.0017 33.0356 25.8152 9.64048 7.98252 7.26561 3.72128 4.22248 5.9192 4.36415 2.44555 5.73838 4.7241 2.71535 2.54487 4.90918 2.6053 5.80865 15.9661 3.74495 12.2211
internal_count=11229 5797 5115 682 5432 941 332 80 716 660 208 151 90 61 452 350 132 4491 4371 69 4302 307 81 226 50 3995 156 176 56 1003 96 3839 3166 673 49 912 392 354 55 120 623 250 170 252 57 373 332 44 289 156 225 95 112 175 4112 2738 218 173 96 67 71 135 102 79 114 45 65 50 50 56 48 52 1374 322 1052
cat_boundaries=0 1 2 3 4 5 6 7 8 9 10 11 12 13 14 15 16 17 18 19 20 21
cat_threshold=2 1 1 2 1 1 2 2 1 1 1 2 1 1 2 1 2 2 1 1 1
is_linear=0
shrinkage=0.05


Tree=125
num_leaves=73
num_cat=22
split_feature=2 3 2 3 2 3 3 0 3 3 1 3 3 2 0 2 2 2 2 1 2 3 3 0 0 2 1 1 2 2 3 2 2 2 0 2 3 3 1 2 2 3 2 2 3 2 2 2 0 3 1 1 0 1 1 3 1 2 2 2 2 1 2 2 2 2 3 1 2 1 0 0
split_gain=8.05531 3.11889 3.09808 1.99695 1.61809 1.34897 2.99052 1.34673 1.27142 6.19027 1.48779 2.22343 3.28688 1.2552 1.05291 1.12924 1.93959 0.936553 1.03221 1.8036 1.01818 2.21427 5.91342 4.46413 3.17005 1.95604 1.97865 1.57917 0.869126 0.789537 0.608166 0.502166 1.72401 0.836052 0.257114 0.24481 0.210997 0.182863 0.0899016 0.385646 0.354753 0.0826011 0.0487046 0.29711 0.042019 0.0375594 0.0327683 0.0322885 0.0294334 0.0167915 0.0132448 0.0127065 0.0112413 0.00985409 0.00628709 0.00563142 0.00487288 0.00278706 0.00252819 0.00236715 0.00495118 0.00150102 0.00132827 0.00112291 0.00422125 0.000597986 0.000493622 0.000180702 0.000163556 8.26547e-06 4.08385e-06 4.29024e-07
threshold=6.5000000000000009 1.0000000180025095e-35 1.0000000180025095e-35 1.5000000000000002 16.500000000000004 5.5000000000000009 10.500000000000002 0 7.5000000000000009 6.5000000000000009 1 2.5000000000000004 1.0000000180025095e-35 15.500000000000002 2 1.0000000180025095e-35 4.5000000000000009 18.500000000000004 19.500000000000004 3 24.500000000000004 1.5000000000000002 3.5000000000000004 4 5 27.500000000000004 6 7 14.500000000000002 5.5000000000000009 1.0000000180025095e-35 79.500000000000014 64.500000000000014 84.500000000000014 8 21.500000000000004 104.50000000000001 8.5000000000000018 9 1.5000000000000002 2.5000000000000004 2.5000000000000004 4.5000000000000009 1.5000000000000002 40.500000000000007 1.5000000000000002 1.0000000180025095e-35 1.0000000180025095e-35 10 1.0000000180025095e-35 11 12 13 14 15 3.5000000000000004 16 4.5000000000000009 9.5000000000000018 13.500000000000002 8.5000000000000018 17 17.500000000000004 4.5000000000000009 3.5000000000000004 4.5000000000000009 1.0000000180025095e-35 18 1.5000000000000002 19 20 21
decision_type=2 2 2 2 2 2 2 9 2 2 1 2 2 2 9 2 2 2 2 1 2 2 2 9 9 2 1 1 2 2 2 2 2 2 9 2 2 2 1 2 2 2 2 2 2 2 2 2 9 2 1 1 9 1 1 2 1 2 2 2 2 1 2 2 2 2 2 1 2 1 9 9
left_child=1 2 52 14 7 41 -7 8 9 10 13 12 -12 28 15 54 -17 37 19 -19 21 23 35 27 -25 26 30 -20 -2 34 -22 32 -27 -33 38 -23 44 49 42 -40 -41 47 43 -4 -8 61 67 -5 50 56 58 57 53 -1 -3 68 -6 -47 -9 60 -52 -36 -51 64 -49 -48 -62 -16 -43 70 -54 -71
right_child=4 3 29 5 17 6 36 48 -10 -11 11 -13 -14 -15 46 16 -18 18 20 -21 25 22 -24 24 -26 31 -28 -29 -30 -31 -32 33 -34 -35 45 -37 -38 -39 39 40 -42 55 -44 -45 -46 51 65 63 -50 62 59 -53 69 -55 -56 -57 -58 -59 -60 -61 66 -63 -64 -65 -66 -67 -68 -69 -70 71 -72 -73
leaf_value=-0.022373371776656492 0.0022605926691044594 0.015090962091068428 -0.0045337710595152146 -0.011994510632757071 -0.007358623942986699 0.031480153195212197 -0.014698185689346166 -0.0052135242051307047 -0.014823036516493688 0.067152004807029569 0.007095328459261814 -0.014477364376609273 0.038176397927853482 -0.017865493274612218 -0.021081569237982108 -0.021930010068761455 0.013741880129640678 0.001805408283205284 -0.01927671150541653 0.029352281641409864 0.013642197994608647 0.032802526381008598 -0.01795542162905335 -0.0072737642898515866 0.046185426157039113 0.00043300116392486942 -0.00025571643239694005 -0.0039428362863970527 0.018422065781106816 -0.019964054443114446 0.028310023057652962 -0.0060666851005058984 0.007165283000130915 0.00067382096377312586 -0.020217880791577058 0.021048620457151706 -0.0014942746041721985 -0.019001020051850476 -0.020124356556947116 0.0068856421629889079 -0.010244480704646064 -0.01986767188688407 -0.0036654391174242929 -0.016408725341132985 -0.0091254359639505785 -0.012543025635250463 -0.011620446385553623 -0.013982990681348518 -0.01188889700892464 -0.010243401945081786 -0.0085935567302936992 -0.0077141515982517049 -0.024690607209223454 -0.024133994291477157 0.016908438826946186 -0.016824658031320713 -0.004741775221557604 -0.015335032037229924 -0.0023480658360948859 -0.008392245098523092 -0.0060747234900051768 -0.017109108521599178 -0.0087117241935950572 -0.017449774412523197 -0.017962086758835021 -0.013206962961589803 -0.0048970101434492553 -0.020051302700010799 -0.019284741737701054 -0.024804223061896447 -0.02482926413647504 -0.024772772143603142
leaf_weight=18.125708699226379 52.371959026902914 17.362484335899353 25.208322241902355 24.202933691442016 3.1730721294879913 6.1259318813681629 6.8474981635808962 1.3352738469839098 5.6671801917254916 4.4653486758470526 21.830982573330402 5.677029848098754 13.936137624084948 6.7544963359832755 1.6629629060626021 6.7298081256449196 8.7849769294261932 18.429315067827702 40.418188735842705 8.7695549577474612 24.235483378171921 7.6358739063143792 13.225816987454889 5.2064203396439552 5.9333027601242048 336.89565807580948 26.632183685898781 28.722558468580246 9.8896896541118604 11.418133463710545 9.9758128970861417 47.256895393133163 132.49266886711121 1734.1235501170158 1.9105495139956465 10.55159956216812 7.5094168186187735 4.7106896042823783 2.4007380008697536 9.711424380540846 4.3879573903977862 2.4262520112097254 16.456073015928268 6.6587288863956919 6.6847322583198547 2.866820327937603 1.230650441721082 1.4001000244170418 2.9875894300639603 3.0159298777580261 2.205209653824566 1.2779564689844845 3.008663235232234 14.152801187708972 6.5546431541442898 3.0216535776853561 4.0490463897585887 1.2987608090043066 1.8175887390971182 3.2885978743433952 2.2084664590656762 0.48732225410640251 2.6672148257493973 1.9737451635301111 1.2721045315265656 1.1479797773063181 1.4899994395673273 0.5719911251217128 2.3872605226933956 10.715353770181537 0.64485818613320622 1.2063917554914922
leaf_count=1504 358 75 113 91 24 25 28 23 16 2 188 30 56 32 68 57 18 42 116 27 47 22 32 39 11 1316 60 60 34 91 49 105 319 2099 88 27 11 8 80 61 109 36 41 219 16 113 38 34 35 26 43 40 265 1234 52 40 43 22 23 34 41 26 19 15 16 19 26 23 20 946 57 106
internal_value=0 -0.00836522 -0.0135215 -0.00206011 0.00121085 -0.00770965 0.000735334 0.00652189 0.00829652 0.00943659 0.00710345 0.0145917 0.0192056 0.00260675 0.00612988 0.00877418 -0.00173142 0.00091836 0.00100094 0.0106872 0.000892224 -0.0037703 0.00748401 -0.00817405 0.0212 0.00111751 0.00996377 -0.0129067 0.00482769 -0.00774137 0.0179192 0.000878375 0.0023333 0.000495007 -0.00582076 0.0259834 -0.00821552 -0.0105692 -0.00478632 -0.00159976 0.00155447 -0.0139639 -0.00587439 -0.00701508 -0.0119453 -0.0143722 -0.0164707 -0.0127274 -0.00743574 -0.0074914 -0.00635805 -0.0120755 -0.0236777 -0.0231453 0.0155891 -0.0185165 -0.0058915 -0.0134135 -0.00356162 -0.0073172 -0.00671835 -0.0195861 -0.00952455 -0.0165453 -0.0158772 -0.0123861 -0.00560026 -0.0208179 -0.0195786 -0.0247809 -0.0247151 -0.024801
internal_weight=0 239.834 131.937 107.897 2604.05 63.8516 27.1676 135.926 120.593 114.926 110.46 41.4442 35.7671 69.0161 44.0455 39.4319 15.5148 2468.12 2450.5 27.1989 2423.31 111.694 31.4133 80.2805 11.1397 2311.61 60.8435 69.1407 62.2616 84.0828 34.2113 2250.77 469.388 1781.38 72.6647 18.1875 21.0416 17.616 64.8232 16.5001 14.0994 36.684 48.3231 31.8671 13.5322 7.84141 4.61358 28.8489 15.3327 12.9053 12.3451 5.44354 47.8538 32.2785 23.9171 7.83517 7.22212 4.16558 3.15286 9.19227 5.90368 2.39787 5.68314 4.64595 2.6722 2.37863 3.69847 2.23495 4.81351 15.5753 3.65352 11.9217
internal_count=11229 5797 5115 682 5432 332 80 941 716 700 698 274 244 424 350 202 75 4491 4371 69 4302 307 81 226 50 3995 156 176 392 1003 96 3839 1635 2204 912 49 55 120 623 250 170 252 373 332 44 289 148 156 225 112 190 175 4112 2738 127 96 67 135 46 144 110 114 45 65 50 57 67 91 56 1374 322 1052
cat_boundaries=0 1 2 3 4 5 6 7 8 9 10 11 12 13 14 15 16 17 18 19 20 21 22
cat_threshold=2 1 2 1 2 1 1 1 2 1 1 2 1 2 1 1 2 1 1 2 1 1
is_linear=0
shrinkage=0.05


Tree=126
num_leaves=73
num_cat=21
split_feature=2 3 2 3 2 3 3 0 3 3 3 1 3 3 0 2 2 2 2 1 2 3 3 0 0 2 1 2 2 3 2 2 2 0 2 3 3 1 2 2 3 2 2 3 2 2 2 0 3 1 1 0 1 2 1 3 1 2 2 2 2 1 2 2 2 2 3 1 2 1 0 0
split_gain=7.71608 3.03793 3.08316 1.9057 1.52272 1.30981 2.77516 1.2704 1.20531 5.4012 1.431 1.39757 1.65356 1.59323 1.00292 1.05 1.86352 0.898573 0.96857 1.64332 0.971864 2.11417 5.53687 4.24196 2.83584 1.83681 1.82927 1.57302 0.776769 0.543911 0.47568 1.62293 0.799067 0.250776 0.214484 0.205107 0.180553 0.0865199 0.374355 0.338007 0.0822274 0.0471069 0.290678 0.0414326 0.0374204 0.0327668 0.0320154 0.0287287 0.0163434 0.0128174 0.0124966 0.0114907 0.0100531 0.00870136 0.00569471 0.00566089 0.0047193 0.00277883 0.00243153 0.00230281 0.00480935 0.00151189 0.00130012 0.00112305 0.00421318 0.000590499 0.000477376 0.000182934 0.000165043 8.47211e-06 4.1857e-06 4.3977e-07
threshold=6.5000000000000009 1.0000000180025095e-35 1.0000000180025095e-35 1.5000000000000002 16.500000000000004 5.5000000000000009 10.500000000000002 0 7.5000000000000009 6.5000000000000009 3.5000000000000004 1 2.5000000000000004 1.0000000180025095e-35 2 1.0000000180025095e-35 4.5000000000000009 18.500000000000004 19.500000000000004 3 24.500000000000004 1.5000000000000002 3.5000000000000004 4 5 27.500000000000004 6 22.500000000000004 5.5000000000000009 1.0000000180025095e-35 79.500000000000014 64.500000000000014 84.500000000000014 7 21.500000000000004 104.50000000000001 8.5000000000000018 8 1.5000000000000002 2.5000000000000004 2.5000000000000004 4.5000000000000009 1.5000000000000002 40.500000000000007 1.5000000000000002 1.0000000180025095e-35 1.0000000180025095e-35 9 1.0000000180025095e-35 10 11 12 13 13.500000000000002 14 3.5000000000000004 15 2.5000000000000004 9.5000000000000018 13.500000000000002 8.5000000000000018 16 17.500000000000004 4.5000000000000009 3.5000000000000004 4.5000000000000009 1.0000000180025095e-35 17 1.5000000000000002 18 19 20
decision_type=2 2 2 2 2 2 2 9 2 2 2 1 2 2 9 2 2 2 2 1 2 2 2 9 9 2 1 2 2 2 2 2 2 9 2 2 2 1 2 2 2 2 2 2 2 2 2 9 2 1 1 9 1 2 1 2 1 2 2 2 2 1 2 2 2 2 2 1 2 1 9 9
left_child=1 2 51 14 7 40 -7 8 9 10 11 12 -2 -13 15 54 -17 36 19 -19 21 23 34 27 -25 26 29 -20 33 -22 31 -27 -32 37 -23 43 48 41 -39 -40 46 42 -4 -8 61 67 -5 49 56 58 57 52 -1 -12 -3 68 -6 -46 -9 60 -51 -35 -50 64 -48 -47 -62 -16 -42 71 -71 -53
right_child=4 3 28 5 17 6 35 47 -10 -11 53 13 -14 -15 45 16 -18 18 20 -21 25 22 -24 24 -26 30 -28 -29 -30 -31 32 -33 -34 44 -36 -37 -38 38 39 -41 55 -43 -44 -45 50 65 63 -49 62 59 -52 69 -54 -55 -56 -57 -58 -59 -60 -61 66 -63 -64 -65 -66 -67 -68 -69 -70 70 -72 -73
leaf_value=-0.022317807390282905 0.0010650562156351328 0.014493050114272751 -0.0044415488154719183 -0.011839636307388927 -0.0046462988751236533 0.029735134853341345 -0.014548177193996883 -0.0051109901050123904 -0.01467360882168324 0.061178107373811852 -0.012931580835400134 0.0068696149210433046 0.026761436263759764 0.02714727981837747 -0.019954532129847116 -0.021865726638329773 0.01321546641039918 0.0017573654260703523 -0.018459906598720651 0.027785042847598862 0.013120925813813156 0.030942728678281173 -0.017830884828438351 -0.0071456044353744065 0.042980172246480833 0.00042206490986054546 -0.00024943243145694478 -0.0026580636902470579 -0.019865948516342821 0.026826742282731325 -0.0059525124152939972 0.006936852694778714 0.00065664223372334995 -0.020123698630151975 0.020093046550672913 -0.0014593796081077519 -0.018889218702970698 -0.02002871368210013 0.0066680135115041936 -0.010094299282937322 -0.01976811146415439 -0.0035877222704439773 -0.016269415077222262 -0.0089814756774743397 -0.015638389851229596 -0.011466058862070789 -0.013830262145260182 -0.011734132102680261 -0.01009322514737949 -0.0084534328255246004 -0.0075816121606288095 -0.024803594299010488 -0.024117011676291281 -0.016408171373411457 0.016208651580942361 -0.016688843821582765 -0.0072295897938477495 -0.012548894351671298 -0.0022952165213913915 -0.0082537214016338272 -0.0059604478826256937 -0.016975886334509579 -0.0085706989819745154 -0.017319874055561086 -0.017837624720986073 -0.01305244920342704 -0.0047991621979008806 -0.02100172428458412 -0.019176779004303764 -0.024687138039798075 -0.024829265186697699 -0.024771355028610421
leaf_weight=17.724678665399551 57.735291182994843 17.626487463712692 25.094291508197788 23.914365999400619 4.0298921838402748 6.3218447007238892 6.7475884519517439 1.3283304870128634 5.5837949737906447 4.7755028754472724 3.570722669363021 21.986431442201138 7.0220483690500251 17.315898843109608 0.56063616089522839 6.5838299952447388 8.9065320529043674 18.462617188692093 43.601426497101784 9.030776649713518 24.568374872207642 7.8905032947659555 12.990460984408854 5.1686873510479927 6.2137615084648115 337.04156588762999 26.62537420541048 24.654626816511154 11.192441802471874 10.262264020740984 46.971070438623428 133.44542632997036 1735.2924354672432 1.8723101913928977 10.776049971580504 7.4982042610645285 4.6220266819000235 2.3529076576232937 9.7785246074199659 4.34323452040553 2.3785236328840247 16.395865350961685 6.5503591410815707 6.6240086555480957 0.94518945552408684 1.2164324913173916 1.380658669397234 2.952280625700948 2.9851942360401154 2.1863403096795064 1.2681360710412262 10.452836440876126 13.815325619652869 3.6288740560412407 6.6664136648178127 2.9712405800819397 3.149808421730997 3.1648930236697197 1.8133259192109106 3.2611146010458469 2.1950913257896905 0.47905554994940769 2.6440797299146652 1.9396025016903875 1.2494588196277618 1.1329181417822836 1.4827207401394842 1.6282719075679772 2.3416639417409897 2.9352872306481004 0.62904394324868862 1.1768732331693144
leaf_count=1504 388 75 113 91 43 25 28 23 16 2 27 188 10 68 23 57 18 42 118 27 47 22 32 39 11 1316 60 58 91 49 105 319 2099 88 27 11 8 80 61 109 36 41 219 16 43 38 34 35 26 43 40 946 1234 17 52 40 24 92 23 34 41 26 19 15 16 19 26 68 20 265 57 106
internal_value=0 -0.0082286 -0.0133682 -0.00201604 0.00117871 -0.00757876 0.000712708 0.00631289 0.00801714 0.00910906 0.00687413 0.00836567 0.00385148 0.0158036 0.00593707 0.00847741 -0.00169501 0.000894331 0.000974715 0.0103067 0.000868936 -0.00369494 0.00723524 -0.00803979 0.0202184 0.00108842 0.00961699 -0.0127522 -0.00760915 0.0171591 0.000855761 0.00226987 0.00048246 -0.00571028 0.0246793 -0.00807872 -0.0104179 -0.00469062 -0.00156387 0.00151266 -0.0138111 -0.00576288 -0.00688989 -0.0117906 -0.0142209 -0.016332 -0.0125724 -0.007306 -0.00736107 -0.00624028 -0.0119206 -0.0236501 -0.0231059 -0.0146839 0.0149638 -0.0183985 -0.00577962 -0.0132594 -0.00348576 -0.00718861 -0.00659629 -0.0194824 -0.00937809 -0.0164071 -0.015734 -0.0122311 -0.00549227 -0.0207335 -0.0194748 -0.0247797 -0.0247122 -0.0248003
internal_weight=0 237.86 130.171 107.689 2607.26 63.3672 27.1916 136.838 121.619 116.035 111.259 104.06 64.7573 39.3023 44.3215 39.7833 15.4904 2470.43 2453 27.4934 2425.5 111.296 31.657 79.6385 11.3824 2314.21 61.456 68.2561 83.4372 34.8306 2252.75 470.487 1782.26 72.2448 18.6666 20.8698 17.431 64.5152 16.4747 14.1218 36.1755 48.0405 31.6447 13.3716 7.72958 4.53826 28.4841 15.2192 12.809 12.2669 5.37822 46.734 31.54 7.1996 24.2929 7.69143 7.1797 4.11008 3.14166 9.12527 5.86415 2.35137 5.62927 4.56972 2.63012 2.34935 3.67781 2.18891 4.72019 15.194 3.56433 11.6297
internal_count=11229 5797 5115 682 5432 332 80 941 716 700 698 654 398 256 350 202 75 4491 4371 69 4302 307 81 226 50 3995 156 176 1003 96 3839 1635 2204 912 49 55 120 623 250 170 252 373 332 44 289 148 156 225 112 190 175 4112 2738 44 127 96 67 135 46 144 110 114 45 65 50 57 67 91 56 1374 322 1052
cat_boundaries=0 1 2 3 4 5 6 7 8 9 10 11 12 13 14 15 16 17 18 19 20 21
cat_threshold=2 1 2 1 2 1 1 2 1 1 2 1 2 1 1 1 1 2 1 1 1
is_linear=0
shrinkage=0.05


Tree=127
num_leaves=75
num_cat=21
split_feature=2 3 2 3 2 3 3 0 3 3 3 1 3 3 0 2 2 2 2 1 2 3 3 0 2 2 1 1 2 3 2 2 2 0 3 2 3 1 2 2 3 2 2 3 2 2 2 2 3 1 0 1 2 2 3 1 1 1 2 3 1 1 2 2 2 2 2 1 2 2 1 3 0 0
split_gain=7.39049 2.95813 3.06736 1.81868 1.43387 1.27148 2.5796 1.19902 1.14329 4.74454 1.36022 1.29136 1.52225 1.43985 0.955653 0.977204 1.79121 0.862046 0.909289 1.50035 0.92757 2.01874 5.19184 4.03397 2.81359 1.7256 1.69308 1.57933 0.763947 0.487836 0.478718 1.80128 1.45779 0.244506 0.199317 0.188718 0.1782 0.0832457 0.363363 0.322087 0.0818204 0.045547 0.284283 0.0408359 0.0372666 0.032753 0.0317303 0.0285377 0.0159009 0.0122848 0.0117449 0.0102549 0.00865158 0.00771427 0.00568846 0.00516836 0.00456902 0.00333126 0.0028232 0.00238987 0.00375877 0.00152234 0.00127201 0.00112273 0.00420335 0.000582833 0.000326097 0.000185144 0.00016649 4.65764e-05 8.68294e-06 8.43673e-06 4.28957e-06 4.50831e-07
threshold=6.5000000000000009 1.0000000180025095e-35 1.0000000180025095e-35 1.5000000000000002 16.500000000000004 5.5000000000000009 10.500000000000002 0 7.5000000000000009 6.5000000000000009 3.5000000000000004 1 2.5000000000000004 1.0000000180025095e-35 2 1.0000000180025095e-35 4.5000000000000009 18.500000000000004 19.500000000000004 3 24.500000000000004 1.5000000000000002 3.5000000000000004 4 22.500000000000004 27.500000000000004 5 6 5.5000000000000009 1.0000000180025095e-35 43.500000000000007 55.500000000000007 41.500000000000007 7 104.50000000000001 21.500000000000004 8.5000000000000018 8 1.5000000000000002 2.5000000000000004 2.5000000000000004 4.5000000000000009 1.5000000000000002 40.500000000000007 1.5000000000000002 1.0000000180025095e-35 1.0000000180025095e-35 13.500000000000002 1.0000000180025095e-35 9 10 11 13.500000000000002 8.5000000000000018 3.5000000000000004 12 13 14 4.5000000000000009 1.5000000000000002 15 16 17.500000000000004 4.5000000000000009 3.5000000000000004 4.5000000000000009 7.5000000000000009 17 1.5000000000000002 10.500000000000002 18 1.0000000180025095e-35 19 20
decision_type=2 2 2 2 2 2 2 9 2 2 2 1 2 2 9 2 2 2 2 1 2 2 2 9 2 2 1 1 2 2 2 2 2 9 2 2 2 1 2 2 2 2 2 2 2 2 2 2 2 1 9 1 2 2 2 1 1 1 2 2 1 1 2 2 2 2 2 1 2 2 1 2 9 9
left_child=1 2 50 14 7 40 -7 8 9 10 11 12 -2 -13 15 55 -17 36 19 -19 21 23 35 27 -25 26 29 -20 33 -22 32 -32 -27 37 43 -23 48 41 -39 -40 46 42 -4 -8 61 67 -5 53 56 58 51 -1 -12 57 68 -3 -6 66 -46 60 -55 -35 -50 64 -48 -47 -9 -16 -42 -62 72 -49 -52 -72
right_child=4 3 28 5 17 6 34 47 -10 -11 52 13 -14 -15 45 16 -18 18 20 -21 25 22 -24 24 -26 30 -28 -29 -30 -31 31 -33 -34 44 -36 -37 -38 38 39 -41 54 -43 -44 -45 49 65 63 71 62 -51 70 -53 -54 59 -56 -57 -58 -59 -60 -61 69 -63 -64 -65 -66 -67 -68 -69 -70 -71 73 -73 -74 -75
leaf_value=-0.022261126375063733 0.0010374916653962849 0.013927259662371455 -0.0043507942262089403 -0.011684930033474233 -0.0071018905157561266 0.02813654091853697 -0.014397512631821175 -0.0088055757925429058 -0.014523489723522269 0.056074059079105655 -0.012776725609322621 0.0066526018862766217 0.02539910594051439 0.025755236781464338 -0.019856281373574352 -0.021800213338863218 0.012715994019905308 0.0017106841618975369 -0.0190976085209335 0.026343274076395917 0.012626236434091997 0.029243417980967298 -0.017704978109316594 0.038756496336233008 -0.011817932454677986 0.00093885163460287469 -0.00024329961974504607 -0.0035843648160486133 -0.019766362128043093 0.025459402416314166 -0.0056828964768326643 0.00097535455702808479 0.012651187180855417 -0.020028047075322204 -0.0014252492226598345 0.019199428853492233 -0.018775949678534121 -0.019931596293805171 0.0064586883019191925 -0.009944806741779489 -0.019667066500290348 -0.0035113757871097859 -0.016129012273993066 -0.008838497943494247 -0.012217852100088271 -0.011311953391565403 -0.013677086343112089 -0.010045910605251179 -0.009943737685417918 -0.0074503501961466741 -0.024683588537954007 -0.024099624892363863 -0.016268856747960567 -0.0024276038424488259 -0.016551849386899437 0.015548845206159005 -0.0045523043264986077 -0.0050885494999947777 -0.015066570053114776 -0.0026169187384093694 -0.0056095759252947205 -0.016841430654955285 -0.008430752978070194 -0.01718867933607502 -0.017711790524241693 -0.012897725594095397 -0.0076338667367801373 -0.020920488250737494 -0.019067336843525285 -0.0059877619008251648 -0.024802949568967961 -0.009923562788573724 -0.02482926391643335 -0.024769900493002442
leaf_weight=17.333484411239624 57.796815391629934 17.88380965590477 24.983081191778187 23.632897727191452 3.1271186545491219 6.5126482658088234 6.6501339748501795 1.4912353567779049 5.502458728849887 5.0767809003591529 3.5248448327183715 22.137989602982998 7.2125055044889441 17.792417138814926 0.54955983348190784 6.4414321370422813 9.0250169821083546 18.495091117918491 39.155197083950043 9.2852154597640055 24.892858728766441 8.1384736299514824 12.760882511734961 7.1494692265987378 4.4690690189599991 120.6551817804575 26.618733406066895 28.237914815545082 10.972287118434904 10.541293285787104 107.03364598751068 1992.9248905479908 34.069043666124344 1.8350088596343985 7.4872692823410025 10.994763717055319 4.5355397015810004 2.3062506318092373 9.8439450562000257 4.2996130920946589 2.3319664150476447 16.337147176265717 6.4446509182453147 6.5647817403078079 2.7929019276052713 1.2025644965469839 1.3616952393203965 2.9800923839211455 2.9552155546844006 1.2585578858852384 2.8637104015797377 13.48612696491182 3.5698167234659195 1.1002952605485916 2.9220655113458633 6.7753481864929226 4.0112115293741244 1.1559601761400702 1.263046510517597 1.4585555605590341 1.5595345608890059 0.47099176980555069 2.6215149313211441 1.9062981083989141 1.2273690812289715 1.1182268559932707 0.98672393336892117 1.5944320634007447 2.2971861604601145 1.7033309042453764 10.19675768725574 2.6727534830570221 0.61361759528517756 1.1480786260217399
leaf_count=1504 388 75 113 91 24 25 28 31 16 2 27 188 10 68 23 57 18 42 116 27 47 22 32 27 23 591 60 60 91 49 379 2787 82 88 11 27 8 80 61 109 36 41 219 16 113 38 34 29 26 40 265 1234 17 17 40 52 43 21 22 24 31 26 19 15 16 19 19 68 20 30 946 23 57 106
internal_value=0 -0.00809309 -0.0132145 -0.00197274 0.00114753 -0.00744907 0.000690946 0.00611292 0.00775057 0.00879712 0.00665479 0.00808729 0.00374031 0.0151645 0.00575156 0.00819324 -0.00165924 0.000870966 0.000949217 0.00994382 0.000846289 -0.00362067 0.00699686 -0.00790659 0.019303 0.00106013 0.00928566 -0.0125975 -0.0074782 0.016444 0.000833749 0.000635987 0.00351781 -0.00560127 -0.0079431 0.0234717 -0.0102672 -0.00459638 -0.00152872 0.00147206 -0.0136579 -0.00565286 -0.00676607 -0.011636 -0.0140691 -0.0161922 -0.0124173 -0.00717758 -0.00723205 -0.0117659 -0.0236219 -0.0230656 -0.0145339 -0.00549739 -0.0182791 0.0143728 -0.00566921 -0.00730502 -0.013105 -0.00436907 -0.00495479 -0.0193772 -0.00923251 -0.0162678 -0.0155898 -0.012076 -0.008339 -0.0206477 -0.0193695 -0.005807 -0.0247784 -0.00998806 -0.0247093 -0.0247996
internal_weight=0 235.934 128.449 107.485 2610.39 62.8943 27.2148 137.722 122.614 117.111 112.034 104.94 65.0093 39.9304 44.5904 40.1256 15.4664 2472.67 2455.42 27.7803 2427.64 110.906 31.8941 79.0117 11.6185 2316.74 62.0529 67.3931 82.8075 35.4342 2254.68 2099.96 154.724 71.8352 20.7022 19.1332 17.2506 64.2147 16.4498 14.1436 35.6795 47.7649 31.4277 13.2149 7.62051 4.46478 28.1283 15.1085 12.7151 5.31451 45.6418 30.8196 7.09466 9.45564 7.55122 24.6592 7.13833 3.63392 4.05595 5.82172 4.36316 2.306 5.57673 4.49536 2.58906 2.32079 2.47796 2.14399 4.62915 3.26287 14.8222 5.65285 3.47733 11.3448
internal_count=11229 5797 5115 682 5432 332 80 941 716 700 698 654 398 256 350 202 75 4491 4371 69 4302 307 81 226 50 3995 156 176 1003 96 3839 3166 673 912 55 49 120 623 250 170 252 373 332 44 289 148 156 225 112 175 4112 2738 44 173 96 127 67 71 135 102 78 114 45 65 50 57 50 91 56 61 1374 52 322 1052
cat_boundaries=0 1 2 3 4 5 6 7 8 9 10 11 12 13 14 15 16 17 18 19 20 21
cat_threshold=2 1 2 1 2 1 1 2 1 1 2 1 1 2 1 2 1 2 2 1 1
is_linear=0
shrinkage=0.05


Tree=128
num_leaves=73
num_cat=21
split_feature=2 3 2 3 2 3 3 0 3 3 3 1 3 3 0 2 2 2 2 1 2 3 3 0 0 2 2 1 2 2 2 2 3 0 3 3 2 3 1 2 2 2 2 3 2 2 2 0 3 1 1 0 1 2 2 1 1 2 2 2 2 1 2 2 2 2 3 1 3 1 0 0
split_gain=7.07795 2.8795 3.05067 1.73567 1.35069 1.23397 2.40145 1.13209 1.08496 4.1921 1.29341 1.1945 1.40353 1.30424 0.910922 0.910227 1.72239 0.826918 0.854027 1.37242 0.885241 1.92778 4.87485 3.83864 2.48712 1.6218 1.56948 1.56871 0.751081 0.459356 1.51497 0.762906 0.438708 0.238307 0.193626 0.175809 0.166702 0.0813804 0.0800767 0.352661 0.306947 0.0440249 0.27793 0.0402296 0.037098 0.0327266 0.0314336 0.0280869 0.0154644 0.0121877 0.0120712 0.0120038 0.0104596 0.00859824 0.00571561 0.00469942 0.00442202 0.00281474 0.00240887 0.00208035 0.0045077 0.00153234 0.00124396 0.00112194 0.00419176 0.000574996 0.000433093 0.000187332 6.20152e-05 8.8993e-06 4.39639e-06 4.62041e-07
threshold=6.5000000000000009 1.0000000180025095e-35 1.0000000180025095e-35 1.5000000000000002 16.500000000000004 5.5000000000000009 10.500000000000002 0 7.5000000000000009 6.5000000000000009 3.5000000000000004 1 2.5000000000000004 1.0000000180025095e-35 2 1.0000000180025095e-35 4.5000000000000009 18.500000000000004 19.500000000000004 3 24.500000000000004 1.5000000000000002 3.5000000000000004 4 5 27.500000000000004 22.500000000000004 6 5.5000000000000009 79.500000000000014 64.500000000000014 84.500000000000014 1.0000000180025095e-35 7 104.50000000000001 8.5000000000000018 21.500000000000004 2.5000000000000004 8 1.5000000000000002 2.5000000000000004 4.5000000000000009 1.5000000000000002 40.500000000000007 1.5000000000000002 1.0000000180025095e-35 1.0000000180025095e-35 9 1.0000000180025095e-35 10 11 12 13 13.500000000000002 1.5000000000000002 14 15 2.5000000000000004 10.500000000000002 13.500000000000002 8.5000000000000018 16 17.500000000000004 4.5000000000000009 3.5000000000000004 4.5000000000000009 1.0000000180025095e-35 17 3.5000000000000004 18 19 20
decision_type=2 2 2 2 2 2 2 9 2 2 2 1 2 2 9 2 2 2 2 1 2 2 2 9 9 2 2 1 2 2 2 2 2 9 2 2 2 2 1 2 2 2 2 2 2 2 2 9 2 1 1 9 1 2 2 1 1 2 2 2 2 1 2 2 2 2 2 1 2 1 9 9
left_child=1 2 51 14 7 37 -7 8 9 10 11 12 -2 -13 15 55 -17 35 19 -19 21 23 36 26 -25 27 -20 32 33 30 -27 -31 -22 38 43 48 -23 46 41 -40 -41 42 -4 -8 61 67 -5 49 56 58 57 52 -1 -12 68 -3 -6 -46 -9 60 -51 -35 -50 64 -48 -47 -62 -16 -39 70 -53 -71
right_child=4 3 28 5 17 6 34 47 -10 -11 53 13 -14 -15 45 16 -18 18 20 -21 25 22 -24 24 -26 29 -28 -29 -30 31 -32 -33 -34 44 -36 -37 -38 54 39 40 -42 -43 -44 -45 50 65 63 -49 62 59 -52 69 -54 -55 -56 -57 -58 -59 -60 -61 66 -63 -64 -65 -66 -67 -68 -69 -70 71 -72 -73
leaf_value=-0.022203314529632329 0.0010106691819404274 0.01339122798897883 -0.0042615018811192331 -0.011530438620831463 -0.0044597869962013387 0.026667036299020026 -0.014246235411060008 -0.0046766667260346511 -0.014372722114605517 0.051662325638647644 -0.012621745832365628 0.0064438612839035946 0.024139416669840045 0.024469055513335902 -0.019756549117586685 -0.021733453898317611 0.012241592397024083 0.0016653215186611414 -0.018260678295952442 0.025012823295087378 0.012156287606744571 0.027685045299269125 -0.017577719965676739 -0.0073403925249766258 0.038796854583539597 0.00041035027831740176 -0.002308949059835667 -0.00023731839614990659 -0.019665291255777768 -0.0058583257673867585 0.0066865039762203848 0.00061508327290500512 0.024195245003131822 -0.019930917745758205 -0.0013918688339881261 -0.018661218572102106 0.018362164377379586 -0.019564535972989371 -0.019832998553102686 0.0062572622108598396 -0.0097960449507255506 -0.0034363900087479604 -0.015987548247919977 -0.008696537191958854 -0.015378766879308434 -0.011158178348792527 -0.01352350889228769 -0.011474763667159785 -0.0097949814597018542 -0.0081757628315292079 -0.0073203881212986627 -0.024679947802484628 -0.02408182662877225 -0.016128449979487727 -0.016593756332842678 0.014925865767358524 -0.00697554424242669 -0.012226464132352136 -0.0018953153434709737 -0.0079487336510437861 -0.0057371424952775661 -0.016705764346585453 -0.0082919165934405431 -0.017056213421132112 -0.017584604592210444 -0.012742839279836682 -0.0046255438436283557 -0.020837853808013462 -0.019175851974113492 -0.024802287955087016 -0.024829266261532149 -0.02476841353860805
leaf_weight=16.951885014772415 57.8568105250597 18.134624138474464 24.874620571732525 23.35835695266724 3.9929928034544 6.6984938569366959 6.5550744198262709 1.5689703747630122 5.4231213405728331 5.3695895671844474 3.4800953306257716 22.285755783319473 7.3980432450771323 18.256617233157158 0.53875524550676346 6.3025272749364367 9.1405125521123392 18.526757784187794 42.278976604342461 9.5330688208341616 25.209154307842255 8.3799841180443781 12.536939531564711 5.226255364716053 6.6223063915967924 337.19799818843603 24.272427260875702 26.612257607281208 10.757534399628637 46.737868621945381 134.50546108186245 1738.1267342269421 10.813113674521444 1.7986228764057151 7.476605772972106 4.4511751085519782 11.207896284759043 2.2865515612065783 2.2607384622097042 9.9077302664518339 4.2570663206279269 16.279881834983826 6.3415387682616702 6.5070145428180695 0.91922338493168343 1.1890377793461087 1.3431980013847342 2.894942004233596 2.9259753301739693 2.1498866230249387 1.2492160163819788 2.7938890643417835 13.165001805871727 3.5122097283601761 3.266047453507781 6.881520330905917 3.1049889922142038 3.0839222129434347 1.5450949892401693 3.2021946832537651 2.1694171056151395 0.46312604285776626 2.5995065346360207 1.873811289668083 1.2058215290307999 1.1038968935608862 1.4699791595339773 1.5614222213625901 1.8618504106998441 9.9469589237123728 0.59856948070228133 1.1199900656938524
leaf_count=1504 388 75 113 91 43 25 28 27 16 2 27 188 10 68 23 57 18 42 118 27 47 22 32 39 11 1316 58 60 91 105 319 2099 49 88 11 8 27 36 80 61 109 41 219 16 43 38 34 35 26 43 40 265 1234 17 37 52 24 92 19 34 41 26 19 15 16 19 26 68 23 946 57 106
internal_value=0 -0.0079587 -0.0130606 -0.00193023 0.00111721 -0.0073206 0.000669999 0.00592076 0.00749522 0.00849889 0.006444 0.0078205 0.00363281 0.0145608 0.00557299 0.00792098 -0.00162411 0.000848229 0.000924407 0.00959742 0.000824246 -0.00354757 0.00676831 -0.00777455 0.0184463 0.00103259 -0.0124428 0.00896886 -0.00734853 0.000812308 0.00219999 0.000445573 0.0157701 -0.00549374 -0.00780868 -0.0101171 0.0223506 -0.0135044 -0.0045036 -0.00149428 0.00143263 -0.00554431 -0.00664364 -0.0114816 -0.0139167 -0.0160512 -0.0122623 -0.00705049 -0.00710436 -0.00599247 -0.0116113 -0.023593 -0.0230245 -0.0143832 -0.0181583 0.0138134 -0.0055603 -0.0129503 -0.00329665 -0.00692612 -0.00636049 -0.0192705 -0.00908785 -0.0161274 -0.0154446 -0.0119211 -0.00528816 -0.0205605 -0.0193901 -0.0247771 -0.0247063 -0.0247989
internal_weight=0 234.055 126.77 107.285 2613.44 62.4328 27.2372 138.583 123.582 118.159 112.79 105.797 65.2549 40.5424 44.8523 40.4592 15.443 2474.86 2457.79 28.0598 2429.73 110.525 32.1248 78.4 11.8486 2319.2 66.5514 62.6345 82.1932 2256.57 471.703 1784.86 36.0223 71.4357 20.5387 17.0746 19.5879 35.1956 63.9216 16.4255 14.1648 47.496 31.2162 13.0621 7.51411 4.39311 27.7812 15.0005 12.6235 12.1055 5.25236 44.5763 30.1169 6.99231 7.41445 25.0161 7.09798 4.00315 3.11407 8.99148 5.78928 2.26175 5.52548 4.42283 2.54902 2.29293 3.6394 2.10018 4.1484 14.4594 3.39246 11.0669
internal_count=11229 5797 5115 682 5432 332 80 941 716 700 698 654 398 256 350 202 75 4491 4371 69 4302 307 81 226 50 3995 176 156 1003 3839 1635 2204 96 912 55 120 49 252 623 250 170 373 332 44 289 148 156 225 112 190 175 4112 2738 44 96 127 67 135 46 144 110 114 45 65 50 57 67 91 59 1374 322 1052
cat_boundaries=0 1 2 3 4 5 6 7 8 9 10 11 12 13 14 15 16 17 18 19 20 21
cat_threshold=2 1 2 1 2 1 1 2 1 1 2 1 2 1 1 1 1 2 2 1 1
is_linear=0
shrinkage=0.05


Tree=129
num_leaves=74
num_cat=23
split_feature=2 3 2 3 2 3 3 0 3 3 3 1 3 3 0 2 2 2 2 1 2 3 3 0 0 1 2 1 2 2 2 2 3 0 1 3 2 3 1 2 2 2 2 2 2 2 2 3 0 0 1 2 2 3 1 1 1 3 1 2 1 2 2 2 2 2 1 2 2 1 3 0 0
split_gain=6.77801 2.80208 3.03314 1.65647 1.27276 1.19728 2.23871 1.06929 1.03005 3.72289 1.23029 1.10603 1.29593 1.18396 0.868563 0.848527 1.65685 0.793142 0.802469 1.25763 0.844773 1.841 4.58289 3.65512 2.24827 1.57768 1.52483 1.45495 0.738181 0.456234 1.71328 1.36172 0.395508 0.232184 0.193666 0.173381 0.14779 0.0809077 0.0770106 0.342243 0.292546 0.0425406 0.271621 0.0369149 0.0326876 0.0311255 0.0276316 0.0150341 0.0122675 0.0119229 0.0106672 0.00854139 0.00732841 0.00582384 0.0042806 0.00427834 0.00314964 0.00229655 0.00353512 0.00213726 0.00154188 0.001216 0.00112067 0.00417841 0.000567001 0.000322798 0.000189495 0.000161787 4.54928e-05 9.12147e-06 5.97381e-06 4.50572e-06 4.73639e-07
threshold=6.5000000000000009 1.0000000180025095e-35 1.0000000180025095e-35 1.5000000000000002 16.500000000000004 5.5000000000000009 10.500000000000002 0 7.5000000000000009 6.5000000000000009 3.5000000000000004 1 2.5000000000000004 1.0000000180025095e-35 2 1.0000000180025095e-35 4.5000000000000009 18.500000000000004 19.500000000000004 3 24.500000000000004 1.5000000000000002 3.5000000000000004 4 5 6 27.500000000000004 7 5.5000000000000009 43.500000000000007 55.500000000000007 41.500000000000007 1.0000000180025095e-35 8 9 8.5000000000000018 21.500000000000004 2.5000000000000004 10 1.5000000000000002 2.5000000000000004 4.5000000000000009 1.5000000000000002 1.5000000000000002 1.0000000180025095e-35 1.0000000180025095e-35 13.500000000000002 1.0000000180025095e-35 11 12 13 13.500000000000002 8.5000000000000018 3.5000000000000004 14 15 16 1.5000000000000002 17 4.5000000000000009 18 17.500000000000004 4.5000000000000009 3.5000000000000004 4.5000000000000009 7.5000000000000009 19 1.5000000000000002 10.500000000000002 20 1.0000000180025095e-35 21 22
decision_type=2 2 2 2 2 2 2 9 2 2 2 1 2 2 9 2 2 2 2 1 2 2 2 9 9 1 2 1 2 2 2 2 2 9 1 2 2 2 1 2 2 2 2 2 2 2 2 2 9 9 1 2 2 2 1 1 1 2 1 2 1 2 2 2 2 2 1 2 2 1 2 9 9
left_child=1 2 48 14 7 37 -7 8 9 10 11 12 -2 -13 15 54 -17 35 19 -19 21 23 36 25 -25 -20 27 32 33 31 -31 -28 -22 38 -8 47 -23 45 41 -40 -41 42 -4 60 66 -5 52 55 50 59 -1 -12 56 67 -3 -6 65 58 -54 -45 -35 -49 63 -47 -46 -9 -16 -39 -60 71 -48 -50 -71
right_child=4 3 28 5 17 6 34 46 -10 -11 51 13 -14 -15 44 16 -18 18 20 -21 26 22 -24 24 -26 -27 29 -29 -30 30 -32 -33 -34 43 -36 -37 -38 53 39 40 -42 -43 -44 49 64 62 70 61 69 -51 -52 -53 57 -55 -56 -57 -58 -59 68 -61 -62 -63 -64 -65 -66 -67 -68 -69 -70 72 -72 -73 -74
leaf_value=-0.022144357862280022 0.00098456659935423538 0.012882819524215428 -0.0041736648641211588 -0.011376209729084562 -0.0068505694826536505 0.025311933916364299 -0.011513772222901337 -0.0085258737498674457 -0.014221347770798646 0.047810935904350683 -0.012466689173479907 0.006242989161631453 0.022971495038374441 0.023277411074016544 -0.020753809942798278 -0.021665435156075025 0.01179055327061173 0.0016212360200852387 -0.018915654795024717 0.023781593928127974 0.011709403057196147 0.026251124336345667 -0.017449126928063909 -0.0072115448356527409 0.036375633441329894 -0.0032341250239359149 0.00090410820557969502 -0.00023148136896127444 -0.019562734253429082 -0.0055816797940684594 0.00092786370761438583 0.012164818412944926 0.023023319243188164 -0.016568915339491345 -0.0014858033455408164 -0.018545034390046438 0.017576313992510594 -0.019460519626512185 -0.019732918081811358 0.0060633520560921979 -0.0096480553426436383 -0.0033627487861870465 -0.015845054536187213 -0.011606913578416631 -0.011004779459880907 -0.013369577158167618 -0.0097675871797435667 -0.0096469977766569584 -0.024676215247662 -0.004743515021075115 -0.024063609621039546 -0.015986981728975322 -0.0022818871570150722 -0.016258574441191671 0.014336894861538205 -0.0043687405381947729 -0.0048768205175087689 -0.0024370762216645719 -0.0053759684295939065 -0.013957344742022138 -0.019832310660241863 -0.0081542203249791289 -0.016922497311522861 -0.017456082883222725 -0.012587838462537547 -0.007350312049610605 -0.019655333209854159 -0.01885815221192999 -0.0057520256401906861 -0.024801610825534497 -0.009663707963242665 -0.024829265265822176 -0.024766886428973067
leaf_weight=16.579645156860352 57.915314462035894 18.379101902246475 24.768843978643421 23.090570680797104 3.0834054127335548 6.8795259222388294 12.578932791948315 1.4656516835093483 5.345733765512704 5.6542858034372321 3.4364465400576583 22.429825566709042 7.5788003802299491 18.708849675953388 1.5292221158742896 6.1670291759073725 9.2530940957367402 18.557636111974716 37.950448170304298 9.7745250314474124 25.51747427880764 8.6152256801724452 12.318494357168673 5.1880330294370651 6.8842801451683027 27.779938548803329 120.81808040291071 26.605943165719509 10.54805129021406 106.47079102694988 1996.5994353294373 34.516956701874733 11.077930212020872 0.45545342937111855 7.8002965338528201 4.3688811063766471 11.415598429739473 2.2422510329633942 2.2163429856300381 9.9699202328920347 4.2155673764646044 16.224033892154694 6.2409593220800152 3.2233556229621172 1.1758440304547551 1.3251555208116761 2.9250234588980666 2.8974552415311337 2.7257800288498402 0.58662066981196392 12.851751321926715 3.4560175463557243 1.0931843854486942 2.8220771886408329 6.9850029349327114 3.9752246066927928 1.1436935365200045 1.4468411691486833 1.5408067107200625 1.3817697316408155 1.7631294801831239 2.5780407413840294 1.842122185975313 1.1848030053079128 1.0899193584918974 0.97071671113371838 0.52821575663983833 2.2167094945907593 1.6822829656302927 9.7032859697937965 2.6269570738077164 0.58389041572809253 1.0925904735922785
leaf_count=1504 388 75 113 91 24 25 30 31 16 2 27 188 10 68 68 57 18 42 116 27 47 22 32 39 11 60 591 60 91 379 2787 82 49 26 25 8 27 36 80 61 109 41 219 129 38 34 29 26 265 20 1234 17 17 40 52 43 21 24 31 26 88 19 15 16 19 19 23 20 30 946 23 57 106
internal_value=0 -0.00782548 -0.0129065 -0.00188848 0.00108776 -0.00719338 0.000649825 0.005736 0.00725043 0.00821353 0.00624133 0.00756466 0.00352883 0.0139898 0.00540103 0.00765996 -0.00158963 0.000826128 0.000900292 0.0092665 0.000802818 -0.00347555 0.00654903 -0.00764363 0.0176442 -0.0122881 0.00100581 0.00866574 -0.00722016 0.000791448 0.000598309 0.00340635 0.0151343 -0.00538768 -0.0076755 -0.00996772 0.0213073 -0.0133504 -0.00441228 -0.00146056 0.00139432 -0.00543726 -0.00652262 -0.0137639 -0.0159093 -0.0121073 -0.00692478 -0.00697803 -0.0235635 -0.011457 -0.0229824 -0.0142318 -0.0052647 -0.0180361 0.0132833 -0.00545287 -0.00704139 -0.00416102 -0.0047389 -0.0123122 -0.0191624 -0.00894415 -0.0159859 -0.0152986 -0.0117663 -0.0080575 -0.0204718 -0.0191611 -0.00557225 -0.0247758 -0.00971844 -0.0247032 -0.0247981
internal_weight=0 232.221 125.131 107.09 2616.41 61.9824 27.2588 139.42 124.525 119.18 113.525 106.633 65.4941 41.1387 45.1074 40.7842 15.4201 2476.99 2460.09 28.3322 2431.76 110.152 32.3493 77.8027 12.0723 65.7304 2321.61 63.2013 81.594 2258.41 2103.07 155.335 36.5954 71.046 20.3792 16.903 20.0308 34.7237 63.6357 16.4018 14.1855 47.2338 31.0098 7.41033 4.3232 27.4427 14.8952 12.5341 43.5369 5.19175 29.4314 6.89246 9.34318 7.28104 25.3641 7.05863 3.58006 5.76312 4.31627 4.60513 2.21858 5.4755 4.35208 2.50996 2.26576 2.43637 2.05744 4.45896 3.22309 14.1055 5.55198 3.30967 10.7959
internal_count=11229 5797 5115 682 5432 332 80 941 716 700 698 654 398 256 350 202 75 4491 4371 69 4302 307 81 226 50 176 3995 156 1003 3839 3166 673 96 912 55 120 49 252 623 250 170 373 332 289 148 156 225 112 4112 175 2738 44 173 96 127 67 71 102 78 155 114 45 65 50 57 50 91 56 61 1374 52 322 1052
cat_boundaries=0 1 2 3 4 5 6 7 8 9 10 11 12 13 14 15 16 17 18 19 20 21 22 23
cat_threshold=2 1 2 1 2 1 1 1 2 1 1 2 1 1 1 2 1 2 2 1 2 1 1
is_linear=0
shrinkage=0.05


Tree=130
num_leaves=74
num_cat=18
split_feature=2 3 1 3 2 2 2 3 0 0 2 2 2 3 2 1 3 2 2 3 3 2 3 2 2 2 2 2 2 2 2 2 1 2 2 2 2 1 3 2 2 0 2 3 1 3 3 2 1 1 0 2 3 2 3 2 2 3 2 3 3 0 1 3 1 2 3 2 3 1 1 0 0
split_gain=2.0204 8.35001 3.00191 3.07716 2.05397 2.83594 5.48902 10.0223 2.31253 2.67154 4.97313 1.63254 3.55317 5.71081 2.72711 5.8414 1.51136 1.49274 1.67652 1.47609 3.8254 6.92896 0.871849 0.850143 0.954892 0.846255 1.71371 1.11665 0.781772 1.82567 0.60902 1.36427 1.10728 0.31536 0.212128 0.161378 0.15904 0.137081 0.134391 0.115384 0.101173 0.0832221 0.0681495 0.0643295 0.0554656 0.0537423 0.0534594 0.0482913 0.0459739 0.0449125 0.0348282 0.0347219 0.0316992 0.0411187 0.0287684 0.0234387 0.0210398 0.0182319 0.0163116 0.015764 0.0143444 0.0103762 0.0105852 0.00934988 0.00914509 0.00610641 0.00538908 0.00498174 0.00490045 0.00159393 7.18244e-06 1.85213e-05 5.60632e-06
threshold=1.0000000180025095e-35 1.0000000180025095e-35 0 6.5000000000000009 23.500000000000004 46.500000000000007 48.500000000000007 1.0000000180025095e-35 1 2 21.500000000000004 20.500000000000004 22.500000000000004 2.5000000000000004 19.500000000000004 3 5.5000000000000009 66.500000000000014 67.500000000000014 3.5000000000000004 4.5000000000000009 37.500000000000007 52.500000000000007 26.500000000000004 41.500000000000007 84.500000000000014 86.500000000000014 73.500000000000014 37.500000000000007 38.500000000000007 13.500000000000002 8.5000000000000018 4 64.500000000000014 43.500000000000007 59.500000000000007 25.500000000000004 5 2.5000000000000004 5.5000000000000009 32.500000000000007 6 13.500000000000002 1.0000000180025095e-35 7 1.5000000000000002 8.5000000000000018 24.500000000000004 8 9 10 62.500000000000007 3.5000000000000004 19.500000000000004 1.0000000180025095e-35 1.5000000000000002 4.5000000000000009 11.500000000000002 16.500000000000004 6.5000000000000009 3.5000000000000004 11 12 1.5000000000000002 13 4.5000000000000009 1.0000000180025095e-35 2.5000000000000004 1.0000000180025095e-35 14 15 16 17
decision_type=2 2 1 2 2 2 2 2 9 9 2 2 2 2 2 1 2 2 2 2 2 2 2 2 2 2 2 2 2 2 2 2 1 2 2 2 2 1 2 2 2 9 2 2 1 2 2 2 1 1 9 2 2 2 2 2 2 2 2 2 2 9 1 2 1 2 2 2 2 1 1 9 9
left_child=1 61 3 16 8 19 7 -7 39 11 42 14 13 43 30 -16 45 33 -19 23 21 -21 38 36 28 27 -27 -20 37 -30 31 -10 -32 35 50 41 44 -25 -4 55 46 -8 56 -13 -6 -3 -22 -46 -36 59 -26 -37 53 58 -35 68 -11 -40 64 -42 -9 62 -1 65 -41 67 -55 -57 69 -2 72 -72 -63
right_child=4 2 22 -5 5 6 17 60 9 10 -12 12 -14 -15 15 -17 -18 18 25 20 40 -23 -24 24 34 26 -28 -29 29 -31 32 -33 -34 54 48 51 -38 -39 57 52 49 -43 -44 -45 47 -47 -48 -49 -50 -51 -52 -53 -54 66 -56 63 -58 -59 -60 -61 -62 70 -64 -65 -66 -67 -68 -69 -70 -71 71 -73 -74
leaf_value=-0.02227037431445849 -0.015915180287675409 0.014145379742058532 -0.023234622401886521 -0.013543118673473773 -0.0077385002970184278 0.054627489058752955 -0.001266958393634625 -0.0076628184086260298 0.0046536135114888235 -0.013285993444022232 0.041535654850092779 -0.017295439087547125 0.012860567838976081 0.024197082415354159 -0.014337749876365317 0.044926339210562806 0.041547797464258962 0.016902998620113911 0.0028667642031986853 0.068032583994426493 -0.0061327570926107662 -0.0089362846094569216 0.0042596505328829203 -0.0038177275129637148 -0.012969150806319819 0.015667151173355334 0.00075847652441230059 -0.0063026101887763046 0.018238683293472488 -0.0062590046441013628 0.0035042314314970603 -0.0074934995513334718 0.014023089785462123 -0.0079197240349605184 -0.0093615712616101823 0.00066535605543699666 -0.017860069558717807 -0.0078487118700826791 -0.015405275451433274 -0.0042187357325011105 0.0012631226596170957 -0.0053849128197694038 -0.01678041663646665 -0.021408439017072928 -0.0092217795099227978 0.010538825954258547 -0.013222094944783439 -0.01604474056180066 -0.0045639244480334884 -0.0054571018932351107 -0.016754587307353862 -0.0025030023337975302 -0.0013500798300255194 -0.0087336683928514076 -0.011557798312093283 -0.013944307745073679 -0.0036502095331487059 -0.009145255667095762 -0.0019774286130340916 -0.0025290456229939764 -0.0044664960342415154 -0.024662312539196391 -0.024190976758413821 -0.0067142098240608149 -0.0071991738302445395 -0.01463056920263253 -0.011311430115234106 -0.010157715170703172 -0.013071281342498698 -0.019510916080292082 -0.024803537733190068 -0.024581067616223095 -0.024829264957857575
leaf_weight=16.593913162127137 0.39572318084537983 17.947211408987641 9.2740017883479613 11.704490177333353 7.7432911619544029 13.030240774154665 14.780488267540932 7.5766988247632963 131.90592567808926 0.79446336068213108 12.620717644691467 20.94120691716671 24.432238191366196 9.4687691628932935 6.3612881004810333 12.004010170698168 4.8466016650199881 15.935278177261351 51.464459761977196 5.5860549509525281 6.1705128923058492 6.1357433795928955 5.1887344121932975 53.630869284272194 17.561857372522354 19.50422927737236 1641.9369526803493 93.573127970099449 12.882453590631487 18.565461829304695 67.666355632245541 28.026266194880009 39.694967284798622 9.4863095581531542 13.792609706521034 20.35663066804409 15.263232707977293 34.760898247361183 3.0502500496804705 3.5334102995693684 4.1811332851648348 72.211324423551559 3.7110003605484962 17.410824865102768 4.3527940139174479 24.335076639428735 4.6731005012989044 6.4159306287765503 7.8270202577114114 12.936202749609945 9.2908922433853167 15.032937020063398 2.5782574601471415 3.9083218425512296 12.720344737172125 1.2259889002889393 1.9744052737951276 1.87996569275856 2.4966174364089957 7.9537916779518127 6.5398818999528885 2.4987771017476916 12.637686200439932 0.83909771218895901 9.4765072576701694 1.9772929884493349 4.2132866308093071 2.9797449801117182 0.48981700837612141 1.3934930115938171 9.6757122194394469 1.0356968436390133 0.62952625751495395
leaf_count=1539 23 137 103 26 30 27 60 26 1028 34 5 65 41 17 21 37 4 28 137 23 36 22 10 248 46 35 2014 218 37 87 209 343 144 19 50 81 39 138 42 53 25 265 17 25 29 91 14 27 24 39 17 56 29 26 27 57 39 8 29 36 24 249 1243 24 164 34 23 100 18 71 967 103 63
internal_value=0 -0.0059552 0.0037791 0.00940255 0.000643491 4.73566e-05 0.000676385 0.023006 0.00388612 0.005035 0.0232545 0.00406268 -0.00265175 -0.0105772 0.00576099 0.0243987 0.0151011 0.000368211 0.000756185 -0.0049757 0.00294195 0.0277434 -0.013281 -0.00684207 -0.00538933 0.000613751 0.000933495 -0.00304899 -0.00299416 0.00377633 0.00448043 0.00252497 0.00739339 -0.00452188 -0.011311 -0.00352718 -0.0140815 -0.00540295 -0.0196886 -0.00831243 -0.00515273 -0.00468524 -0.0123512 -0.0191626 -0.0109661 0.0120697 -0.00918794 -0.0132869 -0.00762466 -0.00340744 -0.0142789 -0.000680513 -0.0066144 -0.00718883 -0.0100037 -0.0130967 -0.00641498 -0.0130182 -0.00567931 -0.00122244 -0.00618204 -0.0236347 -0.0231007 -0.0116668 -0.00638971 -0.0123389 -0.0100709 -0.0112615 -0.0175025 -0.0187156 -0.0247626 -0.024782 -0.0246959
internal_weight=0 121.298 78.2263 58.8334 2656.39 2243.87 1994.15 27.1468 412.52 377.012 19.1006 357.912 72.253 47.8208 285.659 18.3653 47.1289 1967 1822.41 249.724 47.6365 11.7218 19.393 202.087 168.312 1806.48 1661.44 145.038 119.84 31.4479 267.294 159.932 107.361 144.588 48.4724 122.381 33.7752 88.3918 14.2042 35.5076 35.9147 86.9918 6.47987 38.352 18.512 42.2823 10.8436 10.7687 21.6196 25.0711 26.8527 35.3896 26.2064 23.6281 22.2067 9.30116 2.76887 4.93022 15.5065 12.1349 14.1166 43.0713 29.2316 7.02212 13.0099 6.18303 8.12161 4.20573 2.27903 1.78922 13.8397 10.7114 3.1283
internal_count=11245 4585 421 258 6660 3984 3017 77 2676 2025 95 1930 148 107 1782 58 232 2940 2432 967 195 45 163 772 647 2404 2049 355 510 124 1724 1371 353 508 137 462 125 386 153 651 150 325 90 90 86 228 50 56 74 100 63 137 324 295 46 327 73 50 246 61 50 4164 2782 215 217 191 49 157 112 94 1382 1070 312
cat_boundaries=0 1 2 3 4 5 6 7 8 9 10 11 12 13 14 15 16 17 18
cat_threshold=1 1 2 2 1 1 1 2 1 1 2 2 1 2 2 2 1 1
is_linear=0
shrinkage=0.05


Tree=131
num_leaves=73
num_cat=17
split_feature=2 3 1 3 2 2 2 3 0 0 2 2 2 3 2 2 2 3 3 2 3 3 2 2 2 2 2 2 2 2 2 1 3 2 2 2 2 1 2 2 0 2 3 3 1 3 3 2 1 1 0 2 3 2 3 2 2 2 3 3 0 1 3 1 2 3 2 3 1 1 0 0
split_gain=1.93289 8.15029 2.85503 2.89434 1.94194 2.71025 5.08484 8.86143 2.19712 2.45487 4.48527 1.54225 3.38105 5.46199 2.4989 1.42452 1.56472 1.41449 3.53765 6.03117 1.33918 0.855255 0.830266 0.926315 0.806089 1.60093 1.0689 0.746618 1.70855 0.570693 1.2979 1.02653 0.382723 0.305447 0.208627 0.157949 0.154855 0.132637 0.11289 0.0979637 0.080056 0.0671817 0.0648579 0.0568602 0.0544847 0.0523306 0.0492237 0.0477512 0.0446853 0.0431491 0.0346284 0.0331039 0.0306119 0.0400226 0.0281873 0.0232636 0.0204883 0.0157343 0.0150288 0.0138968 0.0106053 0.010798 0.00917245 0.00885513 0.0060361 0.00528362 0.00491023 0.00489828 0.00160101 7.36091e-06 1.89804e-05 5.74549e-06
threshold=1.0000000180025095e-35 1.0000000180025095e-35 0 6.5000000000000009 23.500000000000004 46.500000000000007 48.500000000000007 1.0000000180025095e-35 1 2 21.500000000000004 20.500000000000004 22.500000000000004 2.5000000000000004 19.500000000000004 66.500000000000014 67.500000000000014 3.5000000000000004 4.5000000000000009 37.500000000000007 5.5000000000000009 11.500000000000002 26.500000000000004 41.500000000000007 84.500000000000014 86.500000000000014 73.500000000000014 37.500000000000007 38.500000000000007 13.500000000000002 8.5000000000000018 3 1.5000000000000002 64.500000000000014 43.500000000000007 25.500000000000004 59.500000000000007 4 5.5000000000000009 32.500000000000007 5 13.500000000000002 1.0000000180025095e-35 2.5000000000000004 6 8.5000000000000018 1.5000000000000002 24.500000000000004 7 8 9 62.500000000000007 3.5000000000000004 19.500000000000004 1.0000000180025095e-35 1.5000000000000002 4.5000000000000009 16.500000000000004 6.5000000000000009 3.5000000000000004 10 11 1.5000000000000002 12 4.5000000000000009 1.0000000180025095e-35 2.5000000000000004 1.0000000180025095e-35 13 14 15 16
decision_type=2 2 1 2 2 2 2 2 9 9 2 2 2 2 2 2 2 2 2 2 2 2 2 2 2 2 2 2 2 2 2 1 2 2 2 2 2 1 2 2 9 2 2 2 1 2 2 2 1 1 9 2 2 2 2 2 2 2 2 2 9 1 2 1 2 2 2 2 1 1 9 9
left_child=1 60 3 20 8 17 7 -7 38 11 41 14 13 42 29 33 -17 22 19 -19 46 43 35 27 26 -26 -18 37 -29 30 -10 -31 -16 36 50 44 40 -24 55 45 -8 56 -13 -4 -6 -20 -3 -46 -36 58 -25 -38 53 57 -35 67 -11 63 -41 -9 61 -1 64 -40 66 -55 -57 68 -2 71 -71 -62
right_child=4 2 21 -5 5 6 15 59 9 10 -12 12 -14 -15 32 16 24 18 39 -21 -22 -23 23 34 25 -27 -28 28 -30 31 -32 -33 -34 54 48 -37 51 -39 52 49 -42 -43 -44 -45 47 -47 -48 -49 -50 -51 -52 -53 -54 65 -56 62 -58 -59 -60 -61 69 -63 -64 -65 -66 -67 -68 -69 -70 70 -72 -73
leaf_value=-0.022212746786972524 -0.019406131993633283 0.01359795203200353 -0.023197139179305722 -0.013389229301991433 -0.0076057304595281861 0.050403396275416935 -0.0012370869920761154 -0.0075307698651534685 0.0045167301896206118 -0.013131606440818806 0.03883560591382608 -0.017164004509803831 0.012378958499437299 0.023025025202701777 0.017379719865594636 0.016203526606638412 0.0027874792481051812 0.061925058811748417 -0.0060177437703679343 -0.0087936239365287387 0.038846479417239829 0.00067636313558288664 -0.0037373577081158426 -0.012814333299804311 0.01503763222078661 0.00073907617616391676 -0.0061854751121384654 0.017460302148415634 -0.0061424088013512174 0.0034051182363925205 -0.0073631059144893376 0.013482061510266832 0.031935454808239692 -0.0077852731222305032 -0.0092160894346204978 -0.017734481123472905 0.00064839872619262471 -0.0077149119171525437 -0.0070717937774144556 0.0012301855041525339 -0.0052799242553998021 -0.016644214031141236 -0.021334415609846308 -0.015258972394637492 -0.0090771850676025934 -0.01306760479516663 0.010168044102165225 -0.015902658711882733 -0.0044712238772410358 -0.0053510969901277685 -0.016618160273934309 -0.0024470496796636983 -0.0013183597695603177 -0.0085924790556509752 -0.011403519694145058 -0.013791461307260814 -0.0035727603075391768 -0.0019321960699436376 -0.0024725759698421544 -0.0043753424785518561 -0.024658144688736568 -0.024175347839108231 -0.0065921725232120868 -0.0041316017180971897 -0.014480259336584768 -0.011157656392003102 -0.010007926305036123 -0.012916580725822108 -0.015772176594372366 -0.024802890358095114 -0.024574892440967531 -0.024829265039476467
leaf_weight=16.228446073830128 1.3665681518614274 18.202886128798127 9.0610072836279887 11.547043472528456 7.6836009100079536 13.761851102113726 14.761773839592934 7.5188617557287198 132.52119322307408 0.78397793695330742 13.155966490507126 20.582134179770947 24.748479545116425 9.7006802633404714 11.307237461209299 16.206921309232712 51.612208589911461 5.9793142154812795 6.1327863335609418 6.081156924366951 5.0522091388702384 7.0737351626157752 53.426511138677597 17.335565984249115 19.81221130490303 1643.1827943921089 92.985228180885315 13.119568198919298 18.449623540043831 67.90388909727335 27.817036785185337 40.255535483360291 7.5190989822149268 9.4114776849746722 13.664091691374779 14.993050232529638 20.370179429650307 34.489138156175613 9.4085292741656339 4.1864179968833941 71.82351753115654 3.6492477655410767 17.042047560214996 3.0036202222108832 4.3128381147980708 4.6117189824581146 24.59289669059217 6.3138100355863571 7.7913797199726114 12.865800961852072 9.1365238130092639 14.995356783270834 2.5747789032757273 3.8743365630507451 12.574171751737593 1.2090119887143371 1.9672113955020902 2.4916854426264754 7.9337016344070435 6.5107365995645523 2.437905153259635 12.335636347532274 0.83348268270492543 3.5185351744294175 1.9485746696591375 4.1658968105912209 2.9496307875961065 0.48345613293349732 0.38947501592338096 9.4386727102100849 1.0105486325919599 0.61408801563084159
leaf_count=1539 71 137 103 26 30 27 60 26 1028 34 5 65 41 17 41 28 137 23 36 22 4 18 248 46 35 2014 218 37 87 209 343 144 17 19 50 39 81 138 164 25 265 17 25 42 29 14 91 27 24 39 17 56 29 26 27 57 39 29 36 24 249 1243 24 53 34 23 100 18 23 967 103 63
internal_value=0 -0.00584582 0.00366724 0.00907884 0.000626158 4.55703e-05 0.000658767 0.0218965 0.00377188 0.00488201 0.0221338 0.00394326 -0.00259645 -0.0104278 0.00558371 0.000358815 0.000736751 -0.00487845 0.00285225 0.0262671 0.014501 -0.0131274 -0.00671915 -0.00528486 0.000598075 0.000909423 -0.00298269 -0.00292931 0.00366644 0.00434898 0.0024557 0.00715563 0.0231932 -0.00442995 -0.0111573 -0.0139292 -0.00345197 -0.00529774 -0.00817472 -0.00505122 -0.00459067 -0.0121964 -0.019053 -0.0212208 -0.0108133 -0.00904366 0.0116269 -0.0131325 -0.00749303 -0.00333439 -0.0141272 -0.000664104 -0.00649361 -0.00706163 -0.00985464 -0.0129421 -0.00629665 -0.00557028 -0.0011936 -0.00606643 -0.0236061 -0.0230603 -0.0115124 -0.00627152 -0.0121839 -0.00992158 -0.0111079 -0.0173732 -0.0186002 -0.0247609 -0.0247808 -0.0246926
internal_weight=0 120.599 78.5334 59.395 2658.2 2244.03 1995.53 27.7914 414.168 378.954 19.5564 359.397 72.0733 47.3249 287.324 1967.74 1823.8 248.507 47.7909 12.0605 47.848 19.1384 200.716 167.412 1807.59 1663 144.597 119.485 31.5692 268.498 160.338 108.159 18.8263 143.936 47.9276 33.3033 121.951 87.9156 35.214 35.7304 86.5853 6.40044 37.6242 12.0646 18.3102 10.7445 42.7958 10.6266 21.4555 24.9859 26.4721 35.3655 26.0338 23.459 21.9856 9.1802 2.75119 15.4187 12.1201 14.0296 42.0653 28.5641 6.9407 12.9271 6.10722 8.04023 4.15864 2.2395 1.75604 13.5012 10.4492 3.05199
internal_count=11245 4585 421 258 6660 3984 3017 77 2676 2025 95 1930 148 107 1782 2940 2432 967 195 45 232 163 772 647 2404 2049 355 510 124 1724 1371 353 58 508 137 125 462 386 651 150 325 90 90 145 86 50 228 56 74 100 63 137 324 295 46 327 73 246 61 50 4164 2782 215 217 191 49 157 112 94 1382 1070 312
cat_boundaries=0 1 2 3 4 5 6 7 8 9 10 11 12 13 14 15 16 17
cat_threshold=1 1 2 1 1 1 2 1 1 2 2 1 1 1 2 1 1
is_linear=0
shrinkage=0.05


Tree=132
num_leaves=73
num_cat=18
split_feature=2 3 1 3 2 2 2 3 0 0 2 2 2 3 2 2 2 3 3 1 3 3 2 2 2 2 2 1 2 2 2 1 3 2 2 2 2 2 2 2 0 2 3 3 1 3 2 3 1 1 0 2 2 3 2 2 2 3 3 2 0 1 3 3 1 2 3 2 1 1 0 0
split_gain=1.84903 7.95529 2.71614 2.72452 1.83678 2.58984 4.71669 7.87711 2.08795 2.25914 4.06038 1.45756 3.21817 5.22881 2.29688 1.35933 1.46148 1.35546 3.27724 5.64266 1.19124 0.841569 0.810546 0.898304 0.771572 1.31696 0.920404 0.728555 1.19552 0.535021 1.23485 0.952533 0.337863 0.295751 0.275271 0.205094 0.156798 0.148567 0.110404 0.0948254 0.0769923 0.0662003 0.0653699 0.0574314 0.0534974 0.0512042 0.047196 0.0451478 0.0434166 0.0414462 0.0344144 0.0315595 0.0295972 0.0276058 0.0230797 0.0199441 0.016957 0.014327 0.0134585 0.0113462 0.0108386 0.0110138 0.0104277 0.00899447 0.00857148 0.00596385 0.00489416 0.00483753 0.00160754 7.54449e-06 1.94512e-05 5.88825e-06
threshold=1.0000000180025095e-35 1.0000000180025095e-35 0 6.5000000000000009 23.500000000000004 46.500000000000007 48.500000000000007 1.0000000180025095e-35 1 2 21.500000000000004 20.500000000000004 22.500000000000004 2.5000000000000004 19.500000000000004 66.500000000000014 67.500000000000014 3.5000000000000004 4.5000000000000009 3 5.5000000000000009 11.500000000000002 26.500000000000004 41.500000000000007 81.500000000000014 73.500000000000014 85.500000000000014 4 37.500000000000007 13.500000000000002 8.5000000000000018 5 1.5000000000000002 64.500000000000014 27.500000000000004 43.500000000000007 25.500000000000004 59.500000000000007 5.5000000000000009 32.500000000000007 6 13.500000000000002 1.0000000180025095e-35 2.5000000000000004 7 8.5000000000000018 24.500000000000004 1.5000000000000002 8 9 10 62.500000000000007 19.500000000000004 1.0000000180025095e-35 1.5000000000000002 4.5000000000000009 20.500000000000004 6.5000000000000009 3.5000000000000004 16.500000000000004 11 12 3.5000000000000004 1.5000000000000002 13 4.5000000000000009 1.0000000180025095e-35 2.5000000000000004 14 15 16 17
decision_type=2 2 1 2 2 2 2 2 9 9 2 2 2 2 2 2 2 2 2 1 2 2 2 2 2 2 2 1 2 2 2 1 2 2 2 2 2 2 2 2 9 2 2 2 1 2 2 2 1 1 9 2 2 2 2 2 2 2 2 2 9 1 2 2 1 2 2 2 1 1 9 9
left_child=1 60 3 20 8 17 7 -7 38 11 41 14 13 42 29 33 -17 22 19 -19 47 43 36 27 25 -18 -26 28 -24 30 -10 -31 -16 37 -29 50 44 40 54 45 -8 55 -13 -4 -6 -20 -46 -3 -37 57 -25 -39 59 -35 66 -11 -54 -41 -9 62 61 -1 64 65 -40 67 68 -56 -2 70 -62 -71
right_child=4 2 21 -5 5 6 15 58 9 10 -12 12 -14 -15 32 16 24 18 39 -21 -22 -23 23 35 26 -27 -28 34 -30 31 -32 -33 -34 53 -36 48 -38 51 52 49 -42 -43 -44 -45 46 -47 -48 -49 -50 -51 -52 -53 56 -55 63 -57 -58 -59 -60 -61 69 -63 -64 -65 -66 -67 -68 -69 -70 71 -72 -73
leaf_value=-0.0221539770717313 -0.015628193326026725 0.013078956283938195 -0.023158834683209825 -0.013235026308183684 -0.0074742333840820685 0.046705393016175184 -0.0012078833892208013 -0.0074000068718758907 0.0043844806215061951 -0.012976984369847412 0.036410537030628333 -0.017031302291178201 0.01192119988082898 0.021935767553281232 0.016652477602617743 0.015544006784777922 0.0027106057412207446 -0.0085304425241541203 -0.0059041994861008676 0.058959270909283892 0.036420329495741581 0.00065911804556694918 -0.0036583821552499743 -0.012659379284763414 0.0087123892951619063 -0.0078776342597007033 0.00068422718613475987 -0.017476892120318988 0.010737153787344633 0.0033091404779774982 -0.0072340261696058686 0.012969012482602372 0.030151287592099577 -0.0076520633646250174 -0.0062454658292108358 -0.0090715320407106139 -0.017607536524321774 0.00063188440536807524 -0.004045910376888783 0.001198147060363221 -0.0051764322547351608 -0.016506840225285559 -0.021259053468272969 -0.015111819854757992 -0.0089335496201555821 -0.012912899761533128 -0.015759566672135687 0.0098139928566572492 -0.0043799943910194832 -0.0052465879827626278 -0.016480567027117504 -0.0023922121888003325 -0.011778294347137348 -0.011249542637752989 -0.013638179764869141 -0.0034966800101791651 -0.0071593482029241725 -0.0024172288767241928 -0.0042856535392196077 -0.0021914593990773846 -0.024802229339665877 -0.024159345992731885 -0.0015602609377611454 -0.006471553169867853 -0.0069457714095012392 -0.014329312562417804 -0.012761711545203849 -0.0098588505009240095 -0.019299862570607292 -0.024653871026839875 -0.024568564993039194 -0.024829265296923364
leaf_weight=15.87194144446403 0.38338034972548485 18.452097993344069 8.853237487375738 11.393467642366884 7.625383161008358 14.473273754119875 14.743523627519608 7.4624517709016782 133.12111037969589 0.7737503480166209 13.676936954259872 20.231876976788044 25.056743741035461 9.9266299530863744 11.505471751093866 16.471669971942902 51.756276845932007 6.2502362430095655 6.0959917083382589 6.1389681622385979 5.2523314952850333 7.0785210579633704 53.227209985256195 17.114839479327202 36.489796578884125 67.888611674308777 1652.5435074269772 6.3218445479869834 19.782880216836929 68.135503947734833 27.612969100475311 40.801937215030193 7.7631001174449912 9.3384909331798571 39.8066536039114 13.53874084353447 14.729500189423559 20.383391782641411 3.5040279738605022 4.1915712207555789 71.445294588804245 3.5890116393566132 16.682316601276398 2.9581359382718793 4.2738667353987712 4.5518467873334885 6.2141980081796646 24.844233194366097 7.7566206455230722 12.797138661146162 8.9859462380409258 14.958707213401793 2.9854306876659376 12.431596577167509 1.1924523562192915 1.9601955749094484 5.941563680768013 7.9141092300415039 6.4823120832443237 2.7258359640836707 9.2074456019327044 12.040994194336234 1.3662945702671994 0.82800631783902634 9.3422288410365635 1.9205621406435964 0.47725169360637654 2.9202583562582731 1.3403040021657928 2.3785261726006866 0.9860171312466236 0.59902839269488994
leaf_count=1539 23 137 103 26 30 27 60 26 1028 34 5 65 41 17 41 28 137 29 36 16 4 18 248 46 84 152 2031 13 84 209 343 144 17 19 165 50 39 81 53 25 265 17 25 42 29 14 27 91 24 39 17 56 18 27 57 39 40 36 24 31 967 1243 18 24 164 34 18 100 71 249 103 63
internal_value=0 -0.00573774 0.00355929 0.00876936 0.00060941 4.38793e-05 0.000641643 0.0208662 0.00366199 0.00473504 0.0210924 0.00382841 -0.0025421 -0.010279 0.0054136 0.000349666 0.000717833 -0.00478253 0.00276623 0.0249113 0.0139334 -0.0129735 -0.00659761 -0.00518185 0.000582811 -0.00329735 0.000857667 -0.00286566 0.000242245 0.00422197 0.0023885 0.00692719 0.022091 -0.00433949 -0.00778472 -0.011004 -0.0137764 -0.00337811 -0.00803818 -0.00495121 -0.00449757 -0.0120416 -0.0189419 -0.0211435 -0.010661 -0.00890035 -0.012978 0.0112055 -0.00736269 -0.00326266 -0.0139749 -0.000648078 -0.00637425 -0.00970637 -0.0127874 -0.00617976 -0.00870405 -0.00116541 -0.00595228 -0.00514638 -0.0235769 -0.023019 -0.0057131 -0.0113582 -0.00615479 -0.0120289 -0.0172426 -0.0109546 -0.0184832 -0.0247592 -0.0247796 -0.0246892
internal_weight=0 119.916 78.832 59.9421 2659.95 2244.19 1996.87 28.418 415.765 380.838 19.9999 360.838 71.8976 46.8408 288.94 1968.45 1825.15 247.318 47.9399 12.3892 48.5487 18.8899 199.378 166.535 1808.68 119.645 1689.03 119.139 73.0101 269.672 160.734 108.937 19.2686 143.301 46.1285 47.3961 32.8429 121.531 34.9276 35.5507 86.1888 6.32296 36.9142 11.8114 18.1134 10.6478 10.4881 43.2963 21.2954 24.9028 26.1008 35.3421 25.8654 21.7701 9.06222 2.73395 8.92699 12.1057 13.9448 16.9384 41.084 27.9129 14.2126 6.86128 12.8463 6.03327 2.20094 4.11271 1.72368 13.171 10.1935 2.97755
internal_count=11245 4585 421 258 6660 3984 3017 77 2676 2025 95 1930 148 107 1782 2940 2432 967 195 45 232 163 772 647 2404 289 2115 510 332 1724 1371 353 58 508 178 137 125 462 651 150 325 90 90 145 86 50 56 228 74 100 63 137 324 46 327 73 58 61 50 266 4164 2782 235 215 217 191 112 157 94 1382 1070 312
cat_boundaries=0 1 2 3 4 5 6 7 8 9 10 11 12 13 14 15 16 17 18
cat_threshold=1 1 2 1 1 1 1 2 1 1 2 2 1 2 2 1 1 1
is_linear=0
shrinkage=0.05


Tree=133
num_leaves=74
num_cat=17
split_feature=2 3 1 3 2 2 2 3 0 0 2 2 2 3 2 3 3 2 2 2 3 3 2 2 2 2 2 1 2 2 2 1 3 2 2 2 2 2 3 2 2 0 3 2 1 3 2 1 3 1 0 2 3 2 3 2 2 3 2 3 3 0 1 3 1 2 3 3 2 1 1 0 0
split_gain=1.76866 7.76483 2.58474 2.56655 1.7376 2.47453 4.38056 7.03534 1.98448 2.08201 3.68814 1.37784 3.06393 5.00978 2.11426 1.2988 3.04047 5.11763 1.29704 1.36602 1.0634 0.829355 0.791002 0.870876 0.748498 1.46189 0.991357 0.700144 1.12841 0.501798 1.17494 0.884623 0.299379 0.286272 0.27028 0.201532 0.155588 0.142508 0.13511 0.107928 0.0917585 0.074029 0.0658649 0.0652063 0.0525047 0.0500812 0.0466266 0.0421683 0.0414645 0.0398022 0.0341863 0.0300854 0.0292236 0.0381984 0.0270243 0.0228871 0.0194076 0.0160594 0.0146732 0.0136574 0.0130296 0.0110764 0.0112326 0.00881612 0.00829416 0.00588973 0.00527356 0.00488805 0.00476371 0.0016135 7.73259e-06 1.9934e-05 6.03453e-06
threshold=1.0000000180025095e-35 1.0000000180025095e-35 0 6.5000000000000009 23.500000000000004 46.500000000000007 48.500000000000007 1.0000000180025095e-35 1 2 21.500000000000004 20.500000000000004 22.500000000000004 2.5000000000000004 19.500000000000004 3.5000000000000004 4.5000000000000009 37.500000000000007 66.500000000000014 67.500000000000014 5.5000000000000009 52.500000000000007 26.500000000000004 41.500000000000007 84.500000000000014 86.500000000000014 73.500000000000014 3 37.500000000000007 13.500000000000002 8.5000000000000018 4 1.5000000000000002 64.500000000000014 27.500000000000004 43.500000000000007 25.500000000000004 59.500000000000007 2.5000000000000004 5.5000000000000009 32.500000000000007 5 1.0000000180025095e-35 13.500000000000002 6 8.5000000000000018 24.500000000000004 7 1.5000000000000002 8 9 62.500000000000007 3.5000000000000004 19.500000000000004 1.0000000180025095e-35 1.5000000000000002 4.5000000000000009 11.500000000000002 16.500000000000004 6.5000000000000009 3.5000000000000004 10 11 1.5000000000000002 12 4.5000000000000009 1.0000000180025095e-35 1.0000000180025095e-35 2.5000000000000004 13 14 15 16
decision_type=2 2 1 2 2 2 2 2 9 9 2 2 2 2 2 2 2 2 2 2 2 2 2 2 2 2 2 1 2 2 2 1 2 2 2 2 2 2 2 2 2 9 2 2 1 2 2 1 2 1 9 2 2 2 2 2 2 2 2 2 2 9 1 2 1 2 2 2 2 1 1 9 9
left_child=1 61 3 20 8 15 7 -7 39 11 43 14 13 42 29 22 17 -17 33 -20 48 38 36 27 26 -26 -21 28 -24 30 -10 -31 -16 37 -29 50 44 41 -4 55 45 -8 -13 56 -6 -18 -46 -37 -3 59 -25 -39 53 58 -35 67 -11 -40 64 -42 -9 62 -1 65 -41 68 -55 69 -57 -2 72 -72 -63
right_child=4 2 21 -5 5 6 18 60 9 10 -12 12 -14 -15 32 16 40 -19 19 24 -22 -23 23 35 25 -27 -28 34 -30 31 -32 -33 -34 54 -36 47 -38 51 57 52 49 -43 -44 -45 46 -47 -48 -49 -50 -51 -52 -53 -54 66 -56 63 -58 -59 -60 -61 -62 70 -64 -65 -66 -67 -68 -69 -70 -71 71 -73 -74
leaf_value=-0.022094045275653684 -0.015483268174087031 0.012586384439956497 -0.023119697898365967 -0.013080555798704581 -0.0073440318958661287 0.043441157416329985 -0.0011793341830994698 -0.0072705519772972866 0.0042566742697556573 -0.012822175181409738 0.034220867969398452 -0.016897355235657389 0.011485690964108147 0.02092110888744577 0.015967422365502141 0.054467087106969049 -0.0057921316075210784 -0.0090175168870795502 0.014921297142734144 0.0026360567725537123 0.034229731581945172 0.0040973485337368583 -0.0035807893411425071 -0.01250433711607458 0.014228436099390325 0.00070271057490781943 -0.0060049978698672119 -0.017347266065418841 0.010357314535819971 0.0032161801443274076 -0.0071062803434622642 0.012481970346245024 0.028518295369648779 -0.0075201182872431348 -0.0061290381205404473 -0.0089279352141298663 -0.017479253383911795 0.00061580099020545561 -0.014963856360449519 -0.006821124455506776 0.0011669812450591014 -0.0050744368737991527 -0.02118234162194621 -0.01636832308464891 -0.0087909080063119493 -0.012758026636080971 -0.015615500339351013 -0.0042902304198639725 0.0094756677578907208 -0.0051435759427420989 -0.016341835487850738 -0.0023384738585766735 -0.0011877925126474625 -0.0083018871409524051 -0.011095914623008104 -0.013484507789756656 -0.0034219563467920385 -0.0090222876830580428 -0.0018375813965291817 -0.0023629884382994999 -0.0041974216250309903 -0.024649491110580953 -0.024142962622870551 -0.0063523649862054542 -0.0039616523578965409 -0.014177772250044837 -0.010888543408645875 -0.012606722202526458 -0.0097105295262768405 -0.019192110215244182 -0.024801551768866299 -0.024562079009840337 -0.024829265544880703
leaf_weight=15.524181411601605 0.37743536941707134 18.695017922669649 8.6505627669394034 11.243668697774408 7.5686018466949463 15.165288209915163 14.725725874304771 7.4074333161115629 133.7060582190752 0.76377427205443504 14.184098243713379 19.890219651162624 25.357238441705704 10.146783880889414 11.698670506477358 6.5416803881525976 6.0601057708263379 6.1672654747962952 16.729705899953842 51.89675760269165 5.4471494555473319 5.2178474962711325 53.032840311527252 16.899541452527046 20.222679525613785 1645.523206025362 92.093734085559845 6.212318241596221 19.996436461806297 68.361348159611225 27.413936752825975 41.334544509649277 8.0007321834564191 9.2673049569129962 39.55881741642952 13.416478946805 14.47241999208927 20.396275922656059 2.9137692078948012 9.2775646224617958 4.1965962052345294 71.07641875743866 16.331409513950348 3.5302547067403793 4.2358560338616389 4.4934472739696503 6.1170324385166168 7.7227209508419046 25.089254077523947 12.730173051357268 8.8390663862228411 14.92296554148197 2.5605589114129534 3.8062162175774565 12.292530283331869 1.1762999054044483 1.9533533304929731 1.8653407692909239 2.4814317449927321 7.8950020521879196 6.4545908272266388 2.3206032877787948 11.753577992320059 0.82266513444483269 3.4898796640336558 1.8932380452752111 4.0854780748486519 0.47119983471930016 2.8916094154119492 1.3146842960268244 8.9818886015564203 0.96208727918564996 0.58433811832219396
leaf_count=1539 23 137 103 26 30 27 60 26 1028 34 5 65 41 17 41 23 36 22 28 137 4 10 248 46 35 2014 218 13 84 209 343 144 17 19 165 50 39 81 42 164 25 265 25 17 29 14 27 24 91 39 17 56 29 26 27 57 39 8 29 36 24 249 1243 24 53 34 23 18 100 71 967 103 63
internal_value=0 -0.005631 0.00345503 0.00847326 0.000593161 4.22771e-05 0.000624999 0.0199071 0.00355579 0.00459329 0.0201224 0.0037174 -0.00248868 -0.0101308 0.00524962 -0.00468797 0.00268336 0.0236599 0.000340761 0.000699423 0.0133958 -0.0128194 -0.00647744 -0.00508028 0.000567952 0.000866917 -0.00289061 -0.00280314 0.000235658 0.00409921 0.00232331 0.00670763 0.0210648 -0.00425048 -0.00765164 -0.0108511 -0.0136232 -0.00330558 -0.0193921 -0.00790281 -0.00485269 -0.00440594 -0.0188293 -0.0118869 -0.0105093 -0.00875804 -0.0128232 -0.00723366 0.0108039 -0.00319224 -0.0138222 -0.000632429 -0.0062563 -0.00681715 -0.00955889 -0.0126325 -0.00606432 -0.0126448 -0.00535574 -0.00113785 -0.00583961 -0.023547 -0.0229769 -0.0112044 -0.00603951 -0.011874 -0.00964098 -0.0171106 -0.0108018 -0.0183648 -0.0247574 -0.0247784 -0.0246857
internal_weight=0 119.249 79.1226 60.4751 2661.65 2244.33 1998.17 29.0273 417.321 382.672 20.4315 362.241 71.7257 46.3684 290.515 246.156 48.0843 12.7089 1969.15 1826.47 49.2314 18.6475 198.072 165.678 1809.74 1665.75 143.99 118.8 73.0293 270.816 161.12 109.696 19.6994 142.681 45.7711 46.8778 32.3939 121.121 13.4297 34.6483 35.3753 85.8021 36.2216 6.24738 17.9215 10.5536 10.3529 21.1392 43.7843 24.8218 25.7386 35.3192 25.7011 23.1406 21.5598 8.94713 2.71713 4.77911 15.2489 12.0916 13.862 40.1267 27.2778 6.78381 12.7674 5.96115 7.89169 2.16332 4.06791 1.69212 12.8489 9.94398 2.90494
internal_count=11245 4585 421 258 6660 3984 3017 77 2676 2025 95 1930 148 107 1782 967 195 45 2940 2432 232 163 772 647 2404 2049 355 510 332 1724 1371 353 58 508 178 137 125 462 153 651 150 325 90 90 86 50 56 74 228 100 63 137 324 295 46 327 73 50 246 61 50 4164 2782 215 217 191 49 112 157 94 1382 1070 312
cat_boundaries=0 1 2 3 4 5 6 7 8 9 10 11 12 13 14 15 16 17
cat_threshold=1 1 2 1 1 1 2 1 1 2 2 1 1 2 2 1 1
is_linear=0
shrinkage=0.05


Tree=134
num_leaves=67
num_cat=13
split_feature=2 3 1 3 2 2 0 0 2 2 2 3 2 2 2 3 2 2 2 3 3 2 3 3 2 2 2 1 3 2 3 2 2 3 2 2 2 3 2 3 3 1 2 2 3 0 2 3 2 3 2 2 2 3 0 1 3 1 2 3 3 2 1 1 0 0
split_gain=1.69164 7.57876 2.46038 2.41943 1.64403 2.367 1.88638 1.92135 3.36028 1.30275 2.91777 4.80356 1.94881 1.11263 4.07299 6.31005 1.4058 1.23753 1.27766 0.986835 6.37062 2.12086 0.952358 0.814299 0.712934 0.470836 1.11801 0.822228 0.277265 0.277011 0.225497 0.144863 0.13783 0.130764 0.105464 0.0980415 0.214842 0.0663421 0.0642009 0.0585447 0.0556461 0.0544798 0.0574551 0.0543573 0.0381298 0.0356513 0.0340532 0.0281957 0.0371379 0.0264435 0.022686 0.0188789 0.0141423 0.0126102 0.0113185 0.0114544 0.00863758 0.00802317 0.00581384 0.00516365 0.00487996 0.00468886 0.00161888 7.92434e-06 2.04278e-05 6.18407e-06
threshold=1.0000000180025095e-35 1.0000000180025095e-35 0 6.5000000000000009 23.500000000000004 26.500000000000004 1 2 21.500000000000004 20.500000000000004 22.500000000000004 2.5000000000000004 19.500000000000004 46.500000000000007 48.500000000000007 1.0000000180025095e-35 38.500000000000007 66.500000000000014 67.500000000000014 3.5000000000000004 4.5000000000000009 37.500000000000007 5.5000000000000009 11.500000000000002 84.500000000000014 13.500000000000002 8.5000000000000018 3 1.0000000180025095e-35 64.500000000000014 4.5000000000000009 25.500000000000004 57.500000000000007 1.0000000180025095e-35 5.5000000000000009 41.500000000000007 43.500000000000007 1.0000000180025095e-35 13.500000000000002 2.5000000000000004 1.0000000180025095e-35 4 24.500000000000004 32.500000000000007 1.5000000000000002 5 42.500000000000007 3.5000000000000004 19.500000000000004 1.0000000180025095e-35 1.5000000000000002 4.5000000000000009 16.500000000000004 3.5000000000000004 6 7 1.5000000000000002 8 4.5000000000000009 1.0000000180025095e-35 1.0000000180025095e-35 2.5000000000000004 9 10 11 12
decision_type=2 2 1 2 2 2 9 9 2 2 2 2 2 2 2 2 2 2 2 2 2 2 2 2 2 2 2 1 2 2 2 2 2 2 2 2 2 2 2 2 2 1 2 2 2 9 2 2 2 2 2 2 2 2 9 1 2 1 2 2 2 2 1 1 9 9
left_child=1 54 3 22 6 31 34 9 38 12 11 37 25 16 15 -15 19 29 -19 21 -21 33 44 39 -20 26 -8 -27 -14 32 35 41 -16 -7 50 45 -37 -11 51 -4 -33 42 -6 -22 -3 -18 -32 48 52 -31 60 -9 57 -17 55 -1 58 -36 61 -50 62 -52 -2 65 -65 -56
right_child=4 2 23 -5 5 13 7 8 -10 10 -12 -13 28 14 17 53 30 18 24 20 43 -23 -24 -25 -26 27 -28 -29 -30 49 46 40 -34 -35 47 36 -38 -39 -40 -41 -42 -43 -44 -45 -46 -47 -48 -49 59 -51 56 -53 -54 -55 63 -57 -58 -59 -60 -61 -62 -63 -64 64 -66 -67
leaf_value=-0.022032942081254874 -0.015337436375239669 0.012118406638644457 -0.023079713394767758 -0.012925867003050016 -0.0078194061499126926 -0.0036330838843936773 0.0041331277953309889 -0.012667226941623111 0.032234306120833091 -0.016762188588630836 0.01107097419159651 0.019973903281245851 0.026646042259034237 0.040538908800950256 -0.0046926922683120575 -0.0071424253054969862 -0.0076145256974414245 0.014332569726320811 -0.0028272881433960852 0.049600590325924038 -0.009444437355024253 0.016345684581657551 0.032242369959595577 0.00062554370694119362 0.00084462198892338604 0.0031261258391588193 -0.0069798871642950304 0.012019147766470414 0.014838275994858808 -0.0073894603507532021 0.00013217423985310926 -0.018978222013395812 -0.0012771381744391169 -0.007785759087940324 -0.0066978687352345564 -0.01365289668879504 -0.0069806253844921107 -0.02110426780196898 -0.01622869206961736 -0.014815121520215371 -0.013073231555107801 -0.0067758763019919004 -0.015233249109862103 -0.0039990945224816282 0.0091521388571057048 -0.0026255556242059173 -0.0047607313537478121 -0.0011596946679519177 -0.0081641077154893799 -0.01094268180434981 -0.013330493500960376 -0.0033485758822557306 -0.0017952935054458439 -0.0041106390551254729 -0.024645007274128203 -0.024126194095329012 -0.0062346191937607117 -0.0038788182366086619 -0.014025682566836251 -0.010735919826212317 -0.012451660591872169 -0.0095630037174663837 -0.019082874460917505 -0.02480085454908142 -0.024555435369873382 -0.024829265613883048
leaf_weight=15.184950979426505 0.37163643352687359 18.931807721033692 8.4528583548963088 11.097552742809055 4.4188230261206627 58.451301291584969 134.27641563117504 0.75404353253543499 14.677891612052917 19.556950584053993 25.650162696838379 10.361302085220812 8.9779284149408358 15.838604688644411 69.177830189466476 7.3537724763154966 16.932709932327271 16.981206178665161 143.5761095136404 6.9885319024324444 8.1623010635375994 13.474719494581221 5.6368314027786246 7.08785755932331 1667.1924138367176 68.581563957035542 27.219816368073225 41.853714048862457 11.141222938895224 9.1978753209114092 6.6543559283018094 8.912561699748041 51.544148147106171 28.056546978652477 9.2144965827465057 26.50319878757 22.145512804389 15.989109843969343 3.4729406759142876 2.8704926148056975 7.2230095937848082 8.0739409849047661 6.3955135494470596 10.451027110219 25.328122084960341 4.54130591452122 7.6373445838689804 2.55751934275031 3.7747481614351264 12.156887471675871 1.1605445239692924 1.9466804973781107 2.4768760800361624 6.4275549054145813 2.2641007862985134 11.473209465853868 0.81745583377778519 3.4760813340544745 1.866585489362478 4.0412344634532928 0.46529683470726002 2.8636661916971207 1.289693428203462 8.7618639189749956 0.93874430377036056 0.57000803947448764
leaf_count=1539 23 137 103 26 32 242 1028 34 5 65 41 17 33 27 262 26 73 28 355 22 37 37 4 18 2049 209 343 144 25 19 29 19 200 144 164 66 79 25 17 42 28 34 29 45 91 25 26 29 26 27 57 39 29 24 249 1243 24 53 34 23 18 100 71 967 103 63
internal_value=0 -0.00552564 0.00335426 0.00818977 0.000577383 4.07469e-05 0.00345313 0.0044565 0.0192168 0.00361006 -0.00243619 -0.00998315 0.00509149 0.00024518 0.000608808 0.019012 -0.003217 0.000332083 0.000681494 0.000137006 0.00889593 -0.00210583 0.0128861 -0.0126652 0.000553476 0.00398053 0.00226005 0.00649648 0.0201073 -0.00416293 -0.00820681 -0.0128557 -0.00323437 -0.00497989 -0.00776866 -0.00937347 -0.0106156 -0.0187153 -0.0117323 -0.0209846 -0.0163349 -0.00988365 -0.0122039 -0.00638698 0.0104209 -0.00655946 -0.00248255 -0.00613983 -0.006694 -0.00941225 -0.0124775 -0.00595035 -0.0052512 -0.00572841 -0.0235165 -0.0229338 -0.0110509 -0.0059257 -0.0117193 -0.00949386 -0.0169775 -0.0106495 -0.018245 -0.0247556 -0.0247771 -0.0246821
internal_weight=0 118.598 79.4055 60.9943 2663.3 2244.47 418.836 384.46 20.8516 363.608 71.5575 45.9074 292.051 2209.45 1999.45 29.6199 209.999 1969.83 1827.75 125.584 25.6019 99.9826 49.8968 18.4112 1810.77 271.932 161.496 110.435 20.1192 142.077 84.4144 35.0238 120.722 86.5078 34.3758 70.1227 48.6487 35.5461 6.17366 11.3234 16.1356 18.8883 10.8143 18.6133 44.2599 21.474 14.2917 25.541 22.9834 21.3548 8.83488 2.70072 15.1675 13.7813 39.1929 26.6582 6.70825 12.6906 5.8908 7.81598 2.12663 4.02421 1.66133 12.5347 9.70061 2.83411
internal_count=11245 4585 421 258 6660 3984 2676 2025 95 1930 148 107 1782 3842 3017 77 825 2940 2432 527 104 423 232 163 2404 1724 1371 353 58 508 298 142 462 386 651 243 145 90 90 145 47 95 61 82 228 98 55 324 295 46 327 73 246 50 4164 2782 215 217 191 49 112 157 94 1382 1070 312
cat_boundaries=0 1 2 3 4 5 6 7 8 9 10 11 12 13
cat_threshold=1 1 2 1 1 2 2 1 1 2 2 1 1
is_linear=0
shrinkage=0.05


Tree=135
num_leaves=69
num_cat=14
split_feature=2 3 1 3 2 2 0 0 2 2 2 3 2 2 2 3 2 2 2 2 3 2 2 3 3 2 2 2 1 3 2 1 3 3 2 2 2 2 2 2 3 2 3 3 1 2 3 0 2 2 2 3 2 2 3 0 1 2 3 3 1 2 3 2 1 1 0 0
split_gain=1.61784 7.397 2.34255 2.28222 1.55571 2.28006 1.79335 1.77532 3.07008 1.23202 2.77919 4.60902 1.79859 1.06144 3.79096 5.68092 1.35161 1.18069 1.19577 0.952156 1.3544 6.27395 1.89331 0.855457 0.800746 0.679666 0.441964 1.06391 0.764831 0.279546 0.267968 0.223185 0.230142 0.218846 0.210355 0.143317 0.132568 0.103014 0.0957787 0.21088 0.0668009 0.0631849 0.0590856 0.0555713 0.053348 0.0566239 0.0351055 0.0344855 0.032618 0.0274715 0.0285304 0.025864 0.0224768 0.0183583 0.0122003 0.011565 0.0116791 0.0100997 0.00927336 0.008459 0.00775852 0.00573628 0.00486989 0.00461308 0.00162366 8.12117e-06 2.09337e-05 6.33746e-06
threshold=1.0000000180025095e-35 1.0000000180025095e-35 0 6.5000000000000009 23.500000000000004 26.500000000000004 1 2 21.500000000000004 20.500000000000004 22.500000000000004 2.5000000000000004 19.500000000000004 46.500000000000007 48.500000000000007 1.0000000180025095e-35 38.500000000000007 66.500000000000014 67.500000000000014 31.500000000000004 3.5000000000000004 33.500000000000007 37.500000000000007 5.5000000000000009 11.500000000000002 82.500000000000014 13.500000000000002 8.5000000000000018 3 1.5000000000000002 64.500000000000014 4 1.0000000180025095e-35 4.5000000000000009 27.500000000000004 25.500000000000004 59.500000000000007 5.5000000000000009 41.500000000000007 43.500000000000007 1.0000000180025095e-35 13.500000000000002 2.5000000000000004 1.0000000180025095e-35 5 24.500000000000004 1.5000000000000002 6 42.500000000000007 18.500000000000004 16.500000000000004 1.0000000180025095e-35 1.5000000000000002 4.5000000000000009 3.5000000000000004 7 8 20.500000000000004 3.5000000000000004 1.5000000000000002 9 4.5000000000000009 1.0000000180025095e-35 2.5000000000000004 10 11 12 13
decision_type=2 2 1 2 2 2 9 9 2 2 2 2 2 2 2 2 2 2 2 2 2 2 2 2 2 2 2 2 1 2 2 1 2 2 2 2 2 2 2 2 2 2 2 2 1 2 2 9 2 2 2 2 2 2 2 9 1 2 2 2 1 2 2 2 1 1 9 9
left_child=1 55 3 23 6 35 37 9 41 12 11 40 26 16 15 -15 19 30 -19 31 22 -22 -21 46 42 -20 27 -8 -28 -14 36 32 -7 38 -33 44 -16 52 47 -40 -11 53 -4 -37 -6 -46 -3 -18 -35 50 58 -32 62 -9 -17 56 -1 -51 60 61 -39 63 64 -54 -2 67 -67 -57
right_child=4 2 24 -5 5 13 7 8 -10 10 -12 -13 29 14 17 54 33 18 25 20 21 -23 -24 -25 -26 -27 28 -29 -30 -31 51 34 -34 48 -36 43 -38 49 39 -41 -42 -43 -44 -45 45 -47 -48 -49 -50 57 -52 -53 59 -55 -56 65 -58 -59 -60 -61 -62 -63 -64 -65 -66 66 -68 -69
leaf_value=-0.021970645495750445 -0.018972164506118036 0.011673360870805874 -0.023038864544396149 -0.012771006449975831 -0.0066531334819596071 0.00057129922931891698 0.0040136700233807882 -0.012512187783774687 0.030424233440140482 -0.016625826944459757 0.010675714849243324 0.019087886365150752 0.014378084319027882 0.037941946372451019 -0.004232695578613878 -0.0070156461391292614 -0.007482943240627953 0.013775283361398908 -0.0030303719175392165 -0.006216723023642531 0.055284618996556137 -0.006210611862091632 0.015678122620520433 0.030431589521298853 0.0006096259271893595 0.00080213593622454292 0.0030388703858386531 -0.0068548648357233607 0.011578911848130626 0.026254752659464638 -0.0072601126219247183 -0.016381798602998349 -0.0072566191010827522 0.00012887533104470234 -0.0052103541325226356 -0.018866118916189559 -0.00058620531166514282 -0.003797397436151418 -0.013499260483673517 -0.006855594972627662 -0.02102481903757214 -0.016087977595772667 -0.014665656427089649 -0.01291853323538035 -0.007685877993170314 -0.015085951315313843 0.0088425567274079599 -0.0025671819744875783 -0.0046649626196838571 -0.0099432426224982211 0.0020172470756797765 -0.010789890947190739 -0.0131761825665173 -0.0032765256116239825 -0.0040252971146834812 -0.024640409345709515 -0.024109024234590215 -0.0067185113508270965 -0.0014691535085785282 -0.0061183268714346054 -0.00657601940244188 -0.013873087434164356 -0.012296574988374734 -0.0094163117672742512 -0.015190732709958047 -0.024800139586847417 -0.02454862780459971 -0.024829265443589529
leaf_weight=14.854040885344149 1.2653156612068397 19.162626961246133 8.2600029744207877 10.955030530691145 8.0194178447127342 24.645646750926971 134.83254625089467 0.74455213733017567 15.158730745315552 19.231865681707859 25.935712695121765 10.570338726043699 12.172896444797518 16.493876934051517 85.080422431230545 7.301435783505438 16.804264858365059 17.226343035697937 124.19656299054623 35.373642086982727 6.4808665961027172 11.520464748144148 13.696782633662222 5.8215382099151602 7.0922926366329184 1687.5753463059664 68.796293638646603 27.030486363917589 42.35979588329792 8.355245962738989 9.1301581859588641 6.402816109359267 15.168424963951109 6.6552354991435987 12.325219824910162 8.7450121194124204 35.251899376511574 3.4626243226230145 26.143812373280525 21.991461291909218 15.655207157135008 3.4170342460274696 2.8282793387770644 7.1291960552334777 4.3844050541520119 6.2988274767994881 25.560992799699306 4.5293980687856701 7.6010716557502747 4.1780874058604223 1.4331325665116299 12.024583652615545 1.145176572725177 1.9401727840304372 6.4011876583099365 2.2089838832616806 11.199717285111545 5.7969390898942947 1.360965859144925 0.81237513385713089 9.1529853157699126 1.8405880890786646 0.45953904837369908 2.8364115245640278 0.36597998626530182 8.547234664671123 0.9159737201407524 0.55602941382676396
leaf_count=1539 71 137 103 26 34 80 1028 34 5 65 41 17 41 27 325 26 73 28 306 177 19 47 37 4 18 2098 209 343 144 17 19 15 90 29 62 19 137 53 66 79 25 17 42 28 32 29 91 25 26 29 20 27 57 39 24 249 1243 40 18 24 164 34 18 100 23 967 103 63
internal_value=0 -0.00542162 0.0032569 0.00791817 0.00056209 3.93212e-05 0.00335385 0.00432447 0.0183696 0.00350624 -0.00238463 -0.0098362 0.00493895 0.000238649 0.0005931 0.0181749 -0.00314889 0.00032367 0.00066408 0.000131156 0.00419811 0.015929 -0.000105324 0.0124023 -0.0125109 0.000539418 0.00386576 0.00219867 0.00629334 0.0192121 -0.0040768 -0.00452836 -0.00241099 -0.00806998 -0.00902969 -0.012701 -0.00316444 -0.00763576 -0.00922801 -0.010464 -0.0185998 -0.011578 -0.0209031 -0.016195 -0.00973531 -0.012049 0.0100555 -0.00643927 -0.00242707 -0.00602481 -0.00470143 -0.00926648 -0.0123225 -0.00583784 -0.0056187 -0.0234852 -0.0228899 -0.00806921 -0.00539035 -0.0108979 -0.00581337 -0.0115648 -0.0168431 -0.0104977 -0.0181238 -0.0247538 -0.0247758 -0.0246784
internal_weight=0 117.963 79.6808 61.5002 2664.91 2244.6 420.311 386.201 21.2605 364.94 71.3931 45.4574 293.547 2210.02 2000.68 30.1965 209.339 1970.49 1829 125.614 67.0718 18.0013 49.0704 50.5452 18.1806 1811.77 273.019 161.863 111.156 20.5281 141.487 58.5421 39.8141 83.7252 18.728 34.5769 120.332 34.1101 69.4689 48.1353 34.8871 6.10176 11.0883 15.8742 18.7027 10.6832 44.7236 21.3337 14.2563 25.3847 15.4097 21.1547 8.72539 2.68472 13.7026 38.282 26.0538 9.97503 13.9766 6.63455 12.6156 5.82218 2.09083 3.98159 1.6313 12.2282 9.46321 2.76501
internal_count=11245 4585 421 258 6660 3984 2676 2025 95 1930 148 107 1782 3842 3017 77 825 2940 2432 527 280 66 214 232 163 2404 1724 1371 353 58 508 247 170 298 77 142 462 651 243 145 90 90 145 47 95 61 228 98 55 324 255 46 327 73 50 4164 2782 69 235 215 217 191 112 157 94 1382 1070 312
cat_boundaries=0 1 2 3 4 5 6 7 8 9 10 11 12 13 14
cat_threshold=1 1 2 1 1 2 2 2 1 2 1 2 1 1
is_linear=0
shrinkage=0.05


Tree=136
num_leaves=70
num_cat=12
split_feature=2 3 1 3 2 2 0 0 2 2 2 3 2 2 2 3 2 2 2 2 3 2 2 3 3 2 2 2 3 3 2 1 3 3 2 2 3 2 2 2 2 3 2 3 3 0 3 2 3 2 3 2 2 2 3 2 0 1 3 3 1 2 3 3 2 1 1 0 0
split_gain=1.54711 7.2194 2.23088 2.1541 1.47238 2.19598 1.70509 1.64232 2.81208 1.16536 2.64773 4.42513 1.66193 1.01271 3.53189 5.13194 1.29912 1.12638 1.1198 0.904697 1.25964 5.58322 1.78335 0.787603 0.770534 0.648945 0.438569 1.37206 0.589458 0.260391 0.259141 0.21572 0.220893 0.212319 0.206351 0.141723 0.135477 0.12842 0.100581 0.0935287 0.2069 0.0672404 0.0621594 0.0554739 0.0525435 0.0333473 0.0323584 0.0312387 0.0270203 0.0355727 0.0252862 0.0228197 0.0222595 0.0178459 0.0140358 0.0133024 0.0118159 0.0119068 0.0117998 0.00828058 0.0075002 0.00565712 0.00512848 0.00485783 0.00453645 0.00162784 8.32292e-06 2.14525e-05 6.49443e-06
threshold=1.0000000180025095e-35 1.0000000180025095e-35 0 6.5000000000000009 23.500000000000004 26.500000000000004 1 2 21.500000000000004 20.500000000000004 22.500000000000004 2.5000000000000004 19.500000000000004 46.500000000000007 48.500000000000007 1.0000000180025095e-35 38.500000000000007 66.500000000000014 67.500000000000014 31.500000000000004 3.5000000000000004 33.500000000000007 37.500000000000007 52.500000000000007 5.5000000000000009 84.500000000000014 3.5000000000000004 5.5000000000000009 1.0000000180025095e-35 1.0000000180025095e-35 64.500000000000014 3 1.0000000180025095e-35 4.5000000000000009 27.500000000000004 25.500000000000004 2.5000000000000004 57.500000000000007 5.5000000000000009 41.500000000000007 43.500000000000007 1.0000000180025095e-35 13.500000000000002 1.0000000180025095e-35 1.0000000180025095e-35 4 1.5000000000000002 42.500000000000007 3.5000000000000004 19.500000000000004 1.0000000180025095e-35 24.500000000000004 1.5000000000000002 4.5000000000000009 11.500000000000002 16.500000000000004 5 6 3.5000000000000004 1.5000000000000002 7 4.5000000000000009 1.0000000180025095e-35 1.0000000180025095e-35 2.5000000000000004 8 9 10 11
decision_type=2 2 1 2 2 2 9 9 2 2 2 2 2 2 2 2 2 2 2 2 2 2 2 2 2 2 2 2 2 2 2 1 2 2 2 2 2 2 2 2 2 2 2 2 2 9 2 2 2 2 2 2 2 2 2 2 9 1 2 2 1 2 2 2 2 1 1 9 9
left_child=1 56 3 24 6 35 38 9 42 12 11 41 26 16 15 -15 19 30 -19 31 22 -22 -21 36 46 -20 28 -28 -8 -14 37 32 -7 39 -33 44 -4 -16 52 45 -41 -11 53 -37 51 -18 -3 -35 49 55 -32 -6 63 -9 -38 60 57 -1 -17 61 -40 64 -51 65 -54 -2 67 -58 -68
right_child=4 2 23 -5 5 13 7 8 -10 10 -12 -13 29 14 17 58 33 18 25 20 21 -23 -24 -25 -26 -27 27 -29 -30 -31 50 34 -34 47 -36 43 54 -39 48 40 -42 -43 -44 -45 -46 -47 -48 -49 -50 62 -52 -53 59 -55 -56 -57 66 -59 -60 -61 -62 -63 -64 -65 -66 -67 68 -69 -70
leaf_value=-0.021907146829098546 -0.015043198399690653 0.011249734154622533 -0.022997137209413574 -0.012616022987358739 -0.0090845672865708087 0.0005567923807817029 0.001307838790998735 -0.012357106093893193 0.028768502018756421 -0.016488297959158883 0.010298690574763587 0.018257552602044019 0.024577041710811862 0.035604903252201899 -0.0045121610437320915 -0.0068902326463714031 -0.0073526547711907867 0.013247140799776286 -0.0027092865992629322 -0.0061006535113418223 0.050975760543222663 -0.0060946187761071503 0.015047995080369672 0.0039435075426279198 0.028775248489096628 0.00080237814646800815 0.013383551419888846 0.0029329459006677905 -0.016756442521839266 0.013358978754756926 -0.0071320945720793746 -0.01624227368092698 -0.0071286373671205416 0.00012565897420322531 -0.0051078659695789766 -0.018752550053482753 -0.014515502130904074 -0.0012061083567969494 -0.0064555903079842828 -0.013345276656666724 -0.0067319512174131048 -0.020943984501026278 -0.01594621034604065 -0.012763665891610139 -0.0062449484034380574 -0.0025099576413364151 0.0085461235565714791 -0.0045706769970258847 -0.0010238072278349131 -0.0078908026490672311 -0.010637587520857365 -0.013627637820940831 -0.013021624205467314 -0.003205791708543989 -0.0088987163718494151 -0.0016847357686305348 -0.024799409124694714 -0.024091449187286729 -0.0039413861475690809 -0.0060034961737717015 -0.0037173791964039897 -0.013720032173710107 -0.010476025455909414 -0.012141514621271157 -0.0092704933990102028 -0.018859981724135423 -0.024635699720903077 -0.024541652297175764 -0.024829265005224282
leaf_weight=14.531246166676285 0.36046251468360424 19.387628521770239 8.0718771778047103 10.816013142466543 4.784104101359846 24.659731864929199 42.393929574638605 0.73529419489205006 15.627011179924011 18.914763420820236 26.214078664779663 10.774041920900343 9.3538995087146777 17.131710469722751 68.563138455152512 7.2503907531499845 16.67898878455162 17.465283185243607 142.81018577516079 35.154416009783745 6.8492479920387295 11.449137344956396 13.913214698433874 5.2457460463047019 6.0014196634292594 1669.9401381313801 37.667852539569139 188.96326115727425 5.0543931461870661 11.572800248861311 9.0641122162342089 6.2987812682986286 15.058751933276652 6.6560933142900449 12.261168122291563 8.5815740525722486 2.7871034592390052 51.389166161417961 9.0929924752563238 25.793261528015137 21.84121236205101 15.329495340585707 3.3625009283423424 7.0376896485686293 7.1912130713462821 4.5177851915359524 25.788019638508558 7.5656954795122147 2.5429203771054736 3.7138419225811949 11.895537316799162 6.546276830136776 1.1301864385604861 1.9338261783123014 1.8508715331554411 2.4650444388389579 8.3378693526610732 10.932931277900932 6.3754727691411972 0.80741993524134148 3.4495002850890204 1.8152297325432298 3.9680598527193069 0.45392289198935021 2.80982830747962 1.2415361832827314 2.1552187213674188 0.89376161899417361 0.54239361640065853
leaf_count=1539 23 137 103 26 29 80 449 34 5 65 41 17 33 27 262 26 73 28 355 177 19 47 37 10 4 2049 213 969 93 25 19 15 90 29 62 19 42 200 164 66 79 25 17 28 43 25 91 26 29 26 27 23 57 39 8 29 967 1243 24 24 53 34 23 18 100 71 249 103 63
internal_value=0 -0.00531897 0.00316279 0.0076578 0.000547208 3.79287e-05 0.00325781 0.00419698 0.0175755 0.0034058 -0.00233398 -0.00968996 0.00479174 0.00023228 0.000577819 0.0173904 -0.00308224 0.000315474 0.000647123 0.00012508 0.00407132 0.0152673 -0.000103916 -0.0123566 0.0119426 0.000525726 0.00375475 0.00466992 -0.000616444 0.0183733 -0.0039921 -0.00443651 -0.00235704 -0.00793433 -0.0088866 -0.0125461 -0.0190841 -0.0030958 -0.00750412 -0.00908347 -0.010313 -0.0184829 -0.0114239 -0.0160541 -0.00958776 -0.0063205 0.00970641 -0.00237269 -0.00591125 -0.00645901 -0.00912162 -0.0117094 -0.0121675 -0.00572681 -0.012274 -0.00504258 -0.0234533 -0.022845 -0.00551048 -0.0107453 -0.00570251 -0.0114105 -0.00922619 -0.0167074 -0.0103465 -0.0180012 -0.0247519 -0.0247745 -0.0246746
internal_weight=0 117.342 79.9487 61.9931 2666.47 2244.72 421.748 387.897 21.6586 366.239 71.2324 45.0183 295.006 2210.58 2001.89 30.7576 208.697 1971.13 1830.22 125.644 67.366 18.2984 49.0676 17.9556 51.1771 1812.75 274.079 226.631 47.4483 20.9267 140.912 58.2784 39.7185 83.053 18.5599 34.1409 12.7099 119.952 33.8509 68.8312 47.6345 34.2443 6.03162 15.6193 18.5216 21.1968 45.1756 14.2218 25.2324 22.6894 20.9596 11.3304 8.61859 2.66912 4.63797 15.0075 37.3934 25.4642 13.6259 6.56266 12.5425 5.75524 7.6819 2.05592 3.94001 1.602 11.9292 9.23163 2.69761
internal_count=11245 4585 421 258 6660 3984 2676 2025 95 1930 148 107 1782 3842 3017 77 825 2940 2432 527 280 66 214 163 232 2404 1724 1182 542 58 508 247 170 298 77 142 153 462 651 243 145 90 90 47 95 98 228 55 324 295 46 52 327 73 50 246 4164 2782 50 215 217 191 49 112 157 94 1382 1070 312
cat_boundaries=0 1 2 3 4 5 6 7 8 9 10 11 12
cat_threshold=1 1 2 1 2 2 1 1 2 1 1 1
is_linear=0
shrinkage=0.05


Tree=137
num_leaves=69
num_cat=12
split_feature=2 3 1 3 2 2 0 0 2 2 2 3 2 2 2 3 2 2 2 2 3 2 2 3 3 2 2 2 2 3 2 1 3 3 2 2 2 2 2 2 3 2 3 3 1 2 0 2 3 3 2 3 2 2 2 0 1 3 3 2 2 3 3 2 1 1 0 0
split_gain=1.47936 7.04584 2.12502 2.03435 1.39368 2.11468 1.62134 1.52099 2.58176 1.10251 2.52294 4.25101 1.5374 0.966119 3.29352 4.65031 1.24847 1.07451 1.04927 0.859715 1.17267 4.99336 1.68066 0.773776 0.69581 0.619793 0.422014 1.00062 0.719509 0.262376 0.250529 0.208443 0.211978 0.205918 0.202344 0.140086 0.123234 0.0981647 0.0912933 0.202908 0.06766 0.0611256 0.0601331 0.0553538 0.0529157 0.0558803 0.0322366 0.0299132 0.0298587 0.026047 0.0345472 0.0247107 0.0220345 0.0173418 0.0128106 0.0120714 0.0121374 0.0114088 0.00810246 0.00751433 0.00557648 0.00501532 0.00484379 0.00445906 0.00163141 8.53006e-06 2.19836e-05 6.65544e-06
threshold=1.0000000180025095e-35 1.0000000180025095e-35 0 6.5000000000000009 23.500000000000004 26.500000000000004 1 2 21.500000000000004 20.500000000000004 22.500000000000004 2.5000000000000004 19.500000000000004 46.500000000000007 48.500000000000007 1.0000000180025095e-35 38.500000000000007 66.500000000000014 67.500000000000014 31.500000000000004 3.5000000000000004 33.500000000000007 37.500000000000007 11.500000000000002 5.5000000000000009 81.500000000000014 13.500000000000002 8.5000000000000018 16.500000000000004 1.5000000000000002 64.500000000000014 3 1.0000000180025095e-35 4.5000000000000009 27.500000000000004 25.500000000000004 59.500000000000007 5.5000000000000009 41.500000000000007 43.500000000000007 1.0000000180025095e-35 13.500000000000002 2.5000000000000004 1.0000000180025095e-35 4 24.500000000000004 5 42.500000000000007 1.5000000000000002 3.5000000000000004 19.500000000000004 1.0000000180025095e-35 1.5000000000000002 4.5000000000000009 16.500000000000004 6 7 3.5000000000000004 1.5000000000000002 13.500000000000002 4.5000000000000009 1.0000000180025095e-35 1.0000000180025095e-35 2.5000000000000004 8 9 10 11
decision_type=2 2 1 2 2 2 9 9 2 2 2 2 2 2 2 2 2 2 2 2 2 2 2 2 2 2 2 2 2 2 2 1 2 2 2 2 2 2 2 2 2 2 2 2 1 2 9 2 2 2 2 2 2 2 2 9 1 2 2 2 2 2 2 2 1 1 9 9
left_child=1 55 3 24 6 35 37 9 41 12 11 40 26 16 15 -15 19 30 -19 31 22 -22 -21 42 48 -20 27 -8 -28 -14 36 32 -7 38 -33 44 -16 52 46 -40 -11 53 -4 -37 45 -6 -18 -35 -3 50 54 -32 62 -9 59 56 -1 -17 60 -39 63 -52 64 -54 -2 67 -67 -57
right_child=4 2 23 -5 5 13 7 8 -10 10 -12 -13 29 14 17 57 33 18 25 20 21 -23 -24 -25 -26 -27 28 -29 -30 -31 51 34 -34 47 -36 43 -38 49 39 -41 -42 -43 -44 -45 -46 -47 -48 -49 -50 -51 61 -53 58 -55 -56 65 -58 -59 -60 -61 -62 -63 -64 -65 -66 66 -68 -69
leaf_value=-0.021842424693366863 -0.018746334161048955 0.010846126157132685 -0.02295451558105872 -0.012460964101215435 -0.0074129196530723796 0.00054266127023255373 0.0037657729625625441 -0.012202029859473589 0.027248542333600342 -0.016349629793317902 0.0099387748385197493 0.017478029182638188 0.012982431366973713 0.03349100567341063 -0.0040649058307606562 -0.0067662016586357973 -0.0072236818008962035 0.012746063102757506 -0.0029919047287883839 -0.0059860474997576966 0.047208375939384421 -0.0059800896661070264 0.014452412686049357 0.00057861895260910773 0.027254741986755471 0.00075618037008795948 0.0092687433705167764 -0.0067842322237327661 0.001091204801318979 0.024270681831461274 -0.0070054254213446319 -0.016101662271338288 -0.0070020052243444991 0.00012252343516794411 -0.0050068740489854118 -0.018637520698420392 -0.00054271517840378712 -0.0048011070676052901 -0.013190992558493739 -0.006609710223279653 -0.020861752893808313 -0.015803423871079421 -0.014364700598883746 -0.012608677822976208 -0.0063489120985674224 -0.01483694436785829 -0.0024538668867142557 -0.0044778696894355119 0.0082621098350041753 -0.00099942257714061267 -0.007756615782077432 -0.01048581616314794 -0.012866863532720797 -0.0031363601243839002 -0.0016457103831343377 -0.024630870391578297 -0.024073457540791703 -0.0038588965946526072 -0.0058901359145708439 -0.007494994765774754 -0.013566562330706078 -0.010324870500319076 -0.011986527154183968 -0.0091255850873349 -0.014894872038285548 -0.024798660168629992 -0.024534507549782494 -0.024829264324829819
leaf_weight=14.216370460577311 1.2183401826769096 19.606967248022556 7.8883652426302451 10.680415343493221 4.3156903609633464 24.673465237021446 136.00143874809146 0.72626400925219359 16.083105981349945 18.605447888374329 26.485443890094757 10.972556017339228 12.622205555438997 17.752672374248508 84.392916947603226 7.2006056904792768 16.556803718209267 17.698187291622162 117.97139599919319 34.940604209899902 7.2074457406997707 11.379571363329886 14.124164089560507 7.1009478420019141 6.1766208410263053 1695.7329998612404 67.443076007068157 26.924682695418596 44.744283005595207 8.6928718388080579 8.9996962845325488 6.1973011717200306 14.95178524404764 6.6569297164678556 12.198699012398718 8.4221473187208158 35.188773155212402 8.8044892307370954 25.451330110430717 21.694672182202339 15.011773541569708 3.3093070462346077 2.746939480304718 6.9484336376190177 7.8874031305313101 6.1418615207076073 4.5064599066972759 7.5311940610408783 26.00935267098248 2.540318250656127 3.684652015566825 11.769668340682982 1.1155650205910208 1.9276366457343099 2.4608950391411772 2.1027721390128136 10.672689375467597 6.350394070148468 0.80258711613714684 3.6666926331818095 1.7904948666691778 3.9267072901129723 0.44844490103423584 2.7839002050459385 0.35508057009428751 8.1336373975500464 0.87209418695419749 0.52909219823777709
leaf_count=1539 71 137 103 26 32 80 1028 34 5 65 41 17 41 27 325 26 73 28 289 177 19 47 37 18 4 2115 197 343 156 17 19 15 90 29 62 19 137 176 66 79 25 17 42 28 34 29 25 26 91 29 26 27 57 39 29 249 1243 24 24 41 34 23 18 100 23 967 103 63
internal_value=0 -0.00521771 0.00307173 0.00740805 0.000532751 3.66016e-05 0.00316487 0.00407382 0.0168298 0.0033086 -0.00228424 -0.00954446 0.0046496 0.000226101 0.000562951 0.0166539 -0.0030167 0.00030749 0.000630611 0.000119403 0.00394924 0.0146447 -0.000102474 -0.0122023 0.0115053 0.000512388 0.00364731 0.00202231 0.00600725 0.0175861 -0.00390883 -0.00434612 -0.00230417 -0.0077999 -0.00874452 -0.0123911 -0.00302845 -0.00737378 -0.00893989 -0.0101626 -0.0183645 -0.0112701 -0.0207359 -0.0159121 -0.009441 -0.0117731 -0.00620319 -0.00231941 0.00937278 -0.00579918 -0.00634004 -0.00897771 -0.0120126 -0.00561726 -0.00494258 -0.0234207 -0.0227991 -0.00540375 -0.0105932 -0.00559315 -0.0112566 -0.00908158 -0.0165706 -0.0101959 -0.0178772 -0.0247499 -0.0247731 -0.0246708
internal_weight=0 116.736 80.2096 62.4734 2667.99 2244.84 423.148 389.55 22.0463 367.504 71.0752 44.5898 296.429 2211.13 2003.06 31.3037 208.07 1971.75 1831.4 125.673 67.6518 18.587 49.0648 17.7363 51.7929 1813.7 275.113 162.926 112.187 21.3151 140.351 58.0213 39.6253 82.3974 18.396 33.7155 119.582 33.5982 68.2093 47.146 33.6172 5.96321 10.6353 15.3706 18.345 10.4576 21.0633 14.1881 45.6163 25.0838 22.5434 20.7694 8.51441 2.6539 14.9321 36.5267 24.8891 13.551 6.49255 12.4712 5.68996 7.61136 2.02187 3.89947 1.57342 11.6376 9.00573 2.63186
internal_count=11245 4585 421 258 6660 3984 2676 2025 95 1930 148 107 1782 3842 3017 77 825 2940 2432 527 280 66 214 163 232 2404 1724 1371 353 58 508 247 170 298 77 142 462 651 243 145 90 90 145 47 95 61 98 55 228 324 295 46 327 73 246 4164 2782 50 215 217 191 49 112 157 94 1382 1070 312
cat_boundaries=0 1 2 3 4 5 6 7 8 9 10 11 12
cat_threshold=1 1 2 1 1 2 2 1 1 2 1 1
is_linear=0
shrinkage=0.05


Tree=138
num_leaves=70
num_cat=12
split_feature=2 3 1 3 2 2 0 0 3 2 2 2 3 2 2 2 3 2 2 2 2 3 3 2 3 3 2 2 2 3 3 2 1 3 3 2 2 2 2 2 2 3 3 3 3 2 0 2 3 2 2 3 2 2 0 1 3 2 3 3 1 2 2 3 2 1 1 0 0
split_gain=1.41445 6.87623 2.02456 1.92229 1.31937 2.03611 1.54186 1.41009 2.52176 12.9242 1.04325 2.40443 4.08586 1.42372 0.921589 3.07384 4.22571 1.19961 1.02497 0.983705 0.817065 1.09272 4.90216 1.58465 0.760389 0.629823 0.591275 0.412859 1.27113 0.567713 0.245649 0.242131 0.201354 0.203389 0.199642 0.198339 0.138405 0.11957 0.0957683 0.0890744 0.198907 0.0680591 0.0606385 0.0552111 0.0521554 0.0335348 0.0311534 0.0286398 0.027581 0.0254415 0.0263901 0.024138 0.0221851 0.0218021 0.0123314 0.0123709 0.0110273 0.0104739 0.00821162 0.00792482 0.00728267 0.00549446 0.00514225 0.00482777 0.004381 0.00163434 8.74185e-06 2.25277e-05 6.8204e-06
threshold=1.0000000180025095e-35 1.0000000180025095e-35 0 6.5000000000000009 23.500000000000004 26.500000000000004 1 2 1.0000000180025095e-35 21.500000000000004 20.500000000000004 22.500000000000004 2.5000000000000004 19.500000000000004 46.500000000000007 48.500000000000007 1.0000000180025095e-35 38.500000000000007 66.500000000000014 67.500000000000014 31.500000000000004 3.5000000000000004 5.5000000000000009 37.500000000000007 11.500000000000002 5.5000000000000009 84.500000000000014 3.5000000000000004 5.5000000000000009 1.0000000180025095e-35 1.0000000180025095e-35 64.500000000000014 3 1.0000000180025095e-35 4.5000000000000009 27.500000000000004 25.500000000000004 57.500000000000007 5.5000000000000009 41.500000000000007 43.500000000000007 1.0000000180025095e-35 2.5000000000000004 1.0000000180025095e-35 1.0000000180025095e-35 13.500000000000002 4 42.500000000000007 1.5000000000000002 18.500000000000004 16.500000000000004 1.0000000180025095e-35 24.500000000000004 1.5000000000000002 5 6 3.5000000000000004 20.500000000000004 3.5000000000000004 1.5000000000000002 7 4.5000000000000009 5.5000000000000009 1.0000000180025095e-35 2.5000000000000004 8 9 10 11
decision_type=2 2 1 2 2 2 9 9 2 2 2 2 2 2 2 2 2 2 2 2 2 2 2 2 2 2 2 2 2 2 2 2 1 2 2 2 2 2 2 2 2 2 2 2 2 2 9 2 2 2 2 2 2 2 9 1 2 2 2 2 1 2 2 2 2 1 1 9 9
left_child=1 54 3 25 6 36 38 10 9 45 13 12 41 27 17 16 -16 20 31 -20 32 23 -23 -22 42 48 -21 29 -29 -8 -15 37 33 -7 39 -34 44 -17 53 46 -41 -12 -4 -38 52 62 -19 -36 -3 50 58 -33 -6 63 55 -1 -18 -51 60 61 -40 64 -9 65 -55 -2 68 -68 -56
right_child=4 2 24 -5 5 14 7 8 -10 -11 11 -13 -14 30 15 18 56 34 19 26 21 22 -24 -25 -26 -27 -28 28 -30 -31 -32 51 35 -35 47 -37 43 -39 49 40 -42 -43 -44 -45 -46 -47 -48 -49 -50 57 -52 -53 -54 59 66 -57 -58 -59 -60 -61 -62 -63 -64 -65 -66 -67 67 -69 -70
leaf_value=-0.021776468058333547 -0.014745794025409809 0.010461277137073059 -0.022910984082987789 -0.012305879354544105 -0.0088295146746117693 0.00052889604851250505 0.0011755661731904839 -0.0097423945779221977 0.0050759887274811327 0.13007317975383173 -0.016209850810709719 0.0095949340564601259 0.016745006647365647 0.022755784061162201 0.03157014463347034 -0.0043371504946402841 -0.0066435688956013568 -0.0070960442729528471 0.01227016483286443 -0.0025971495612791174 -0.0058729128314306258 0.045320273627137288 -0.006719490365945777 0.013888781428098657 0.00056392163690918435 0.025854378765712033 0.00076246082634386656 0.012733814753385697 0.0027519497469840298 -0.016650886855019725 0.012055828549377923 -0.006880123339211658 -0.015959996573825266 -0.0068767405801193589 0.00011946644451527357 -0.0049073767970897117 -0.018521040323403345 -0.0011385691878749696 -0.0035208042711269379 -0.013036454984354774 -0.006488885360063798 -0.02077811450540715 -0.014213295740008167 -0.012453616793643891 -0.0059404914677623167 -0.015850705406066628 -0.0023988931725671555 -0.0043865343984771351 0.0079898320609263426 -0.0096109681648775536 0.002052525242873787 -0.010334622305958479 -0.013352909831051302 -0.012711950144553464 -0.024625924012762038 -0.024055042851583441 -0.0037778177066393123 -0.0062896651015980744 -0.0013874284534570052 -0.0057782526272002867 -0.0062325902304985505 -0.013412725464734578 -0.0042373733071069536 -0.011831660882876441 -0.0089816240177001544 -0.0186312260126783 -0.024797892403627245 -0.024527187034451243 -0.02482926635176684
leaf_weight=13.909215970896186 0.3498308751732111 19.82078355550766 7.7093539871275443 10.548152737319468 4.7078405320644396 24.686858683824539 42.609568363055587 0.78660229593515463 15.631910249590874 2.5662215352058411 18.303729541599751 26.749989986419678 11.166020497679709 9.711908161640169 18.357295572757724 67.977582231163979 7.152049392461775 16.43763342499733 17.925213158130646 142.08986158668995 34.732072964310646 7.532996058464053 11.334584355354307 14.329774051904677 7.105057641863822 6.3472780585288993 1672.5448671281338 38.319401241838932 190.2032952606678 4.9891578666865817 11.981667444109915 8.9368699789047259 6.0983132421970394 14.847458384931086 6.657745420932768 12.137774646282194 8.2666327655315381 51.242662161588669 3.4176779352128506 25.117806419730186 21.551749691367149 14.701845496892927 2.7077625188976526 6.8613731637597075 7.0753021687269202 2.5183596089482307 4.4954152256250408 7.4975457787513733 26.225133284926414 4.0868634134531003 1.4312517940998066 11.646898433566092 6.389567069709301 1.1013031881302597 2.0516116702929139 10.418828351423143 6.3259356915950775 5.662848062813282 1.3562211282551278 0.79787366837263096 8.9839549828320759 1.7663680166006086 0.92075470089912415 0.44310169667005528 2.7586110550910234 1.1957135088741759 7.9344145180657506 0.85095809027552416 0.51611694507300887
leaf_count=1539 23 137 103 26 29 80 449 33 28 2 65 41 17 33 27 262 26 73 28 355 177 24 42 37 18 4 2049 213 969 93 25 19 15 90 29 62 19 200 53 66 79 25 42 28 43 13 25 26 91 29 20 27 23 57 249 1243 24 40 18 24 164 34 19 18 100 71 967 103 63
internal_value=0 -0.00511782 0.00298368 0.00716835 0.000518707 3.53344e-05 0.00307494 0.00395483 0.0161284 0.041566 0.00321452 -0.0022354 -0.00939976 0.00451236 0.000220105 0.000548484 0.0159612 -0.00295228 0.000299712 0.000614532 0.000114085 0.00383162 0.0140577 -0.000101002 -0.0120481 0.011089 0.000499396 0.00354336 0.00442574 -0.00069295 0.016846 -0.00382697 -0.00425718 -0.00225236 -0.0076667 -0.00860347 -0.0122362 -0.00296235 -0.00724474 -0.0087973 -0.0100128 -0.0182447 -0.0206502 -0.0157691 -0.00929515 -0.0121832 -0.00608732 -0.0022672 0.00905368 -0.00568858 -0.0044091 -0.00883478 -0.011434 -0.0118578 -0.0233873 -0.0227523 -0.00529852 -0.00768188 -0.00508131 -0.0104416 -0.00548527 -0.0111029 -0.00677361 -0.0164327 -0.010046 -0.0177518 -0.024748 -0.0247717 -0.0246668
internal_weight=0 116.145 80.4635 62.9413 2669.47 2244.96 424.512 391.16 22.4238 6.79194 368.737 70.9216 44.1716 297.815 2211.66 2004.2 31.8353 207.458 1972.36 1832.56 125.7 67.9294 18.8676 49.0618 17.5222 52.3932 1814.63 276.121 228.523 47.5987 21.6936 139.804 57.7704 39.5343 81.7579 18.2361 33.3007 119.22 33.3516 67.6026 46.6696 33.0056 10.4171 15.128 18.1727 4.22572 20.933 14.1553 46.0459 24.9388 15.1891 20.5838 11.0974 8.4128 35.6811 24.328 13.478 9.74971 13.7579 6.42416 12.4016 5.62628 1.70736 1.98865 3.85991 1.54554 11.3531 8.78537 2.56773
internal_count=11245 4585 421 258 6660 3984 2676 2025 95 67 1930 148 107 1782 3842 3017 77 825 2940 2432 527 280 66 214 163 232 2404 1724 1182 542 58 508 247 170 298 77 142 462 651 243 145 90 145 47 95 65 98 55 228 324 255 46 52 327 4164 2782 50 69 235 215 217 191 52 112 157 94 1382 1070 312
cat_boundaries=0 1 2 3 4 5 6 7 8 9 10 11 12
cat_threshold=1 1 2 1 2 2 1 2 2 2 1 1
is_linear=0
shrinkage=0.05


Tree=139
num_leaves=70
num_cat=14
split_feature=2 3 1 3 2 2 0 0 3 2 2 2 3 2 2 2 3 2 2 2 2 3 3 2 3 3 2 2 2 1 3 2 1 3 2 3 2 2 2 2 2 3 3 3 1 2 2 0 2 3 2 2 2 3 2 0 1 3 2 3 1 2 3 2 1 2 1 0 0
split_gain=1.35219 6.71046 1.9292 1.81732 1.24827 1.96015 1.46606 1.30306 2.23209 10.4387 0.987339 2.29185 3.92898 1.31977 0.879069 2.87109 3.84973 1.15245 0.977649 0.92272 0.776568 1.01895 4.41817 1.49482 0.747063 0.571351 0.565105 0.403183 0.941743 0.703189 0.247376 0.233946 0.194451 0.195116 0.194338 0.193493 0.136684 0.114685 0.0933934 0.0868736 0.194902 0.068437 0.061131 0.0550459 0.0524293 0.055085 0.0330343 0.0300975 0.0274167 0.0255025 0.0253695 0.0270792 0.0397282 0.0235686 0.0215624 0.012596 0.0126072 0.0106551 0.00891771 0.00774781 0.00547148 0.00499415 0.00480977 0.00479212 0.00163664 0.000817217 8.95853e-06 2.30846e-05 6.98921e-06
threshold=1.0000000180025095e-35 1.0000000180025095e-35 0 6.5000000000000009 23.500000000000004 26.500000000000004 1 2 1.0000000180025095e-35 21.500000000000004 20.500000000000004 22.500000000000004 2.5000000000000004 19.500000000000004 46.500000000000007 48.500000000000007 1.0000000180025095e-35 38.500000000000007 66.500000000000014 67.500000000000014 31.500000000000004 3.5000000000000004 5.5000000000000009 37.500000000000007 11.500000000000002 5.5000000000000009 81.500000000000014 13.500000000000002 8.5000000000000018 3 1.5000000000000002 64.500000000000014 4 1.0000000180025095e-35 27.500000000000004 4.5000000000000009 25.500000000000004 57.500000000000007 5.5000000000000009 41.500000000000007 43.500000000000007 1.0000000180025095e-35 2.5000000000000004 1.0000000180025095e-35 5 24.500000000000004 13.500000000000002 6 42.500000000000007 1.5000000000000002 21.500000000000004 20.500000000000004 19.500000000000004 1.0000000180025095e-35 1.5000000000000002 7 8 3.5000000000000004 16.500000000000004 1.5000000000000002 9 5.5000000000000009 1.0000000180025095e-35 4.5000000000000009 10 3.5000000000000004 11 12 13
decision_type=2 2 1 2 2 2 9 9 2 2 2 2 2 2 2 2 2 2 2 2 2 2 2 2 2 2 2 2 2 1 2 2 1 2 2 2 2 2 2 2 2 2 2 2 1 2 2 9 2 2 2 2 2 2 2 9 1 2 2 2 1 2 2 2 1 2 1 9 9
left_child=1 55 3 25 6 36 38 10 9 46 13 12 41 27 17 16 -16 20 31 -20 32 23 -23 -22 42 49 -21 28 -8 -29 -15 37 33 -7 -34 39 44 -17 54 47 -41 -12 -4 -38 -6 -46 61 -19 -37 -3 51 52 58 -33 62 56 -1 -18 -40 60 65 -9 64 -62 -2 -56 68 -68 -57
right_child=4 2 24 -5 5 14 7 8 -10 -11 11 -13 -14 30 15 18 57 35 19 26 21 22 -24 -25 -26 -27 -28 29 -30 -31 -32 53 34 -35 -36 48 43 -39 50 40 -42 -43 -44 -45 45 -47 -48 -49 -50 -51 -52 -53 -54 -55 59 66 -58 -59 -60 -61 63 -63 -64 -65 -66 -67 67 -69 -70
leaf_value=-0.021709258451314759 -0.01459600303438449 0.01009401909655825 -0.022866526416356271 -0.012150815643510471 -0.0060507782497991498 0.0005154885321207429 0.0035339989793289474 -0.009594693883493606 0.0049245743210940569 0.11117991365554797 -0.016068993359259737 0.0092662165102693761 0.016054639975706896 0.011748594620128748 0.029817419940516926 -0.0042480800495221021 -0.0065223487658308075 -0.0069697609544011668 0.011817731491017031 -0.0028695128674298409 -0.0057612562838700006 0.042212037843260226 -0.0065973922808294522 0.013354751821892857 0.00054960621485259775 0.024560776133819351 0.00071859036803088275 0.0026321005073268256 -0.0067113226371626816 0.010739135304783388 0.022519058067386556 -0.006756205179867034 -0.015817307274827261 -0.0067528602685290127 -0.0048093724080648138 0.00011648611984681944 -0.018403116213283315 -0.0011115803225945982 -0.0049807388046533112 -0.012881712203817812 -0.0063694897284404528 -0.020693058775565432 -0.014061330294030477 -0.012298531214032654 -0.0071452877105624649 -0.014587222060427771 -0.015707254614976605 -0.002345020479941169 -0.0042966649099053121 0.0077286576617526265 -0.0092294944214144827 0.0013009928601338174 -0.010909943123555782 -0.010184048974140852 -0.0092492090665921844 -0.024620855187759208 -0.024036193356159093 -0.0036981386479335888 -0.001828142090634611 -0.0056678523705999025 -0.010551956017009229 -0.0041499326149667115 -0.011676964587423457 -0.014028593336352228 -0.018514664320163254 -0.0066807259792531735 -0.024797102642702063 -0.024519686674084842 -0.024829265691846666
leaf_weight=13.60959780123085 0.34471019543707371 20.02922179363668 7.5347333475947398 10.419143930077551 7.7621800974011421 24.699918642640114 137.11279190704226 0.77897611819207735 15.711459981277585 2.9226998090744019 18.00942001491785 27.007888913154602 11.354569815099238 13.047975063323976 18.946083307266235 67.683391213417053 7.1046916842460615 16.321404278278351 18.146513372659683 117.31388629972935 34.528692156076431 7.8822478204965618 11.258677050471304 14.530186191201208 7.1090655177831641 6.5135231018066397 1698.2280286103487 69.815334789454937 26.816333260387182 43.359918497502804 9.0144591331481916 8.8755941689014453 6.0017567127943066 14.745706558227537 12.078355729579924 6.658540874719618 8.1149355471134168 51.184351935982704 13.688142687082303 24.792484506964684 21.412355244159698 14.399520441889761 2.6695485673844814 6.7764542177319518 4.2503761649131793 5.9921106547117233 2.4787565544247627 4.4846441596746471 7.4647294878959656 26.435506753623486 3.9938296154141417 1.633512757718562 2.7991857379674903 11.527151733636854 0.64913806319236755 2.001705776900053 10.171193082816897 6.3020826727151871 2.682779684662818 0.79327665269374836 2.7835168838500977 0.91686138138175011 0.43788995221257199 1.5392938330769537 1.1736422758549432 0.59222279489040375 7.7400773335248232 0.83034037891775181 0.50345993600785766
leaf_count=1539 23 137 103 26 34 80 1028 33 28 2 65 41 17 41 27 262 26 73 28 289 177 24 42 37 18 4 2115 209 343 144 17 19 15 90 62 29 19 200 235 66 79 25 42 28 32 29 13 25 26 91 24 16 18 27 28 249 1243 24 31 24 118 19 18 29 71 16 967 103 63
internal_value=0 -0.00501931 0.00289849 0.00693818 0.00050489 3.41178e-05 0.00298674 0.00383855 0.0154372 0.0387094 0.00312343 -0.00218745 -0.00925588 0.00437978 0.000214279 0.000534404 0.0153086 -0.00288903 0.000292134 0.000598873 0.000108984 0.00371799 0.0135024 -9.95052e-05 -0.0118939 0.0106924 0.00048674 0.00344272 0.00185802 0.00573808 0.0161493 -0.00374651 -0.00416968 -0.00220159 -0.00846349 -0.00753476 -0.0120813 -0.00289751 -0.00711703 -0.00865573 -0.0098638 -0.0181235 -0.020563 -0.0156252 -0.00915016 -0.011499 -0.0120283 -0.00597292 -0.00221605 0.00874828 -0.00557946 -0.00487873 -0.00540532 -0.00869287 -0.0117032 -0.0233532 -0.0227045 -0.00519478 -0.00446411 -0.0102907 -0.0109497 -0.00665096 -0.0162936 -0.0117899 -0.017625 -0.00802385 -0.0247459 -0.0247702 -0.0246627
internal_weight=0 115.567 80.7107 63.3974 2670.93 2245.07 425.858 392.747 22.8088 7.09729 369.938 70.7714 43.7635 299.167 2212.17 2005.31 32.3529 206.86 1972.96 1833.69 125.726 68.1998 19.1409 49.0589 17.3133 52.9783 1815.54 277.104 163.929 113.175 22.0624 139.27 57.5257 39.4456 18.0801 81.1342 32.8961 118.868 33.1111 67.0109 46.2048 32.4089 10.2043 14.8914 18.0047 10.2425 4.17459 20.806 14.1233 46.4647 24.7975 20.8036 19.1701 20.4027 8.31369 34.8564 23.7808 13.4068 16.3709 6.35745 5.56417 1.69584 1.95624 4.32281 1.51835 1.24136 11.0756 8.57042 2.50517
internal_count=11245 4585 421 258 6660 3984 2676 2025 95 67 1930 148 107 1782 3842 3017 77 825 2940 2432 527 280 66 214 163 232 2404 1724 1371 353 58 508 247 170 77 298 142 462 651 243 145 90 145 47 95 61 65 98 55 228 324 300 284 46 327 4164 2782 50 266 215 191 52 112 147 94 44 1382 1070 312
cat_boundaries=0 1 2 3 4 5 6 7 8 9 10 11 12 13 14
cat_threshold=1 1 2 1 1 2 2 2 1 2 2 2 1 1
is_linear=0
shrinkage=0.05


Tree=140
num_leaves=67
num_cat=16
split_feature=2 3 3 3 2 2 2 1 2 2 2 2 3 2 2 2 2 2 2 2 1 3 3 2 2 1 3 2 1 3 2 2 2 0 2 0 2 3 3 0 3 3 2 2 2 0 3 2 3 2 3 0 3 1 3 2 0 1 2 3 2 1 3 1 0 0
split_gain=4.7307 3.40459 0.693224 2.38122 4.42353 7.48706 3.12078 3.86632 2.15182 1.27393 1.12261 2.80406 2.2065 0.782386 0.966691 1.81531 1.27307 1.06539 0.901138 0.767485 1.0346 5.68913 2.8039 0.701769 1.02693 2.72441 0.632892 0.598675 0.551661 0.557401 0.509735 3.28147 2.39778 0.669408 0.979638 0.705906 0.517235 0.506114 2.03024 0.395855 0.411536 0.261743 0.247516 0.289627 0.220691 0.200206 0.109765 0.0878487 0.0777713 0.0595674 0.0515227 0.0512012 0.0311008 0.0152959 0.0150459 0.0124233 0.00967121 0.0152884 0.00840215 0.00511698 0.00183601 0.000172314 2.88792e-05 7.6049e-06 2.53598e-05 7.15674e-06
threshold=1.0000000180025095e-35 1.0000000180025095e-35 2.5000000000000004 3.5000000000000004 93.500000000000014 64.500000000000014 22.500000000000004 0 18.500000000000004 12.500000000000002 32.500000000000007 27.500000000000004 17.500000000000004 469.50000000000006 14.500000000000002 15.500000000000002 4.5000000000000009 2.5000000000000004 543.00000000000011 5.5000000000000009 1 1.0000000180025095e-35 1.0000000180025095e-35 140.50000000000003 151.50000000000003 2 8.5000000000000018 81.500000000000014 3 8.5000000000000018 72.500000000000014 79.500000000000014 73.500000000000014 4 25.500000000000004 5 123.50000000000001 6.5000000000000009 5.5000000000000009 6 1.0000000180025095e-35 12.500000000000002 13.500000000000002 8.5000000000000018 406.50000000000006 7 1.0000000180025095e-35 20.500000000000004 1.0000000180025095e-35 159.50000000000003 6.5000000000000009 8 1.5000000000000002 9 1.0000000180025095e-35 121.50000000000001 10 11 1.5000000000000002 2.5000000000000004 43.500000000000007 12 1.5000000000000002 13 14 15
decision_type=2 2 2 2 2 2 2 1 2 2 2 2 2 2 2 2 2 2 2 2 1 2 2 2 2 1 2 2 1 2 2 2 2 9 2 9 2 2 2 9 2 2 2 2 2 9 2 2 2 2 2 9 2 1 2 2 9 1 2 2 2 1 2 1 9 9
left_child=1 56 13 4 5 6 7 9 42 -4 11 12 47 14 16 48 17 39 -15 54 22 -22 -21 26 25 -25 45 -28 37 52 33 32 -32 34 -17 -35 -33 38 62 40 -2 -26 43 50 49 -12 53 -10 61 55 -5 60 -30 -19 -18 -6 57 -1 -41 -54 -8 -16 -3 64 -58 -65
right_child=2 28 3 8 44 -7 51 -9 10 -11 23 -13 -14 18 15 30 19 46 -20 20 21 -23 -24 24 41 -27 27 -29 29 -31 31 36 -34 35 -36 -37 -38 -39 -40 58 -42 -43 -44 -45 -46 -47 -48 -49 -50 -51 -52 -53 59 -55 -56 -57 63 -59 -60 -61 -62 -63 -64 65 -66 -67
leaf_value=-0.021793686504449114 0.0031599939176140501 -0.0040468125356707485 0.021443512083047685 -0.01802186673258151 -0.0031078140111726691 0.045701224612299099 -0.010630256673889968 -0.015150728710118702 -0.019123818014898514 0.052199793461492318 -0.00029441060949410053 0.03087292463613402 0.010863555852275148 0.0099631963544418098 -0.01463549340972424 0.0021240373207117489 0.013502334312790847 -0.0087139940694169228 0.00034643039744761318 0.0062228089901357996 -0.0083034073861217774 0.032965007832920994 -0.017134013414033349 -0.0024798802604394724 -0.00065718916830629888 0.024189142405504346 0.0050836519566722273 -0.0016812644101387418 -0.023423711189710848 -0.0025959726743053899 0.03551199751839846 -0.0033663782731835202 0.0068982844107734094 -0.0031820933018218128 -0.0032790850948135235 -0.013212983661062414 -0.00023946072960882357 -0.012155769006172556 0.02591950134009793 -0.016852427998046555 -0.018848292573303636 0.0014247933257496392 -0.018133684935758964 0.0042858965150978827 0.0040192671395473918 -0.0051038368962743608 -0.019669836835361162 -0.010954545281394853 -0.021447263367380624 -0.00089130261442200368 -0.0093698006366222299 -0.0039806875884497673 -0.019021060410104165 -0.012893009945487484 0.011064292616857707 -0.0053986501202582873 -0.024793802592296486 -0.024394022323303642 -0.012110265098115492 -0.014728786604625413 -0.0094835350546830788 -0.014149176311687618 -0.0041220902631239464 -0.024621499115701675 -0.024488865723136504 -0.02482926537877967
leaf_weight=13.308673521503808 38.43087656237185 23.105309687554836 8.1665281690657121 3.5487929154187459 11.126461565494539 17.10262656211853 6.1121835559606561 5.579751869663597 5.4380476623773566 5.728442683815957 26.884668275713921 10.612788207828997 24.336766481399536 36.765101075172424 4.0782472044229507 123.62533681839705 18.67109140753746 3.7632860466837883 72.193912982940674 44.692291919142008 18.457525946199894 15.252175636589525 18.033957615494728 22.070256888866425 223.24970388412476 16.9162917137146 48.712670609354973 99.51855456829071 6.0559882670640928 7.0902154371142379 9.3509351909160596 186.19052216410637 33.735235691070557 51.042468160390854 261.01117072999477 26.720895744860172 456.49389454722404 11.827825047075747 6.3292504847049704 2.2245515268295994 2.2483689431101075 466.19901102781296 15.033807586878536 3.2474462315440178 17.43462598323822 110.89254260063171 6.5069193094968787 8.3345171436667425 8.4442732110619527 26.908828914165497 3.3402234762907028 4.748962603509427 1.5104074049741032 5.2362688332796079 9.5725475698709506 12.643033534288405 7.0195501064881682 9.8257821891456825 1.6101529654115441 1.2851487621664999 8.138224244117735 3.2915948554873458 28.40195544436574 2.0079281330108643 0.75516423583030512 0.5222951062023643
leaf_count=1538 330 150 34 28 22 36 27 31 14 15 79 40 5 20 29 408 97 104 37 389 222 72 136 37 240 18 136 189 76 23 12 396 79 288 907 79 580 28 3 135 49 400 40 33 12 294 62 39 11 30 20 26 33 182 25 21 899 1230 83 27 26 18 102 256 96 67
internal_value=0 -0.00993652 0.000250554 0.00113414 0.00770812 0.0181759 0.00594031 0.0200057 0.000387003 0.0341233 0.000729089 0.0081428 0.00181286 -0.000484143 -0.000813398 -0.00134663 0.00254706 -0.00343582 0.00359133 0.00542721 0.00330422 0.0103688 -0.000492337 0.00037302 0.00119706 0.00909183 -0.00172572 0.000541865 -0.00465179 -0.0130423 -0.0011149 -0.000249813 0.0131083 -0.00239788 -0.00154248 -0.00662889 -0.00114535 -0.00273172 -0.000804462 0.000495911 0.00194358 0.000750629 -0.0140624 -0.00802399 -0.000833084 -0.00416537 -0.0147225 -0.0141802 -0.0181716 -0.00250241 -0.0138268 -0.00847698 -0.02141 -0.0111455 0.012676 -0.00432631 -0.0234656 -0.0228981 -0.0148612 -0.0170479 -0.00997538 -0.0144183 -0.00408832 -0.0247397 -0.0247642 -0.0246644
internal_weight=0 119.045 2669.67 1212.03 123.69 55.5767 38.4741 19.4747 1088.34 13.895 1063.17 48.7221 38.1093 1457.64 1348.68 1163.98 184.7 60.0204 108.959 124.68 96.436 33.7097 62.7262 1014.44 728.435 38.9865 286.008 148.231 85.6061 15.9418 1148.17 685.771 43.0862 462.4 384.637 77.7634 642.684 69.6643 57.8365 44.5139 40.6792 689.449 25.1703 10.1365 68.1129 137.777 15.5065 13.7726 15.8141 50.6783 6.88902 18.9994 8.85154 8.99955 28.2436 23.7695 33.4394 23.1345 3.8347 2.79556 14.2504 7.36984 51.5073 10.3049 7.77471 2.53022
internal_count=11170 4528 6642 1892 280 195 159 80 1612 49 1491 98 58 4750 4693 2807 1886 945 57 941 819 294 525 1393 695 55 698 325 442 159 2749 1067 91 1682 1315 367 976 283 255 597 379 640 121 81 85 373 348 53 58 73 48 79 136 286 122 43 4086 2768 218 60 53 47 252 1318 995 323
cat_boundaries=0 1 2 3 4 5 6 7 8 9 10 11 12 13 14 15 16
cat_threshold=1 1 1 1 2 1 2 1 2 2 2 1 1 1 1 1
is_linear=0
shrinkage=0.05


Tree=141
num_leaves=70
num_cat=14
split_feature=2 3 3 3 2 2 2 2 2 2 2 2 2 2 2 2 3 2 3 2 1 3 3 2 2 2 1 3 3 3 2 2 2 0 2 0 2 2 2 2 0 2 3 2 3 2 2 2 2 2 3 0 2 0 2 3 2 3 1 3 0 1 3 2 1 3 1 0 0
split_gain=4.54508 3.36476 0.658264 2.24913 2.06837 5.43165 1.76298 1.74499 11.1 3.45855 1.09219 2.39466 0.742365 0.917891 1.76307 1.20456 1.03196 0.84488 0.719897 0.714629 0.969766 5.22094 2.69785 0.691348 2.55286 1.16518 0.535599 0.550352 0.488967 1.88956 0.486536 3.08232 2.15399 0.643509 0.934142 0.68717 0.494255 0.470018 0.440546 0.941101 0.403694 0.354461 0.286101 0.285297 0.208019 0.170669 0.162498 0.118676 0.10349 0.0919682 0.0781094 0.0669675 0.0636989 0.0394328 0.0377642 0.0314827 0.0267535 0.0259503 0.0150366 0.0137742 0.00988082 0.0155883 0.0051225 0.00058238 0.000171186 2.78072e-05 7.79366e-06 2.59855e-05 7.33403e-06
threshold=1.0000000180025095e-35 1.0000000180025095e-35 2.5000000000000004 4.5000000000000009 93.500000000000014 91.500000000000014 18.500000000000004 65.500000000000014 59.500000000000007 33.500000000000007 150.50000000000003 168.50000000000003 469.50000000000006 14.500000000000002 15.500000000000002 4.5000000000000009 1.0000000180025095e-35 543.00000000000011 8.5000000000000018 5.5000000000000009 0 1.0000000180025095e-35 1.0000000180025095e-35 81.500000000000014 74.500000000000014 23.500000000000004 1 8.5000000000000018 6.5000000000000009 5.5000000000000009 72.500000000000014 79.500000000000014 73.500000000000014 2 25.500000000000004 3 123.50000000000001 2.5000000000000004 313.50000000000006 357.50000000000006 4 35.500000000000007 10.500000000000002 13.500000000000002 10.500000000000002 152.50000000000003 23.500000000000004 119.50000000000001 126.50000000000001 406.50000000000006 1.0000000180025095e-35 5 314.50000000000006 6 30.500000000000004 1.5000000000000002 3.5000000000000004 3.5000000000000004 7 1.0000000180025095e-35 8 9 2.5000000000000004 2.5000000000000004 10 1.5000000000000002 11 12 13
decision_type=2 2 2 2 2 2 2 2 2 2 2 2 2 2 2 2 2 2 2 2 1 2 2 2 2 2 1 2 2 2 2 2 2 9 2 9 2 2 2 2 9 2 2 2 2 2 2 2 2 2 2 9 2 9 2 2 2 2 1 2 9 1 2 2 1 2 1 9 9
left_child=1 60 12 4 5 7 43 8 9 -4 47 -12 13 15 50 16 37 -14 41 59 22 -22 -21 24 25 -20 28 55 29 65 33 32 -32 34 -16 -35 -33 40 42 -40 -2 46 -25 44 -5 48 -8 -6 -43 53 64 56 -47 -13 -48 -28 -18 -9 -39 -17 61 -1 -57 -53 -15 -3 67 -62 -68
right_child=2 26 3 6 10 -7 18 57 -10 -11 11 49 17 14 30 19 51 -19 23 20 21 -23 -24 38 -26 -27 27 -29 -30 -31 31 36 -34 35 -36 -37 -38 58 39 -41 -42 45 -44 -45 -46 52 54 -49 -50 -51 -52 63 -54 -55 -56 62 -58 -59 -60 -61 66 -63 -64 -65 -66 -67 68 -69 -70
leaf_value=-0.021726804070609243 0.0030716873920607532 -0.0039625393896618758 0.015993663472892428 -0.013848567623016173 -0.002444612452894155 0.052880613427289537 -0.017031184823861161 -0.0059229061095416504 0.083945091589531479 -0.007607456115668338 0.020500784969878848 0.00097563824035328244 0.0096182738433325601 -0.014485204399304988 0.0020668482584322335 0.012988248970439749 -0.016793573305194948 0.0003377102885895563 0.010820356664261527 0.0060301771821267384 -0.008165615215006361 0.031090876948218917 -0.017001026982615096 -0.0040786326651703125 0.028554548496629563 -0.0027862742445847926 -0.023390398511948914 -0.0025381805588721388 -0.01200077282678407 0.024621015642533328 0.03340676357890042 -0.0032940043744247314 0.0066801713855005086 -0.0031131002019475756 -0.0032083041139926612 -0.013058479232197221 -0.00023357181734039138 -0.012738119490925355 0.009054411744120373 0.00089476403466615378 -0.015538971741284564 -0.0024269688949612746 -1.861965421880456e-05 -0.018643205595116421 0.0028466285342994692 0.00086043853221231506 -0.0017246153927351843 -0.0079202322128638595 -0.0066250272282623512 0.0029316448720678946 -0.021373945730841296 -0.010548421992084292 -0.0016320505846925003 -0.0019751514524713968 -0.009053098594408426 -0.018909524222764786 -0.022937394033619496 -0.0025057341934266175 -0.0085729525023084101 0.010669345465966606 -0.024792911819709499 -0.02438327533749712 -0.014578917408774537 -0.0085834589115260356 -0.013996987531508185 -0.0040365576501585473 -0.024616319076576139 -0.024480428450853738 -0.024829265793924415
leaf_weight=13.02176612056792 38.552511021494865 23.011996172368526 37.051738889887929 4.2424207516014603 18.066064357757568 7.1915352940559378 5.3139473050832731 12.229948759078979 4.9344609230756751 26.714946165680885 18.54929518699646 17.949109256267548 37.133230447769165 4.0189948976039886 123.88819964230061 18.924904104322195 2.7937100995331985 72.21892774105072 24.331854909658432 44.971271056681871 18.304900120943785 15.763343218713997 17.727595400065184 50.056845307350159 10.440367043018339 44.52499482780695 5.9157831966876966 7.0718333497643462 11.684919126331804 6.4954463839530936 9.6889725327491742 185.56478807330132 33.96875573694706 50.880304597318172 260.1566948890686 26.370155297219753 456.38459393382072 5.1691909264773113 40.947426676750183 257.92144572734833 3.1521007232367984 75.942972034215927 325.87104868888855 13.425959832966326 3.3304959833621979 55.350485682487488 3.4614890590310097 21.880141943693161 18.198530644178391 23.360429048538208 8.2650949358940107 0.62604691460728623 47.744073033332825 30.664586246013641 3.5718109905719757 1.4819494187831881 4.8446379825472832 10.180714637041092 3.7306351959705353 9.6790487840771693 6.8476486946456134 9.5889914967119676 1.2663588337600229 0.94821951724588871 3.2453494928777209 28.285121023654938 1.9590936899185181 0.73689571022987177 0.50948657421395194
leaf_count=1538 330 150 171 36 38 8 16 31 14 98 23 20 20 29 408 97 64 37 5 389 222 72 136 74 12 143 76 23 28 3 12 396 79 288 907 79 580 182 27 158 188 226 458 31 17 76 25 29 31 16 11 30 32 35 16 33 18 26 104 25 899 1230 27 29 18 102 256 96 67
internal_value=0 -0.00978893 0.000243492 0.00110368 0.0055696 0.0110467 6.61018e-05 0.00774474 0.0116968 0.00610601 0.00144282 0.00448176 -0.000472924 -0.000794426 -0.00131527 0.00247491 -0.00336309 0.00348916 0.000378407 0.00526033 0.00320794 0.00999833 -0.000481709 0.00109886 0.00551521 0.00202188 -0.0045588 -0.0128882 -0.00267229 -0.000786191 -0.00108868 -0.000243952 0.0126116 -0.00234417 -0.0015066 -0.00650805 -0.00111823 -0.000560968 0.000579882 0.0020127 0.00166506 -0.00221382 -0.000559232 -0.0142662 -0.00650618 -0.00169934 -0.0104322 -0.00544383 -0.0032385 0.000353309 -0.0180495 -0.018755 -0.000293857 -0.000885663 -0.00544633 -0.0213361 -0.0206903 -0.00437055 -0.0109922 0.0122036 -0.0234332 -0.0228534 -0.0169141 -0.00936488 -0.0142671 -0.00400335 -0.0247374 -0.0247626 -0.0246603
internal_weight=0 117.877 2670.42 1213.45 228.773 98.3033 984.676 91.1118 68.7011 63.7667 130.47 90.5234 1456.97 1347.62 1162.43 185.188 59.8171 109.352 963.677 125.371 96.7671 34.0682 62.6989 754.094 79.2972 68.8568 85.2134 15.7359 69.4775 57.7926 1146.9 685.607 43.6577 461.295 384.045 77.2505 641.949 50.6044 674.797 298.869 41.7046 209.583 375.928 20.9989 7.57292 197.236 12.3472 39.9462 94.1415 71.9741 15.5294 9.21261 103.095 48.6137 7.0333 8.66409 7.63835 22.4107 8.89983 28.604 32.6639 22.6108 2.74831 1.57427 7.26434 51.2971 10.0531 7.58454 2.46858
internal_count=11170 4528 6642 1892 509 348 1383 340 283 269 161 94 4750 4693 2807 1886 945 57 1299 941 819 294 525 877 160 148 442 159 283 255 2749 1067 91 1682 1315 367 976 804 717 185 518 422 532 84 53 365 57 67 257 71 58 141 108 55 41 136 82 57 286 122 4086 2768 60 59 47 252 1318 995 323
cat_boundaries=0 1 2 3 4 5 6 7 8 9 10 11 12 13 14
cat_threshold=1 1 2 1 2 2 1 1 2 1 1 1 1 1
is_linear=0
shrinkage=0.05


Tree=142
num_leaves=68
num_cat=15
split_feature=2 3 3 3 2 2 1 2 2 2 2 2 3 2 2 2 2 3 2 0 2 1 2 2 1 3 1 3 3 3 2 2 2 2 3 2 2 0 0 3 3 2 2 2 2 2 2 3 0 2 3 3 2 2 2 1 3 2 0 1 3 2 1 3 1 0 0
split_gain=4.36609 3.3245 0.625007 2.14026 3.8964 6.86538 3.67042 2.72219 5.66992 2.01941 1.01611 2.56319 2.04867 0.704442 0.871608 1.71202 1.13998 1.00429 0.792503 0.685799 0.744958 0.904466 0.654698 0.963073 2.49592 0.603503 0.519849 0.543548 0.472295 1.76079 0.464359 2.89672 1.94063 0.621055 6.39418 0.47248 0.451499 0.388202 0.350096 0.318207 0.244915 0.239095 0.279628 0.204254 0.15374 0.135486 0.0852264 0.0784216 0.066906 0.054846 0.0534082 0.0518013 0.0449891 0.0270424 0.024186 0.0147749 0.0130572 0.0124509 0.0100942 0.0158921 0.00966275 0.000570051 0.000169988 2.67681e-05 7.98686e-06 2.66268e-05 7.51555e-06
threshold=1.0000000180025095e-35 1.0000000180025095e-35 2.5000000000000004 3.5000000000000004 93.500000000000014 90.500000000000014 0 65.500000000000014 51.500000000000007 18.500000000000004 32.500000000000007 27.500000000000004 17.500000000000004 469.50000000000006 14.500000000000002 15.500000000000002 4.5000000000000009 1.0000000180025095e-35 543.00000000000011 1 5.5000000000000009 2 140.50000000000003 151.50000000000003 3 5.5000000000000009 4 11.500000000000002 6.5000000000000009 5.5000000000000009 72.500000000000014 79.500000000000014 73.500000000000014 20.500000000000004 1.0000000180025095e-35 125.50000000000001 2.5000000000000004 5 6 39.500000000000007 12.500000000000002 13.500000000000002 8.5000000000000018 406.50000000000006 119.50000000000001 25.500000000000004 20.500000000000004 1.0000000180025095e-35 7 159.50000000000003 2.5000000000000004 6.5000000000000009 5.5000000000000009 3.5000000000000004 13.500000000000002 8 1.0000000180025095e-35 121.50000000000001 9 10 1.5000000000000002 2.5000000000000004 11 1.5000000000000002 12 13 14
decision_type=2 2 2 2 2 2 1 2 2 2 2 2 2 2 2 2 2 2 2 9 2 1 2 2 1 2 1 2 2 2 2 2 2 2 2 2 2 9 9 2 2 2 2 2 2 2 2 2 9 2 2 2 2 2 2 1 2 2 9 1 2 2 1 2 1 9 9
left_child=1 58 13 4 5 6 7 8 -4 41 11 12 46 14 16 47 17 36 -15 20 56 -22 25 24 -24 44 28 50 29 63 33 32 -32 34 -17 -33 37 -2 -35 -27 -25 42 51 49 -12 -8 -11 62 53 57 60 -5 -21 -19 -54 -38 -18 -6 59 -1 -28 -50 -16 -3 65 -60 -66
right_child=2 26 3 9 43 -7 45 -9 -10 10 22 -13 -14 18 15 30 19 48 -20 52 21 -23 23 40 -26 39 27 -29 -30 -31 31 35 -34 38 -36 -37 55 -39 -40 -41 -42 -43 -44 -45 -46 -47 -48 -49 61 -51 -52 -53 54 -55 -56 -57 -58 -59 64 -61 -62 -63 -64 -65 66 -67 -68
leaf_value=-0.021658658798051685 0.0029861157777949531 -0.0038796895903839379 0.016165716118061113 -0.017904755648292067 -0.0029754230857519737 0.06816717041022724 -0.015607813518922702 -0.007157825281191659 0.073756695384289417 -0.018972965606660227 -0.0043679525899796481 0.028991658967615741 0.010135554338939218 0.0092885362284873627 -0.014334278215900907 0.014395668566878628 0.014374807861056603 -0.016657485882343722 0.00032921258337090812 -0.012843181259030079 0.00022826197481238565 0.010875261959512165 -0.002430257461633261 -0.00065391893961435114 0.022920697263850952 -0.00081208563714683208 -0.023356347144456627 -0.0013647308446251103 -0.011845893417517185 0.023418367659615622 0.031493421491597048 -0.0031874066851656675 0.0064703842082706117 -0.0023486909039655522 -0.01810206357887743 -0.00021273977658871972 -0.012583115645295595 -0.015393482970531886 -0.00626197192025675 0.0073926929942955202 0.0013593058516910303 -0.017904969626585634 0.0041557653461061148 0.0038194389687153199 -0.0098865270932253259 -0.0059156518100006638 -0.01085063450153782 -0.021299297860662651 -0.010396984526536729 -0.0008976295025100693 -0.013265258940256285 -0.0091635907652175535 -0.0036349999615375769 -0.022893497509585303 -0.010168763196295012 -0.0084329884902708766 0.012049863645371861 -0.0052759019137023702 -0.024791998349616401 -0.024372268220494032 -0.018796520370856266 -0.0084434134389088349 -0.01384430185077121 -0.0039524569417763444 -0.024611011952826153 -0.02447178270833221 -0.024829265850533452
leaf_weight=12.741895973682402 38.671115046367049 22.92099080234766 23.848495122045282 3.4887736681848782 11.059057354927065 5.85507509112358 6.1828366406261912 7.5810131132602683 5.2068251073360434 5.297968588769435 57.560553178191185 10.983749501407145 24.843481540679932 37.492111086845398 3.961198553442955 40.502884216606617 17.810921177268028 2.7471854798495752 72.24332058429718 2.0072123967111102 55.334997624158859 31.190467201173306 22.021362364292145 223.21950531005859 17.365661561489105 199.17868262529373 5.7790161669254285 6.2699570506811133 11.545529067516325 6.657355695962905 10.01811647415161 189.47858530282974 34.196432426571846 326.25449861586094 24.168087303638458 451.75396758317947 5.1037628445774299 3.10349884815514 69.292620040476322 12.562562912702559 467.36479425430298 14.537228554487227 3.2620259299874306 17.55623471736908 16.16456800699234 8.6507150977849943 8.2725619971752149 8.0903116315603238 0.61947781220078446 26.915942847728729 2.0319800451397896 3.2962555736303329 8.8785320911556447 4.7347795367240906 1.6852090843021876 3.6987893208861351 9.1370469331741351 12.563665449619291 6.6799628818407655 9.3580074794590491 1.4541896991431711 0.94011535868048668 3.2002408057451239 28.171176824718714 1.9114567041397095 0.7190752029418962 0.49699215684086095
leaf_count=1538 330 150 98 28 22 7 32 20 14 14 171 40 5 20 29 204 67 64 37 40 380 236 37 240 18 484 76 17 28 3 12 404 79 1090 91 572 182 188 297 25 400 40 33 12 18 24 39 11 30 30 33 20 187 18 16 104 15 21 899 1230 33 29 18 102 256 96 67
internal_value=0 -0.00964209 0.000236604 0.001074 0.00725926 0.0168644 0.0110283 0.0195244 0.0264862 0.00036192 0.000689014 0.00769182 0.00160154 -0.000461941 -0.000775864 -0.00128458 0.00240505 -0.00329168 0.00339025 0.00509959 0.00632716 0.00406626 0.00034835 0.00114229 0.00874693 -0.00168185 -0.00446723 -0.0127338 -0.00261396 -0.000768271 -0.00106304 -0.000238213 0.0121401 -0.00229153 0.00225099 -0.00109173 -0.000547882 0.00162067 -0.00303423 -0.000325298 0.000708566 -0.0138057 -0.00787444 -0.000826723 -0.00557793 -0.00995548 -0.0140216 -0.0179261 -0.0186401 -0.00244072 -0.0204276 -0.0136582 -0.00598117 -0.0206038 -0.00467732 -0.0108393 0.0135865 -0.00419892 -0.0234002 -0.0228077 -0.0224396 -0.00921938 -0.0141153 -0.00391981 -0.0247351 -0.0247609 -0.024656
internal_weight=0 116.738 2671.16 1214.84 125.42 57.325 51.4699 36.6363 29.0553 1089.42 1064.84 49.3978 38.414 1456.32 1346.58 1160.92 185.663 59.6187 109.735 126.044 113.473 86.5255 1015.44 729.971 39.387 285.466 84.8302 15.5351 69.2951 57.7495 1145.67 685.447 44.2145 460.218 64.671 641.233 50.5772 41.7746 395.547 211.741 690.584 24.5843 10.0471 68.0949 73.7251 14.8336 13.5705 15.2518 9.04156 50.5387 9.26519 6.78503 12.571 7.48197 10.5637 8.80255 26.948 23.6227 31.9074 22.0999 7.23321 1.55959 7.16144 51.0922 9.80749 7.39904 2.40845
internal_count=11170 4528 6642 1892 280 195 188 132 112 1612 1491 98 58 4750 4693 2807 1886 945 57 941 698 616 1393 695 55 698 442 159 283 255 2749 1067 91 1682 295 976 804 518 1387 509 640 121 81 85 189 56 53 58 141 73 142 48 243 82 203 286 82 43 4086 2768 109 59 47 252 1318 995 323
cat_boundaries=0 1 2 3 4 5 6 7 8 9 10 11 12 13 14 15
cat_threshold=1 2 1 1 1 2 2 2 1 2 1 1 1 1 1
is_linear=0
shrinkage=0.05


end of trees

feature_importances:
event_2=6777
event_3=3175
platform=1937
source=1100

parameters:
[boosting: gbdt]
[objective: poisson]
[metric: poisson]
[tree_learner: serial]
[device_type: cpu]
[linear_tree: 0]
[data: ]
[valid: ]
[num_iterations: 1000]
[learning_rate: 0.05]
[num_leaves: 128]
[num_threads: 0]
[deterministic: 0]
[force_col_wise: 0]
[force_row_wise: 0]
[histogram_pool_size: -1]
[max_depth: 8]
[min_data_in_leaf: 20]
[min_sum_hessian_in_leaf: 0.001]
[bagging_fraction: 0.7]
[pos_bagging_fraction: 1]
[neg_bagging_fraction: 1]
[bagging_freq: 10]
[bagging_seed: 3]
[feature_fraction: 0.9]
[feature_fraction_bynode: 1]
[feature_fraction_seed: 2]
[extra_trees: 0]
[extra_seed: 6]
[early_stopping_round: 100]
[first_metric_only: 0]
[max_delta_step: 0]
[lambda_l1: 0]
[lambda_l2: 0]
[linear_lambda: 0]
[min_gain_to_split: 0]
[drop_rate: 0.1]
[max_drop: 50]
[skip_drop: 0.5]
[xgboost_dart_mode: 0]
[uniform_drop: 0]
[drop_seed: 4]
[top_rate: 0.2]
[other_rate: 0.1]
[min_data_per_group: 100]
[max_cat_threshold: 32]
[cat_l2: 10]
[cat_smooth: 10]
[max_cat_to_onehot: 4]
[top_k: 20]
[monotone_constraints: ]
[monotone_constraints_method: basic]
[monotone_penalty: 0]
[feature_contri: ]
[forcedsplits_filename: ]
[refit_decay_rate: 0.9]
[cegb_tradeoff: 1]
[cegb_penalty_split: 0]
[cegb_penalty_feature_lazy: ]
[cegb_penalty_feature_coupled: ]
[path_smooth: 0]
[interaction_constraints: ]
[verbosity: 0]
[saved_feature_importance_type: 0]
[max_bin: 512]
[max_bin_by_feature: ]
[min_data_in_bin: 3]
[bin_construct_sample_cnt: 200000]
[data_random_seed: 1]
[is_enable_sparse: 1]
[enable_bundle: 1]
[use_missing: 1]
[zero_as_missing: 0]
[feature_pre_filter: 1]
[pre_partition: 0]
[two_round: 0]
[header: 0]
[label_column: ]
[weight_column: ]
[group_column: ]
[ignore_column: ]
[categorical_feature: 0,1]
[forcedbins_filename: ]
[objective_seed: 5]
[num_class: 1]
[is_unbalance: 0]
[scale_pos_weight: 1]
[sigmoid: 1]
[boost_from_average: 1]
[reg_sqrt: 0]
[alpha: 0.9]
[fair_c: 1]
[poisson_max_delta_step: 0.7]
[tweedie_variance_power: 1.5]
[lambdarank_truncation_level: 30]
[lambdarank_norm: 1]
[label_gain: ]
[eval_at: ]
[multi_error_top_k: 1]
[auc_mu_weights: ]
[num_machines: 1]
[local_listen_port: 12400]
[time_out: 120]
[machine_list_filename: ]
[machines: ]
[gpu_platform_id: -1]
[gpu_device_id: -1]
[gpu_use_dp: 0]
[num_gpu: 1]

end of parameters

pandas_categorical:[["non-organic", "organic"], ["android", "ios"]]
