{
  "uid" : "b1a8273437954620fa374b796ffaacdd",
  "name" : "behaviors",
  "children" : [ {
    "name" : "\"before each\" hook for DRIM Login",
    "uid" : "4a2c0ae174a7496b",
    "parentUid" : "b1a8273437954620fa374b796ffaacdd",
    "status" : "broken",
    "time" : {
      "start" : 1615755226613,
      "stop" : 1615755226617,
      "duration" : 4
    },
    "flaky" : false,
    "newFailed" : false,
    "parameters" : [ "chrome-89.0.4389.82" ]
  }, {
    "name" : "\"after each\" hook for DRIM Login",
    "uid" : "2d5dcf639179321b",
    "parentUid" : "b1a8273437954620fa374b796ffaacdd",
    "status" : "broken",
    "time" : {
      "start" : 1615755226617,
      "stop" : 1615755226620,
      "duration" : 3
    },
    "flaky" : false,
    "newFailed" : false,
    "parameters" : [ "chrome-89.0.4389.82" ]
  }, {
    "name" : "User login into DRIM Cloud",
    "uid" : "fa8fc71304ec54bc",
    "parentUid" : "b1a8273437954620fa374b796ffaacdd",
    "status" : "passed",
    "time" : {
      "start" : 1615755733222,
      "stop" : 1615755736465,
      "duration" : 3243
    },
    "flaky" : false,
    "newFailed" : false,
    "parameters" : [ "chrome-89.0.4389.82" ]
  }, {
    "name" : "User logout of DRIM Cloud",
    "uid" : "76e12cb124d387df",
    "parentUid" : "b1a8273437954620fa374b796ffaacdd",
    "status" : "broken",
    "time" : {
      "start" : 1615755736472,
      "stop" : 1615755737300,
      "duration" : 828
    },
    "flaky" : false,
    "newFailed" : false,
    "parameters" : [ "chrome-89.0.4389.82" ]
  } ]
}