{
  "reportName" : "Allure Report",
  "testRuns" : [ ],
  "statistic" : {
    "failed" : 0,
    "broken" : 3,
    "skipped" : 0,
    "passed" : 1,
    "unknown" : 0,
    "total" : 4
  },
  "time" : {
    "start" : 1615755226613,
    "stop" : 1615755737300,
    "duration" : 510687,
    "minDuration" : 3,
    "maxDuration" : 3243,
    "sumDuration" : 4078
  }
}