%YAML 1.1
%TAG !u! tag:unity3d.com,2011:
--- !u!29 &1
OcclusionCullingSettings:
  m_ObjectHideFlags: 0
  serializedVersion: 2
  m_OcclusionBakeSettings:
    smallestOccluder: 5
    smallestHole: 0.25
    backfaceThreshold: 100
  m_SceneGUID: 00000000000000000000000000000000
  m_OcclusionCullingData: {fileID: 0}
--- !u!104 &2
RenderSettings:
  m_ObjectHideFlags: 0
  serializedVersion: 9
  m_Fog: 0
  m_FogColor: {r: 0.5, g: 0.5, b: 0.5, a: 1}
  m_FogMode: 3
  m_FogDensity: 0.01
  m_LinearFogStart: 0
  m_LinearFogEnd: 300
  m_AmbientSkyColor: {r: 0.212, g: 0.227, b: 0.259, a: 1}
  m_AmbientEquatorColor: {r: 0.114, g: 0.125, b: 0.133, a: 1}
  m_AmbientGroundColor: {r: 0.047, g: 0.043, b: 0.035, a: 1}
  m_AmbientIntensity: 1
  m_AmbientMode: 3
  m_SubtractiveShadowColor: {r: 0.42, g: 0.478, b: 0.627, a: 1}
  m_SkyboxMaterial: {fileID: 0}
  m_HaloStrength: 0.5
  m_FlareStrength: 1
  m_FlareFadeSpeed: 3
  m_HaloTexture: {fileID: 0}
  m_SpotCookie: {fileID: 10001, guid: 0000000000000000e000000000000000, type: 0}
  m_DefaultReflectionMode: 0
  m_DefaultReflectionResolution: 128
  m_ReflectionBounces: 1
  m_ReflectionIntensity: 1
  m_CustomReflection: {fileID: 0}
  m_Sun: {fileID: 0}
  m_IndirectSpecularColor: {r: 0, g: 0, b: 0, a: 1}
  m_UseRadianceAmbientProbe: 0
--- !u!157 &3
LightmapSettings:
  m_ObjectHideFlags: 0
  serializedVersion: 12
  m_GIWorkflowMode: 1
  m_GISettings:
    serializedVersion: 2
    m_BounceScale: 1
    m_IndirectOutputScale: 1
    m_AlbedoBoost: 1
    m_EnvironmentLightingMode: 0
    m_EnableBakedLightmaps: 0
    m_EnableRealtimeLightmaps: 0
  m_LightmapEditorSettings:
    serializedVersion: 12
    m_Resolution: 2
    m_BakeResolution: 40
    m_AtlasSize: 1024
    m_AO: 0
    m_AOMaxDistance: 1
    m_CompAOExponent: 1
    m_CompAOExponentDirect: 0
    m_ExtractAmbientOcclusion: 0
    m_Padding: 2
    m_LightmapParameters: {fileID: 0}
    m_LightmapsBakeMode: 1
    m_TextureCompression: 1
    m_FinalGather: 0
    m_FinalGatherFiltering: 1
    m_FinalGatherRayCount: 256
    m_ReflectionCompression: 2
    m_MixedBakeMode: 2
    m_BakeBackend: 0
    m_PVRSampling: 1
    m_PVRDirectSampleCount: 32
    m_PVRSampleCount: 500
    m_PVRBounces: 2
    m_PVREnvironmentSampleCount: 500
    m_PVREnvironmentReferencePointCount: 2048
    m_PVRFilteringMode: 2
    m_PVRDenoiserTypeDirect: 0
    m_PVRDenoiserTypeIndirect: 0
    m_PVRDenoiserTypeAO: 0
    m_PVRFilterTypeDirect: 0
    m_PVRFilterTypeIndirect: 0
    m_PVRFilterTypeAO: 0
    m_PVREnvironmentMIS: 0
    m_PVRCulling: 1
    m_PVRFilteringGaussRadiusDirect: 1
    m_PVRFilteringGaussRadiusIndirect: 5
    m_PVRFilteringGaussRadiusAO: 2
    m_PVRFilteringAtrousPositionSigmaDirect: 0.5
    m_PVRFilteringAtrousPositionSigmaIndirect: 2
    m_PVRFilteringAtrousPositionSigmaAO: 1
    m_ExportTrainingData: 0
    m_TrainingDataDestination: TrainingData
    m_LightProbeSampleCountMultiplier: 4
  m_LightingDataAsset: {fileID: 0}
  m_LightingSettings: {fileID: 0}
--- !u!196 &4
NavMeshSettings:
  serializedVersion: 2
  m_ObjectHideFlags: 0
  m_BuildSettings:
    serializedVersion: 2
    agentTypeID: 0
    agentRadius: 0.5
    agentHeight: 2
    agentSlope: 45
    agentClimb: 0.4
    ledgeDropHeight: 0
    maxJumpAcrossDistance: 0
    minRegionArea: 2
    manualCellSize: 0
    cellSize: 0.16666667
    manualTileSize: 0
    tileSize: 256
    accuratePlacement: 0
    maxJobWorkers: 0
    preserveTilesOutsideBounds: 0
    debug:
      m_Flags: 0
  m_NavMeshData: {fileID: 0}
--- !u!1001 &261534631
PrefabInstance:
  m_ObjectHideFlags: 0
  serializedVersion: 2
  m_Modification:
    m_TransformParent: {fileID: 1929805885}
    m_Modifications:
    - target: {fileID: 1806183069247344042, guid: 20b9bc335bf8c4b34b38bc09f400f17c, type: 3}
      propertyPath: m_Text
      value: 33
      objectReference: {fileID: 0}
    - target: {fileID: 8347933310647304346, guid: 20b9bc335bf8c4b34b38bc09f400f17c, type: 3}
      propertyPath: m_Pivot.x
      value: 0.5
      objectReference: {fileID: 0}
    - target: {fileID: 8347933310647304346, guid: 20b9bc335bf8c4b34b38bc09f400f17c, type: 3}
      propertyPath: m_Pivot.y
      value: 0.5
      objectReference: {fileID: 0}
    - target: {fileID: 8347933310647304346, guid: 20b9bc335bf8c4b34b38bc09f400f17c, type: 3}
      propertyPath: m_RootOrder
      value: 5
      objectReference: {fileID: 0}
    - target: {fileID: 8347933310647304346, guid: 20b9bc335bf8c4b34b38bc09f400f17c, type: 3}
      propertyPath: m_AnchorMax.x
      value: 0
      objectReference: {fileID: 0}
    - target: {fileID: 8347933310647304346, guid: 20b9bc335bf8c4b34b38bc09f400f17c, type: 3}
      propertyPath: m_AnchorMax.y
      value: 0
      objectReference: {fileID: 0}
    - target: {fileID: 8347933310647304346, guid: 20b9bc335bf8c4b34b38bc09f400f17c, type: 3}
      propertyPath: m_AnchorMin.x
      value: 0
      objectReference: {fileID: 0}
    - target: {fileID: 8347933310647304346, guid: 20b9bc335bf8c4b34b38bc09f400f17c, type: 3}
      propertyPath: m_AnchorMin.y
      value: 0
      objectReference: {fileID: 0}
    - target: {fileID: 8347933310647304346, guid: 20b9bc335bf8c4b34b38bc09f400f17c, type: 3}
      propertyPath: m_SizeDelta.x
      value: 0
      objectReference: {fileID: 0}
    - target: {fileID: 8347933310647304346, guid: 20b9bc335bf8c4b34b38bc09f400f17c, type: 3}
      propertyPath: m_SizeDelta.y
      value: 0
      objectReference: {fileID: 0}
    - target: {fileID: 8347933310647304346, guid: 20b9bc335bf8c4b34b38bc09f400f17c, type: 3}
      propertyPath: m_LocalPosition.x
      value: 0
      objectReference: {fileID: 0}
    - target: {fileID: 8347933310647304346, guid: 20b9bc335bf8c4b34b38bc09f400f17c, type: 3}
      propertyPath: m_LocalPosition.y
      value: 0
      objectReference: {fileID: 0}
    - target: {fileID: 8347933310647304346, guid: 20b9bc335bf8c4b34b38bc09f400f17c, type: 3}
      propertyPath: m_LocalPosition.z
      value: 0
      objectReference: {fileID: 0}
    - target: {fileID: 8347933310647304346, guid: 20b9bc335bf8c4b34b38bc09f400f17c, type: 3}
      propertyPath: m_LocalRotation.w
      value: 1
      objectReference: {fileID: 0}
    - target: {fileID: 8347933310647304346, guid: 20b9bc335bf8c4b34b38bc09f400f17c, type: 3}
      propertyPath: m_LocalRotation.x
      value: -0
      objectReference: {fileID: 0}
    - target: {fileID: 8347933310647304346, guid: 20b9bc335bf8c4b34b38bc09f400f17c, type: 3}
      propertyPath: m_LocalRotation.y
      value: -0
      objectReference: {fileID: 0}
    - target: {fileID: 8347933310647304346, guid: 20b9bc335bf8c4b34b38bc09f400f17c, type: 3}
      propertyPath: m_LocalRotation.z
      value: -0
      objectReference: {fileID: 0}
    - target: {fileID: 8347933310647304346, guid: 20b9bc335bf8c4b34b38bc09f400f17c, type: 3}
      propertyPath: m_AnchoredPosition.x
      value: 0
      objectReference: {fileID: 0}
    - target: {fileID: 8347933310647304346, guid: 20b9bc335bf8c4b34b38bc09f400f17c, type: 3}
      propertyPath: m_AnchoredPosition.y
      value: 0
      objectReference: {fileID: 0}
    - target: {fileID: 8347933310647304346, guid: 20b9bc335bf8c4b34b38bc09f400f17c, type: 3}
      propertyPath: m_LocalEulerAnglesHint.x
      value: 0
      objectReference: {fileID: 0}
    - target: {fileID: 8347933310647304346, guid: 20b9bc335bf8c4b34b38bc09f400f17c, type: 3}
      propertyPath: m_LocalEulerAnglesHint.y
      value: 0
      objectReference: {fileID: 0}
    - target: {fileID: 8347933310647304346, guid: 20b9bc335bf8c4b34b38bc09f400f17c, type: 3}
      propertyPath: m_LocalEulerAnglesHint.z
      value: 0
      objectReference: {fileID: 0}
    - target: {fileID: 9123702862749501608, guid: 20b9bc335bf8c4b34b38bc09f400f17c, type: 3}
      propertyPath: m_Name
      value: 1 (5)
      objectReference: {fileID: 0}
    - target: {fileID: 9207274075573484653, guid: 20b9bc335bf8c4b34b38bc09f400f17c, type: 3}
      propertyPath: currentCell.cellIndex
      value: 33
      objectReference: {fileID: 0}
    m_RemovedComponents: []
  m_SourcePrefab: {fileID: 100100000, guid: 20b9bc335bf8c4b34b38bc09f400f17c, type: 3}
--- !u!224 &278723066 stripped
RectTransform:
  m_CorrespondingSourceObject: {fileID: 8347933310647304346, guid: 20b9bc335bf8c4b34b38bc09f400f17c, type: 3}
  m_PrefabInstance: {fileID: 476140703}
  m_PrefabAsset: {fileID: 0}
--- !u!1001 &305783181
PrefabInstance:
  m_ObjectHideFlags: 0
  serializedVersion: 2
  m_Modification:
    m_TransformParent: {fileID: 1929805885}
    m_Modifications:
    - target: {fileID: 1806183069247344042, guid: 20b9bc335bf8c4b34b38bc09f400f17c, type: 3}
      propertyPath: m_Text
      value: 29
      objectReference: {fileID: 0}
    - target: {fileID: 8347933310647304346, guid: 20b9bc335bf8c4b34b38bc09f400f17c, type: 3}
      propertyPath: m_Pivot.x
      value: 0.5
      objectReference: {fileID: 0}
    - target: {fileID: 8347933310647304346, guid: 20b9bc335bf8c4b34b38bc09f400f17c, type: 3}
      propertyPath: m_Pivot.y
      value: 0.5
      objectReference: {fileID: 0}
    - target: {fileID: 8347933310647304346, guid: 20b9bc335bf8c4b34b38bc09f400f17c, type: 3}
      propertyPath: m_RootOrder
      value: 1
      objectReference: {fileID: 0}
    - target: {fileID: 8347933310647304346, guid: 20b9bc335bf8c4b34b38bc09f400f17c, type: 3}
      propertyPath: m_AnchorMax.x
      value: 0
      objectReference: {fileID: 0}
    - target: {fileID: 8347933310647304346, guid: 20b9bc335bf8c4b34b38bc09f400f17c, type: 3}
      propertyPath: m_AnchorMax.y
      value: 0
      objectReference: {fileID: 0}
    - target: {fileID: 8347933310647304346, guid: 20b9bc335bf8c4b34b38bc09f400f17c, type: 3}
      propertyPath: m_AnchorMin.x
      value: 0
      objectReference: {fileID: 0}
    - target: {fileID: 8347933310647304346, guid: 20b9bc335bf8c4b34b38bc09f400f17c, type: 3}
      propertyPath: m_AnchorMin.y
      value: 0
      objectReference: {fileID: 0}
    - target: {fileID: 8347933310647304346, guid: 20b9bc335bf8c4b34b38bc09f400f17c, type: 3}
      propertyPath: m_SizeDelta.x
      value: 0
      objectReference: {fileID: 0}
    - target: {fileID: 8347933310647304346, guid: 20b9bc335bf8c4b34b38bc09f400f17c, type: 3}
      propertyPath: m_SizeDelta.y
      value: 0
      objectReference: {fileID: 0}
    - target: {fileID: 8347933310647304346, guid: 20b9bc335bf8c4b34b38bc09f400f17c, type: 3}
      propertyPath: m_LocalPosition.x
      value: 0
      objectReference: {fileID: 0}
    - target: {fileID: 8347933310647304346, guid: 20b9bc335bf8c4b34b38bc09f400f17c, type: 3}
      propertyPath: m_LocalPosition.y
      value: 0
      objectReference: {fileID: 0}
    - target: {fileID: 8347933310647304346, guid: 20b9bc335bf8c4b34b38bc09f400f17c, type: 3}
      propertyPath: m_LocalPosition.z
      value: 0
      objectReference: {fileID: 0}
    - target: {fileID: 8347933310647304346, guid: 20b9bc335bf8c4b34b38bc09f400f17c, type: 3}
      propertyPath: m_LocalRotation.w
      value: 1
      objectReference: {fileID: 0}
    - target: {fileID: 8347933310647304346, guid: 20b9bc335bf8c4b34b38bc09f400f17c, type: 3}
      propertyPath: m_LocalRotation.x
      value: -0
      objectReference: {fileID: 0}
    - target: {fileID: 8347933310647304346, guid: 20b9bc335bf8c4b34b38bc09f400f17c, type: 3}
      propertyPath: m_LocalRotation.y
      value: -0
      objectReference: {fileID: 0}
    - target: {fileID: 8347933310647304346, guid: 20b9bc335bf8c4b34b38bc09f400f17c, type: 3}
      propertyPath: m_LocalRotation.z
      value: -0
      objectReference: {fileID: 0}
    - target: {fileID: 8347933310647304346, guid: 20b9bc335bf8c4b34b38bc09f400f17c, type: 3}
      propertyPath: m_AnchoredPosition.x
      value: 0
      objectReference: {fileID: 0}
    - target: {fileID: 8347933310647304346, guid: 20b9bc335bf8c4b34b38bc09f400f17c, type: 3}
      propertyPath: m_AnchoredPosition.y
      value: 0
      objectReference: {fileID: 0}
    - target: {fileID: 8347933310647304346, guid: 20b9bc335bf8c4b34b38bc09f400f17c, type: 3}
      propertyPath: m_LocalEulerAnglesHint.x
      value: 0
      objectReference: {fileID: 0}
    - target: {fileID: 8347933310647304346, guid: 20b9bc335bf8c4b34b38bc09f400f17c, type: 3}
      propertyPath: m_LocalEulerAnglesHint.y
      value: 0
      objectReference: {fileID: 0}
    - target: {fileID: 8347933310647304346, guid: 20b9bc335bf8c4b34b38bc09f400f17c, type: 3}
      propertyPath: m_LocalEulerAnglesHint.z
      value: 0
      objectReference: {fileID: 0}
    - target: {fileID: 9123702862749501608, guid: 20b9bc335bf8c4b34b38bc09f400f17c, type: 3}
      propertyPath: m_Name
      value: 1 (1)
      objectReference: {fileID: 0}
    - target: {fileID: 9207274075573484653, guid: 20b9bc335bf8c4b34b38bc09f400f17c, type: 3}
      propertyPath: currentCell.cellIndex
      value: 29
      objectReference: {fileID: 0}
    m_RemovedComponents: []
  m_SourcePrefab: {fileID: 100100000, guid: 20b9bc335bf8c4b34b38bc09f400f17c, type: 3}
--- !u!1001 &330637478
PrefabInstance:
  m_ObjectHideFlags: 0
  serializedVersion: 2
  m_Modification:
    m_TransformParent: {fileID: 1929805885}
    m_Modifications:
    - target: {fileID: 1806183069247344042, guid: 20b9bc335bf8c4b34b38bc09f400f17c, type: 3}
      propertyPath: m_Text
      value: 31
      objectReference: {fileID: 0}
    - target: {fileID: 8347933310647304346, guid: 20b9bc335bf8c4b34b38bc09f400f17c, type: 3}
      propertyPath: m_Pivot.x
      value: 0.5
      objectReference: {fileID: 0}
    - target: {fileID: 8347933310647304346, guid: 20b9bc335bf8c4b34b38bc09f400f17c, type: 3}
      propertyPath: m_Pivot.y
      value: 0.5
      objectReference: {fileID: 0}
    - target: {fileID: 8347933310647304346, guid: 20b9bc335bf8c4b34b38bc09f400f17c, type: 3}
      propertyPath: m_RootOrder
      value: 3
      objectReference: {fileID: 0}
    - target: {fileID: 8347933310647304346, guid: 20b9bc335bf8c4b34b38bc09f400f17c, type: 3}
      propertyPath: m_AnchorMax.x
      value: 0
      objectReference: {fileID: 0}
    - target: {fileID: 8347933310647304346, guid: 20b9bc335bf8c4b34b38bc09f400f17c, type: 3}
      propertyPath: m_AnchorMax.y
      value: 0
      objectReference: {fileID: 0}
    - target: {fileID: 8347933310647304346, guid: 20b9bc335bf8c4b34b38bc09f400f17c, type: 3}
      propertyPath: m_AnchorMin.x
      value: 0
      objectReference: {fileID: 0}
    - target: {fileID: 8347933310647304346, guid: 20b9bc335bf8c4b34b38bc09f400f17c, type: 3}
      propertyPath: m_AnchorMin.y
      value: 0
      objectReference: {fileID: 0}
    - target: {fileID: 8347933310647304346, guid: 20b9bc335bf8c4b34b38bc09f400f17c, type: 3}
      propertyPath: m_SizeDelta.x
      value: 0
      objectReference: {fileID: 0}
    - target: {fileID: 8347933310647304346, guid: 20b9bc335bf8c4b34b38bc09f400f17c, type: 3}
      propertyPath: m_SizeDelta.y
      value: 0
      objectReference: {fileID: 0}
    - target: {fileID: 8347933310647304346, guid: 20b9bc335bf8c4b34b38bc09f400f17c, type: 3}
      propertyPath: m_LocalPosition.x
      value: 0
      objectReference: {fileID: 0}
    - target: {fileID: 8347933310647304346, guid: 20b9bc335bf8c4b34b38bc09f400f17c, type: 3}
      propertyPath: m_LocalPosition.y
      value: 0
      objectReference: {fileID: 0}
    - target: {fileID: 8347933310647304346, guid: 20b9bc335bf8c4b34b38bc09f400f17c, type: 3}
      propertyPath: m_LocalPosition.z
      value: 0
      objectReference: {fileID: 0}
    - target: {fileID: 8347933310647304346, guid: 20b9bc335bf8c4b34b38bc09f400f17c, type: 3}
      propertyPath: m_LocalRotation.w
      value: 1
      objectReference: {fileID: 0}
    - target: {fileID: 8347933310647304346, guid: 20b9bc335bf8c4b34b38bc09f400f17c, type: 3}
      propertyPath: m_LocalRotation.x
      value: -0
      objectReference: {fileID: 0}
    - target: {fileID: 8347933310647304346, guid: 20b9bc335bf8c4b34b38bc09f400f17c, type: 3}
      propertyPath: m_LocalRotation.y
      value: -0
      objectReference: {fileID: 0}
    - target: {fileID: 8347933310647304346, guid: 20b9bc335bf8c4b34b38bc09f400f17c, type: 3}
      propertyPath: m_LocalRotation.z
      value: -0
      objectReference: {fileID: 0}
    - target: {fileID: 8347933310647304346, guid: 20b9bc335bf8c4b34b38bc09f400f17c, type: 3}
      propertyPath: m_AnchoredPosition.x
      value: 0
      objectReference: {fileID: 0}
    - target: {fileID: 8347933310647304346, guid: 20b9bc335bf8c4b34b38bc09f400f17c, type: 3}
      propertyPath: m_AnchoredPosition.y
      value: 0
      objectReference: {fileID: 0}
    - target: {fileID: 8347933310647304346, guid: 20b9bc335bf8c4b34b38bc09f400f17c, type: 3}
      propertyPath: m_LocalEulerAnglesHint.x
      value: 0
      objectReference: {fileID: 0}
    - target: {fileID: 8347933310647304346, guid: 20b9bc335bf8c4b34b38bc09f400f17c, type: 3}
      propertyPath: m_LocalEulerAnglesHint.y
      value: 0
      objectReference: {fileID: 0}
    - target: {fileID: 8347933310647304346, guid: 20b9bc335bf8c4b34b38bc09f400f17c, type: 3}
      propertyPath: m_LocalEulerAnglesHint.z
      value: 0
      objectReference: {fileID: 0}
    - target: {fileID: 9123702862749501608, guid: 20b9bc335bf8c4b34b38bc09f400f17c, type: 3}
      propertyPath: m_Name
      value: 1 (3)
      objectReference: {fileID: 0}
    - target: {fileID: 9207274075573484653, guid: 20b9bc335bf8c4b34b38bc09f400f17c, type: 3}
      propertyPath: currentCell.cellIndex
      value: 31
      objectReference: {fileID: 0}
    m_RemovedComponents: []
  m_SourcePrefab: {fileID: 100100000, guid: 20b9bc335bf8c4b34b38bc09f400f17c, type: 3}
--- !u!1001 &476140703
PrefabInstance:
  m_ObjectHideFlags: 0
  serializedVersion: 2
  m_Modification:
    m_TransformParent: {fileID: 1929805885}
    m_Modifications:
    - target: {fileID: 1806183069247344042, guid: 20b9bc335bf8c4b34b38bc09f400f17c, type: 3}
      propertyPath: m_Text
      value: 28
      objectReference: {fileID: 0}
    - target: {fileID: 8347933310647304346, guid: 20b9bc335bf8c4b34b38bc09f400f17c, type: 3}
      propertyPath: m_Pivot.x
      value: 0.5
      objectReference: {fileID: 0}
    - target: {fileID: 8347933310647304346, guid: 20b9bc335bf8c4b34b38bc09f400f17c, type: 3}
      propertyPath: m_Pivot.y
      value: 0.5
      objectReference: {fileID: 0}
    - target: {fileID: 8347933310647304346, guid: 20b9bc335bf8c4b34b38bc09f400f17c, type: 3}
      propertyPath: m_RootOrder
      value: 0
      objectReference: {fileID: 0}
    - target: {fileID: 8347933310647304346, guid: 20b9bc335bf8c4b34b38bc09f400f17c, type: 3}
      propertyPath: m_AnchorMax.x
      value: 0
      objectReference: {fileID: 0}
    - target: {fileID: 8347933310647304346, guid: 20b9bc335bf8c4b34b38bc09f400f17c, type: 3}
      propertyPath: m_AnchorMax.y
      value: 0
      objectReference: {fileID: 0}
    - target: {fileID: 8347933310647304346, guid: 20b9bc335bf8c4b34b38bc09f400f17c, type: 3}
      propertyPath: m_AnchorMin.x
      value: 0
      objectReference: {fileID: 0}
    - target: {fileID: 8347933310647304346, guid: 20b9bc335bf8c4b34b38bc09f400f17c, type: 3}
      propertyPath: m_AnchorMin.y
      value: 0
      objectReference: {fileID: 0}
    - target: {fileID: 8347933310647304346, guid: 20b9bc335bf8c4b34b38bc09f400f17c, type: 3}
      propertyPath: m_SizeDelta.x
      value: 0
      objectReference: {fileID: 0}
    - target: {fileID: 8347933310647304346, guid: 20b9bc335bf8c4b34b38bc09f400f17c, type: 3}
      propertyPath: m_SizeDelta.y
      value: 0
      objectReference: {fileID: 0}
    - target: {fileID: 8347933310647304346, guid: 20b9bc335bf8c4b34b38bc09f400f17c, type: 3}
      propertyPath: m_LocalPosition.x
      value: 0
      objectReference: {fileID: 0}
    - target: {fileID: 8347933310647304346, guid: 20b9bc335bf8c4b34b38bc09f400f17c, type: 3}
      propertyPath: m_LocalPosition.y
      value: 0
      objectReference: {fileID: 0}
    - target: {fileID: 8347933310647304346, guid: 20b9bc335bf8c4b34b38bc09f400f17c, type: 3}
      propertyPath: m_LocalPosition.z
      value: 0
      objectReference: {fileID: 0}
    - target: {fileID: 8347933310647304346, guid: 20b9bc335bf8c4b34b38bc09f400f17c, type: 3}
      propertyPath: m_LocalRotation.w
      value: 1
      objectReference: {fileID: 0}
    - target: {fileID: 8347933310647304346, guid: 20b9bc335bf8c4b34b38bc09f400f17c, type: 3}
      propertyPath: m_LocalRotation.x
      value: -0
      objectReference: {fileID: 0}
    - target: {fileID: 8347933310647304346, guid: 20b9bc335bf8c4b34b38bc09f400f17c, type: 3}
      propertyPath: m_LocalRotation.y
      value: -0
      objectReference: {fileID: 0}
    - target: {fileID: 8347933310647304346, guid: 20b9bc335bf8c4b34b38bc09f400f17c, type: 3}
      propertyPath: m_LocalRotation.z
      value: -0
      objectReference: {fileID: 0}
    - target: {fileID: 8347933310647304346, guid: 20b9bc335bf8c4b34b38bc09f400f17c, type: 3}
      propertyPath: m_AnchoredPosition.x
      value: 0
      objectReference: {fileID: 0}
    - target: {fileID: 8347933310647304346, guid: 20b9bc335bf8c4b34b38bc09f400f17c, type: 3}
      propertyPath: m_AnchoredPosition.y
      value: 0
      objectReference: {fileID: 0}
    - target: {fileID: 8347933310647304346, guid: 20b9bc335bf8c4b34b38bc09f400f17c, type: 3}
      propertyPath: m_LocalEulerAnglesHint.x
      value: 0
      objectReference: {fileID: 0}
    - target: {fileID: 8347933310647304346, guid: 20b9bc335bf8c4b34b38bc09f400f17c, type: 3}
      propertyPath: m_LocalEulerAnglesHint.y
      value: 0
      objectReference: {fileID: 0}
    - target: {fileID: 8347933310647304346, guid: 20b9bc335bf8c4b34b38bc09f400f17c, type: 3}
      propertyPath: m_LocalEulerAnglesHint.z
      value: 0
      objectReference: {fileID: 0}
    - target: {fileID: 9123702862749501608, guid: 20b9bc335bf8c4b34b38bc09f400f17c, type: 3}
      propertyPath: m_Name
      value: 1
      objectReference: {fileID: 0}
    - target: {fileID: 9207274075573484653, guid: 20b9bc335bf8c4b34b38bc09f400f17c, type: 3}
      propertyPath: currentCell.cellIndex
      value: 28
      objectReference: {fileID: 0}
    m_RemovedComponents: []
  m_SourcePrefab: {fileID: 100100000, guid: 20b9bc335bf8c4b34b38bc09f400f17c, type: 3}
--- !u!1 &519420028
GameObject:
  m_ObjectHideFlags: 0
  m_CorrespondingSourceObject: {fileID: 0}
  m_PrefabInstance: {fileID: 0}
  m_PrefabAsset: {fileID: 0}
  serializedVersion: 6
  m_Component:
  - component: {fileID: 519420032}
  - component: {fileID: 519420031}
  - component: {fileID: 519420029}
  - component: {fileID: 519420030}
  m_Layer: 0
  m_Name: Eyes
  m_TagString: MainCamera
  m_Icon: {fileID: 0}
  m_NavMeshLayer: 0
  m_StaticEditorFlags: 0
  m_IsActive: 1
--- !u!81 &519420029
AudioListener:
  m_ObjectHideFlags: 0
  m_CorrespondingSourceObject: {fileID: 0}
  m_PrefabInstance: {fileID: 0}
  m_PrefabAsset: {fileID: 0}
  m_GameObject: {fileID: 519420028}
  m_Enabled: 1
--- !u!114 &519420030
MonoBehaviour:
  m_ObjectHideFlags: 0
  m_CorrespondingSourceObject: {fileID: 0}
  m_PrefabInstance: {fileID: 0}
  m_PrefabAsset: {fileID: 0}
  m_GameObject: {fileID: 519420028}
  m_Enabled: 1
  m_EditorHideFlags: 0
  m_Script: {fileID: 11500000, guid: c49b4cc203aa6414fae5c798d1d0e7d6, type: 3}
  m_Name: 
  m_EditorClassIdentifier: 
  m_EventMask:
    serializedVersion: 2
    m_Bits: 4294967295
  m_MaxRayIntersections: 0
--- !u!20 &519420031
Camera:
  m_ObjectHideFlags: 0
  m_CorrespondingSourceObject: {fileID: 0}
  m_PrefabInstance: {fileID: 0}
  m_PrefabAsset: {fileID: 0}
  m_GameObject: {fileID: 519420028}
  m_Enabled: 1
  serializedVersion: 2
  m_ClearFlags: 2
  m_BackGroundColor: {r: 1, g: 1, b: 1, a: 0}
  m_projectionMatrixMode: 1
  m_GateFitMode: 2
  m_FOVAxisMode: 0
  m_SensorSize: {x: 36, y: 24}
  m_LensShift: {x: 0, y: 0}
  m_FocalLength: 50
  m_NormalizedViewPortRect:
    serializedVersion: 2
    x: 0
    y: 0
    width: 1
    height: 1
  near clip plane: 0.3
  far clip plane: 1000
  field of view: 60
  orthographic: 1
  orthographic size: 5
  m_Depth: -1
  m_CullingMask:
    serializedVersion: 2
    m_Bits: 4294967295
  m_RenderingPath: -1
  m_TargetTexture: {fileID: 0}
  m_TargetDisplay: 0
  m_TargetEye: 0
  m_HDR: 1
  m_AllowMSAA: 0
  m_AllowDynamicResolution: 0
  m_ForceIntoRT: 0
  m_OcclusionCulling: 0
  m_StereoConvergence: 10
  m_StereoSeparation: 0.022
--- !u!4 &519420032
Transform:
  m_ObjectHideFlags: 0
  m_CorrespondingSourceObject: {fileID: 0}
  m_PrefabInstance: {fileID: 0}
  m_PrefabAsset: {fileID: 0}
  m_GameObject: {fileID: 519420028}
  m_LocalRotation: {x: 0, y: 0, z: 0, w: 1}
  m_LocalPosition: {x: 0, y: 0, z: -10}
  m_LocalScale: {x: 1, y: 1, z: 1}
  m_Children: []
  m_Father: {fileID: 0}
  m_RootOrder: 0
  m_LocalEulerAnglesHint: {x: 0, y: 0, z: 0}
--- !u!224 &530109956 stripped
RectTransform:
  m_CorrespondingSourceObject: {fileID: 8347933310647304346, guid: 20b9bc335bf8c4b34b38bc09f400f17c, type: 3}
  m_PrefabInstance: {fileID: 1464086750}
  m_PrefabAsset: {fileID: 0}
--- !u!224 &557745162 stripped
RectTransform:
  m_CorrespondingSourceObject: {fileID: 8347933310647304346, guid: 20b9bc335bf8c4b34b38bc09f400f17c, type: 3}
  m_PrefabInstance: {fileID: 261534631}
  m_PrefabAsset: {fileID: 0}
--- !u!1 &583992822
GameObject:
  m_ObjectHideFlags: 0
  m_CorrespondingSourceObject: {fileID: 0}
  m_PrefabInstance: {fileID: 0}
  m_PrefabAsset: {fileID: 0}
  serializedVersion: 6
  m_Component:
  - component: {fileID: 583992826}
  - component: {fileID: 583992825}
  - component: {fileID: 583992824}
  - component: {fileID: 583992823}
  m_Layer: 5
  m_Name: Canvas
  m_TagString: Untagged
  m_Icon: {fileID: 0}
  m_NavMeshLayer: 0
  m_StaticEditorFlags: 0
  m_IsActive: 1
--- !u!114 &583992823
MonoBehaviour:
  m_ObjectHideFlags: 0
  m_CorrespondingSourceObject: {fileID: 0}
  m_PrefabInstance: {fileID: 0}
  m_PrefabAsset: {fileID: 0}
  m_GameObject: {fileID: 583992822}
  m_Enabled: 1
  m_EditorHideFlags: 0
  m_Script: {fileID: 11500000, guid: dc42784cf147c0c48a680349fa168899, type: 3}
  m_Name: 
  m_EditorClassIdentifier: 
  m_IgnoreReversedGraphics: 1
  m_BlockingObjects: 0
  m_BlockingMask:
    serializedVersion: 2
    m_Bits: 4294967295
--- !u!114 &583992824
MonoBehaviour:
  m_ObjectHideFlags: 0
  m_CorrespondingSourceObject: {fileID: 0}
  m_PrefabInstance: {fileID: 0}
  m_PrefabAsset: {fileID: 0}
  m_GameObject: {fileID: 583992822}
  m_Enabled: 1
  m_EditorHideFlags: 0
  m_Script: {fileID: 11500000, guid: 0cd44c1031e13a943bb63640046fad76, type: 3}
  m_Name: 
  m_EditorClassIdentifier: 
  m_UiScaleMode: 0
  m_ReferencePixelsPerUnit: 100
  m_ScaleFactor: 1
  m_ReferenceResolution: {x: 800, y: 600}
  m_ScreenMatchMode: 0
  m_MatchWidthOrHeight: 0
  m_PhysicalUnit: 3
  m_FallbackScreenDPI: 96
  m_DefaultSpriteDPI: 96
  m_DynamicPixelsPerUnit: 1
  m_PresetInfoIsWorld: 0
--- !u!223 &583992825
Canvas:
  m_ObjectHideFlags: 0
  m_CorrespondingSourceObject: {fileID: 0}
  m_PrefabInstance: {fileID: 0}
  m_PrefabAsset: {fileID: 0}
  m_GameObject: {fileID: 583992822}
  m_Enabled: 1
  serializedVersion: 3
  m_RenderMode: 1
  m_Camera: {fileID: 519420031}
  m_PlaneDistance: 100
  m_PixelPerfect: 0
  m_ReceivesEvents: 1
  m_OverrideSorting: 0
  m_OverridePixelPerfect: 0
  m_SortingBucketNormalizedSize: 0
  m_AdditionalShaderChannelsFlag: 0
  m_SortingLayerID: 0
  m_SortingOrder: 0
  m_TargetDisplay: 0
--- !u!224 &583992826
RectTransform:
  m_ObjectHideFlags: 0
  m_CorrespondingSourceObject: {fileID: 0}
  m_PrefabInstance: {fileID: 0}
  m_PrefabAsset: {fileID: 0}
  m_GameObject: {fileID: 583992822}
  m_LocalRotation: {x: 0, y: 0, z: 0, w: 1}
  m_LocalPosition: {x: 0, y: 0, z: 0}
  m_LocalScale: {x: 0, y: 0, z: 0}
  m_Children:
  - {fileID: 2058545415}
  - {fileID: 1519749447}
  - {fileID: 1929805885}
  m_Father: {fileID: 0}
  m_RootOrder: 1
  m_LocalEulerAnglesHint: {x: 0, y: 0, z: 0}
  m_AnchorMin: {x: 0, y: 0}
  m_AnchorMax: {x: 0, y: 0}
  m_AnchoredPosition: {x: 0, y: 0}
  m_SizeDelta: {x: 0, y: 0}
  m_Pivot: {x: 0, y: 0}
--- !u!1001 &605428976
PrefabInstance:
  m_ObjectHideFlags: 0
  serializedVersion: 2
  m_Modification:
    m_TransformParent: {fileID: 1929805885}
    m_Modifications:
    - target: {fileID: 1806183069247344042, guid: 20b9bc335bf8c4b34b38bc09f400f17c, type: 3}
      propertyPath: m_Text
      value: 30
      objectReference: {fileID: 0}
    - target: {fileID: 8347933310647304346, guid: 20b9bc335bf8c4b34b38bc09f400f17c, type: 3}
      propertyPath: m_Pivot.x
      value: 0.5
      objectReference: {fileID: 0}
    - target: {fileID: 8347933310647304346, guid: 20b9bc335bf8c4b34b38bc09f400f17c, type: 3}
      propertyPath: m_Pivot.y
      value: 0.5
      objectReference: {fileID: 0}
    - target: {fileID: 8347933310647304346, guid: 20b9bc335bf8c4b34b38bc09f400f17c, type: 3}
      propertyPath: m_RootOrder
      value: 2
      objectReference: {fileID: 0}
    - target: {fileID: 8347933310647304346, guid: 20b9bc335bf8c4b34b38bc09f400f17c, type: 3}
      propertyPath: m_AnchorMax.x
      value: 0
      objectReference: {fileID: 0}
    - target: {fileID: 8347933310647304346, guid: 20b9bc335bf8c4b34b38bc09f400f17c, type: 3}
      propertyPath: m_AnchorMax.y
      value: 0
      objectReference: {fileID: 0}
    - target: {fileID: 8347933310647304346, guid: 20b9bc335bf8c4b34b38bc09f400f17c, type: 3}
      propertyPath: m_AnchorMin.x
      value: 0
      objectReference: {fileID: 0}
    - target: {fileID: 8347933310647304346, guid: 20b9bc335bf8c4b34b38bc09f400f17c, type: 3}
      propertyPath: m_AnchorMin.y
      value: 0
      objectReference: {fileID: 0}
    - target: {fileID: 8347933310647304346, guid: 20b9bc335bf8c4b34b38bc09f400f17c, type: 3}
      propertyPath: m_SizeDelta.x
      value: 0
      objectReference: {fileID: 0}
    - target: {fileID: 8347933310647304346, guid: 20b9bc335bf8c4b34b38bc09f400f17c, type: 3}
      propertyPath: m_SizeDelta.y
      value: 0
      objectReference: {fileID: 0}
    - target: {fileID: 8347933310647304346, guid: 20b9bc335bf8c4b34b38bc09f400f17c, type: 3}
      propertyPath: m_LocalPosition.x
      value: 0
      objectReference: {fileID: 0}
    - target: {fileID: 8347933310647304346, guid: 20b9bc335bf8c4b34b38bc09f400f17c, type: 3}
      propertyPath: m_LocalPosition.y
      value: 0
      objectReference: {fileID: 0}
    - target: {fileID: 8347933310647304346, guid: 20b9bc335bf8c4b34b38bc09f400f17c, type: 3}
      propertyPath: m_LocalPosition.z
      value: 0
      objectReference: {fileID: 0}
    - target: {fileID: 8347933310647304346, guid: 20b9bc335bf8c4b34b38bc09f400f17c, type: 3}
      propertyPath: m_LocalRotation.w
      value: 1
      objectReference: {fileID: 0}
    - target: {fileID: 8347933310647304346, guid: 20b9bc335bf8c4b34b38bc09f400f17c, type: 3}
      propertyPath: m_LocalRotation.x
      value: -0
      objectReference: {fileID: 0}
    - target: {fileID: 8347933310647304346, guid: 20b9bc335bf8c4b34b38bc09f400f17c, type: 3}
      propertyPath: m_LocalRotation.y
      value: -0
      objectReference: {fileID: 0}
    - target: {fileID: 8347933310647304346, guid: 20b9bc335bf8c4b34b38bc09f400f17c, type: 3}
      propertyPath: m_LocalRotation.z
      value: -0
      objectReference: {fileID: 0}
    - target: {fileID: 8347933310647304346, guid: 20b9bc335bf8c4b34b38bc09f400f17c, type: 3}
      propertyPath: m_AnchoredPosition.x
      value: 0
      objectReference: {fileID: 0}
    - target: {fileID: 8347933310647304346, guid: 20b9bc335bf8c4b34b38bc09f400f17c, type: 3}
      propertyPath: m_AnchoredPosition.y
      value: 0
      objectReference: {fileID: 0}
    - target: {fileID: 8347933310647304346, guid: 20b9bc335bf8c4b34b38bc09f400f17c, type: 3}
      propertyPath: m_LocalEulerAnglesHint.x
      value: 0
      objectReference: {fileID: 0}
    - target: {fileID: 8347933310647304346, guid: 20b9bc335bf8c4b34b38bc09f400f17c, type: 3}
      propertyPath: m_LocalEulerAnglesHint.y
      value: 0
      objectReference: {fileID: 0}
    - target: {fileID: 8347933310647304346, guid: 20b9bc335bf8c4b34b38bc09f400f17c, type: 3}
      propertyPath: m_LocalEulerAnglesHint.z
      value: 0
      objectReference: {fileID: 0}
    - target: {fileID: 9123702862749501608, guid: 20b9bc335bf8c4b34b38bc09f400f17c, type: 3}
      propertyPath: m_Name
      value: 1 (2)
      objectReference: {fileID: 0}
    - target: {fileID: 9207274075573484653, guid: 20b9bc335bf8c4b34b38bc09f400f17c, type: 3}
      propertyPath: currentCell.cellIndex
      value: 30
      objectReference: {fileID: 0}
    m_RemovedComponents: []
  m_SourcePrefab: {fileID: 100100000, guid: 20b9bc335bf8c4b34b38bc09f400f17c, type: 3}
--- !u!1001 &716918465
PrefabInstance:
  m_ObjectHideFlags: 0
  serializedVersion: 2
  m_Modification:
    m_TransformParent: {fileID: 1929805885}
    m_Modifications:
    - target: {fileID: 1806183069247344042, guid: 20b9bc335bf8c4b34b38bc09f400f17c, type: 3}
      propertyPath: m_Text
      value: 39
      objectReference: {fileID: 0}
    - target: {fileID: 8347933310647304346, guid: 20b9bc335bf8c4b34b38bc09f400f17c, type: 3}
      propertyPath: m_Pivot.x
      value: 0.5
      objectReference: {fileID: 0}
    - target: {fileID: 8347933310647304346, guid: 20b9bc335bf8c4b34b38bc09f400f17c, type: 3}
      propertyPath: m_Pivot.y
      value: 0.5
      objectReference: {fileID: 0}
    - target: {fileID: 8347933310647304346, guid: 20b9bc335bf8c4b34b38bc09f400f17c, type: 3}
      propertyPath: m_RootOrder
      value: 11
      objectReference: {fileID: 0}
    - target: {fileID: 8347933310647304346, guid: 20b9bc335bf8c4b34b38bc09f400f17c, type: 3}
      propertyPath: m_AnchorMax.x
      value: 0
      objectReference: {fileID: 0}
    - target: {fileID: 8347933310647304346, guid: 20b9bc335bf8c4b34b38bc09f400f17c, type: 3}
      propertyPath: m_AnchorMax.y
      value: 0
      objectReference: {fileID: 0}
    - target: {fileID: 8347933310647304346, guid: 20b9bc335bf8c4b34b38bc09f400f17c, type: 3}
      propertyPath: m_AnchorMin.x
      value: 0
      objectReference: {fileID: 0}
    - target: {fileID: 8347933310647304346, guid: 20b9bc335bf8c4b34b38bc09f400f17c, type: 3}
      propertyPath: m_AnchorMin.y
      value: 0
      objectReference: {fileID: 0}
    - target: {fileID: 8347933310647304346, guid: 20b9bc335bf8c4b34b38bc09f400f17c, type: 3}
      propertyPath: m_SizeDelta.x
      value: 0
      objectReference: {fileID: 0}
    - target: {fileID: 8347933310647304346, guid: 20b9bc335bf8c4b34b38bc09f400f17c, type: 3}
      propertyPath: m_SizeDelta.y
      value: 0
      objectReference: {fileID: 0}
    - target: {fileID: 8347933310647304346, guid: 20b9bc335bf8c4b34b38bc09f400f17c, type: 3}
      propertyPath: m_LocalPosition.x
      value: 0
      objectReference: {fileID: 0}
    - target: {fileID: 8347933310647304346, guid: 20b9bc335bf8c4b34b38bc09f400f17c, type: 3}
      propertyPath: m_LocalPosition.y
      value: 0
      objectReference: {fileID: 0}
    - target: {fileID: 8347933310647304346, guid: 20b9bc335bf8c4b34b38bc09f400f17c, type: 3}
      propertyPath: m_LocalPosition.z
      value: 0
      objectReference: {fileID: 0}
    - target: {fileID: 8347933310647304346, guid: 20b9bc335bf8c4b34b38bc09f400f17c, type: 3}
      propertyPath: m_LocalRotation.w
      value: 1
      objectReference: {fileID: 0}
    - target: {fileID: 8347933310647304346, guid: 20b9bc335bf8c4b34b38bc09f400f17c, type: 3}
      propertyPath: m_LocalRotation.x
      value: -0
      objectReference: {fileID: 0}
    - target: {fileID: 8347933310647304346, guid: 20b9bc335bf8c4b34b38bc09f400f17c, type: 3}
      propertyPath: m_LocalRotation.y
      value: -0
      objectReference: {fileID: 0}
    - target: {fileID: 8347933310647304346, guid: 20b9bc335bf8c4b34b38bc09f400f17c, type: 3}
      propertyPath: m_LocalRotation.z
      value: -0
      objectReference: {fileID: 0}
    - target: {fileID: 8347933310647304346, guid: 20b9bc335bf8c4b34b38bc09f400f17c, type: 3}
      propertyPath: m_AnchoredPosition.x
      value: 0
      objectReference: {fileID: 0}
    - target: {fileID: 8347933310647304346, guid: 20b9bc335bf8c4b34b38bc09f400f17c, type: 3}
      propertyPath: m_AnchoredPosition.y
      value: 0
      objectReference: {fileID: 0}
    - target: {fileID: 8347933310647304346, guid: 20b9bc335bf8c4b34b38bc09f400f17c, type: 3}
      propertyPath: m_LocalEulerAnglesHint.x
      value: 0
      objectReference: {fileID: 0}
    - target: {fileID: 8347933310647304346, guid: 20b9bc335bf8c4b34b38bc09f400f17c, type: 3}
      propertyPath: m_LocalEulerAnglesHint.y
      value: 0
      objectReference: {fileID: 0}
    - target: {fileID: 8347933310647304346, guid: 20b9bc335bf8c4b34b38bc09f400f17c, type: 3}
      propertyPath: m_LocalEulerAnglesHint.z
      value: 0
      objectReference: {fileID: 0}
    - target: {fileID: 9123702862749501608, guid: 20b9bc335bf8c4b34b38bc09f400f17c, type: 3}
      propertyPath: m_Name
      value: 1 (11)
      objectReference: {fileID: 0}
    - target: {fileID: 9207274075573484653, guid: 20b9bc335bf8c4b34b38bc09f400f17c, type: 3}
      propertyPath: currentCell.cellIndex
      value: 39
      objectReference: {fileID: 0}
    m_RemovedComponents: []
  m_SourcePrefab: {fileID: 100100000, guid: 20b9bc335bf8c4b34b38bc09f400f17c, type: 3}
--- !u!224 &751044525 stripped
RectTransform:
  m_CorrespondingSourceObject: {fileID: 8347933310647304346, guid: 20b9bc335bf8c4b34b38bc09f400f17c, type: 3}
  m_PrefabInstance: {fileID: 330637478}
  m_PrefabAsset: {fileID: 0}
--- !u!224 &803084414 stripped
RectTransform:
  m_CorrespondingSourceObject: {fileID: 8347933310647304346, guid: 20b9bc335bf8c4b34b38bc09f400f17c, type: 3}
  m_PrefabInstance: {fileID: 1642984202}
  m_PrefabAsset: {fileID: 0}
--- !u!1 &858051452
GameObject:
  m_ObjectHideFlags: 0
  m_CorrespondingSourceObject: {fileID: 0}
  m_PrefabInstance: {fileID: 0}
  m_PrefabAsset: {fileID: 0}
  serializedVersion: 6
  m_Component:
  - component: {fileID: 858051455}
  - component: {fileID: 858051454}
  - component: {fileID: 858051453}
  m_Layer: 0
  m_Name: EventSystem
  m_TagString: Untagged
  m_Icon: {fileID: 0}
  m_NavMeshLayer: 0
  m_StaticEditorFlags: 0
  m_IsActive: 1
--- !u!114 &858051453
MonoBehaviour:
  m_ObjectHideFlags: 0
  m_CorrespondingSourceObject: {fileID: 0}
  m_PrefabInstance: {fileID: 0}
  m_PrefabAsset: {fileID: 0}
  m_GameObject: {fileID: 858051452}
  m_Enabled: 1
  m_EditorHideFlags: 0
  m_Script: {fileID: 11500000, guid: 4f231c4fb786f3946a6b90b886c48677, type: 3}
  m_Name: 
  m_EditorClassIdentifier: 
  m_HorizontalAxis: Horizontal
  m_VerticalAxis: Vertical
  m_SubmitButton: Submit
  m_CancelButton: Cancel
  m_InputActionsPerSecond: 10
  m_RepeatDelay: 0.5
  m_ForceModuleActive: 0
--- !u!114 &858051454
MonoBehaviour:
  m_ObjectHideFlags: 0
  m_CorrespondingSourceObject: {fileID: 0}
  m_PrefabInstance: {fileID: 0}
  m_PrefabAsset: {fileID: 0}
  m_GameObject: {fileID: 858051452}
  m_Enabled: 1
  m_EditorHideFlags: 0
  m_Script: {fileID: 11500000, guid: 76c392e42b5098c458856cdf6ecaaaa1, type: 3}
  m_Name: 
  m_EditorClassIdentifier: 
  m_FirstSelected: {fileID: 0}
  m_sendNavigationEvents: 1
  m_DragThreshold: 10
--- !u!4 &858051455
Transform:
  m_ObjectHideFlags: 0
  m_CorrespondingSourceObject: {fileID: 0}
  m_PrefabInstance: {fileID: 0}
  m_PrefabAsset: {fileID: 0}
  m_GameObject: {fileID: 858051452}
  m_LocalRotation: {x: 0, y: 0, z: 0, w: 1}
  m_LocalPosition: {x: 0, y: 0, z: 0}
  m_LocalScale: {x: 1, y: 1, z: 1}
  m_Children: []
  m_Father: {fileID: 0}
  m_RootOrder: 2
  m_LocalEulerAnglesHint: {x: 0, y: 0, z: 0}
--- !u!1001 &920460623
PrefabInstance:
  m_ObjectHideFlags: 0
  serializedVersion: 2
  m_Modification:
    m_TransformParent: {fileID: 1929805885}
    m_Modifications:
    - target: {fileID: 1806183069247344042, guid: 20b9bc335bf8c4b34b38bc09f400f17c, type: 3}
      propertyPath: m_Text
      value: 38
      objectReference: {fileID: 0}
    - target: {fileID: 8347933310647304346, guid: 20b9bc335bf8c4b34b38bc09f400f17c, type: 3}
      propertyPath: m_Pivot.x
      value: 0.5
      objectReference: {fileID: 0}
    - target: {fileID: 8347933310647304346, guid: 20b9bc335bf8c4b34b38bc09f400f17c, type: 3}
      propertyPath: m_Pivot.y
      value: 0.5
      objectReference: {fileID: 0}
    - target: {fileID: 8347933310647304346, guid: 20b9bc335bf8c4b34b38bc09f400f17c, type: 3}
      propertyPath: m_RootOrder
      value: 10
      objectReference: {fileID: 0}
    - target: {fileID: 8347933310647304346, guid: 20b9bc335bf8c4b34b38bc09f400f17c, type: 3}
      propertyPath: m_AnchorMax.x
      value: 0
      objectReference: {fileID: 0}
    - target: {fileID: 8347933310647304346, guid: 20b9bc335bf8c4b34b38bc09f400f17c, type: 3}
      propertyPath: m_AnchorMax.y
      value: 0
      objectReference: {fileID: 0}
    - target: {fileID: 8347933310647304346, guid: 20b9bc335bf8c4b34b38bc09f400f17c, type: 3}
      propertyPath: m_AnchorMin.x
      value: 0
      objectReference: {fileID: 0}
    - target: {fileID: 8347933310647304346, guid: 20b9bc335bf8c4b34b38bc09f400f17c, type: 3}
      propertyPath: m_AnchorMin.y
      value: 0
      objectReference: {fileID: 0}
    - target: {fileID: 8347933310647304346, guid: 20b9bc335bf8c4b34b38bc09f400f17c, type: 3}
      propertyPath: m_SizeDelta.x
      value: 0
      objectReference: {fileID: 0}
    - target: {fileID: 8347933310647304346, guid: 20b9bc335bf8c4b34b38bc09f400f17c, type: 3}
      propertyPath: m_SizeDelta.y
      value: 0
      objectReference: {fileID: 0}
    - target: {fileID: 8347933310647304346, guid: 20b9bc335bf8c4b34b38bc09f400f17c, type: 3}
      propertyPath: m_LocalPosition.x
      value: 0
      objectReference: {fileID: 0}
    - target: {fileID: 8347933310647304346, guid: 20b9bc335bf8c4b34b38bc09f400f17c, type: 3}
      propertyPath: m_LocalPosition.y
      value: 0
      objectReference: {fileID: 0}
    - target: {fileID: 8347933310647304346, guid: 20b9bc335bf8c4b34b38bc09f400f17c, type: 3}
      propertyPath: m_LocalPosition.z
      value: 0
      objectReference: {fileID: 0}
    - target: {fileID: 8347933310647304346, guid: 20b9bc335bf8c4b34b38bc09f400f17c, type: 3}
      propertyPath: m_LocalRotation.w
      value: 1
      objectReference: {fileID: 0}
    - target: {fileID: 8347933310647304346, guid: 20b9bc335bf8c4b34b38bc09f400f17c, type: 3}
      propertyPath: m_LocalRotation.x
      value: -0
      objectReference: {fileID: 0}
    - target: {fileID: 8347933310647304346, guid: 20b9bc335bf8c4b34b38bc09f400f17c, type: 3}
      propertyPath: m_LocalRotation.y
      value: -0
      objectReference: {fileID: 0}
    - target: {fileID: 8347933310647304346, guid: 20b9bc335bf8c4b34b38bc09f400f17c, type: 3}
      propertyPath: m_LocalRotation.z
      value: -0
      objectReference: {fileID: 0}
    - target: {fileID: 8347933310647304346, guid: 20b9bc335bf8c4b34b38bc09f400f17c, type: 3}
      propertyPath: m_AnchoredPosition.x
      value: 0
      objectReference: {fileID: 0}
    - target: {fileID: 8347933310647304346, guid: 20b9bc335bf8c4b34b38bc09f400f17c, type: 3}
      propertyPath: m_AnchoredPosition.y
      value: 0
      objectReference: {fileID: 0}
    - target: {fileID: 8347933310647304346, guid: 20b9bc335bf8c4b34b38bc09f400f17c, type: 3}
      propertyPath: m_LocalEulerAnglesHint.x
      value: 0
      objectReference: {fileID: 0}
    - target: {fileID: 8347933310647304346, guid: 20b9bc335bf8c4b34b38bc09f400f17c, type: 3}
      propertyPath: m_LocalEulerAnglesHint.y
      value: 0
      objectReference: {fileID: 0}
    - target: {fileID: 8347933310647304346, guid: 20b9bc335bf8c4b34b38bc09f400f17c, type: 3}
      propertyPath: m_LocalEulerAnglesHint.z
      value: 0
      objectReference: {fileID: 0}
    - target: {fileID: 9123702862749501608, guid: 20b9bc335bf8c4b34b38bc09f400f17c, type: 3}
      propertyPath: m_Name
      value: 1 (10)
      objectReference: {fileID: 0}
    - target: {fileID: 9207274075573484653, guid: 20b9bc335bf8c4b34b38bc09f400f17c, type: 3}
      propertyPath: currentCell.cellIndex
      value: 38
      objectReference: {fileID: 0}
    m_RemovedComponents: []
  m_SourcePrefab: {fileID: 100100000, guid: 20b9bc335bf8c4b34b38bc09f400f17c, type: 3}
--- !u!224 &1242032399 stripped
RectTransform:
  m_CorrespondingSourceObject: {fileID: 8347933310647304346, guid: 20b9bc335bf8c4b34b38bc09f400f17c, type: 3}
  m_PrefabInstance: {fileID: 1498230104}
  m_PrefabAsset: {fileID: 0}
--- !u!1001 &1260925776
PrefabInstance:
  m_ObjectHideFlags: 0
  serializedVersion: 2
  m_Modification:
    m_TransformParent: {fileID: 1929805885}
    m_Modifications:
    - target: {fileID: 1806183069247344042, guid: 20b9bc335bf8c4b34b38bc09f400f17c, type: 3}
      propertyPath: m_Text
      value: 35
      objectReference: {fileID: 0}
    - target: {fileID: 8347933310647304346, guid: 20b9bc335bf8c4b34b38bc09f400f17c, type: 3}
      propertyPath: m_Pivot.x
      value: 0.5
      objectReference: {fileID: 0}
    - target: {fileID: 8347933310647304346, guid: 20b9bc335bf8c4b34b38bc09f400f17c, type: 3}
      propertyPath: m_Pivot.y
      value: 0.5
      objectReference: {fileID: 0}
    - target: {fileID: 8347933310647304346, guid: 20b9bc335bf8c4b34b38bc09f400f17c, type: 3}
      propertyPath: m_RootOrder
      value: 7
      objectReference: {fileID: 0}
    - target: {fileID: 8347933310647304346, guid: 20b9bc335bf8c4b34b38bc09f400f17c, type: 3}
      propertyPath: m_AnchorMax.x
      value: 0
      objectReference: {fileID: 0}
    - target: {fileID: 8347933310647304346, guid: 20b9bc335bf8c4b34b38bc09f400f17c, type: 3}
      propertyPath: m_AnchorMax.y
      value: 0
      objectReference: {fileID: 0}
    - target: {fileID: 8347933310647304346, guid: 20b9bc335bf8c4b34b38bc09f400f17c, type: 3}
      propertyPath: m_AnchorMin.x
      value: 0
      objectReference: {fileID: 0}
    - target: {fileID: 8347933310647304346, guid: 20b9bc335bf8c4b34b38bc09f400f17c, type: 3}
      propertyPath: m_AnchorMin.y
      value: 0
      objectReference: {fileID: 0}
    - target: {fileID: 8347933310647304346, guid: 20b9bc335bf8c4b34b38bc09f400f17c, type: 3}
      propertyPath: m_SizeDelta.x
      value: 0
      objectReference: {fileID: 0}
    - target: {fileID: 8347933310647304346, guid: 20b9bc335bf8c4b34b38bc09f400f17c, type: 3}
      propertyPath: m_SizeDelta.y
      value: 0
      objectReference: {fileID: 0}
    - target: {fileID: 8347933310647304346, guid: 20b9bc335bf8c4b34b38bc09f400f17c, type: 3}
      propertyPath: m_LocalPosition.x
      value: 0
      objectReference: {fileID: 0}
    - target: {fileID: 8347933310647304346, guid: 20b9bc335bf8c4b34b38bc09f400f17c, type: 3}
      propertyPath: m_LocalPosition.y
      value: 0
      objectReference: {fileID: 0}
    - target: {fileID: 8347933310647304346, guid: 20b9bc335bf8c4b34b38bc09f400f17c, type: 3}
      propertyPath: m_LocalPosition.z
      value: 0
      objectReference: {fileID: 0}
    - target: {fileID: 8347933310647304346, guid: 20b9bc335bf8c4b34b38bc09f400f17c, type: 3}
      propertyPath: m_LocalRotation.w
      value: 1
      objectReference: {fileID: 0}
    - target: {fileID: 8347933310647304346, guid: 20b9bc335bf8c4b34b38bc09f400f17c, type: 3}
      propertyPath: m_LocalRotation.x
      value: -0
      objectReference: {fileID: 0}
    - target: {fileID: 8347933310647304346, guid: 20b9bc335bf8c4b34b38bc09f400f17c, type: 3}
      propertyPath: m_LocalRotation.y
      value: -0
      objectReference: {fileID: 0}
    - target: {fileID: 8347933310647304346, guid: 20b9bc335bf8c4b34b38bc09f400f17c, type: 3}
      propertyPath: m_LocalRotation.z
      value: -0
      objectReference: {fileID: 0}
    - target: {fileID: 8347933310647304346, guid: 20b9bc335bf8c4b34b38bc09f400f17c, type: 3}
      propertyPath: m_AnchoredPosition.x
      value: 0
      objectReference: {fileID: 0}
    - target: {fileID: 8347933310647304346, guid: 20b9bc335bf8c4b34b38bc09f400f17c, type: 3}
      propertyPath: m_AnchoredPosition.y
      value: 0
      objectReference: {fileID: 0}
    - target: {fileID: 8347933310647304346, guid: 20b9bc335bf8c4b34b38bc09f400f17c, type: 3}
      propertyPath: m_LocalEulerAnglesHint.x
      value: 0
      objectReference: {fileID: 0}
    - target: {fileID: 8347933310647304346, guid: 20b9bc335bf8c4b34b38bc09f400f17c, type: 3}
      propertyPath: m_LocalEulerAnglesHint.y
      value: 0
      objectReference: {fileID: 0}
    - target: {fileID: 8347933310647304346, guid: 20b9bc335bf8c4b34b38bc09f400f17c, type: 3}
      propertyPath: m_LocalEulerAnglesHint.z
      value: 0
      objectReference: {fileID: 0}
    - target: {fileID: 9123702862749501608, guid: 20b9bc335bf8c4b34b38bc09f400f17c, type: 3}
      propertyPath: m_Name
      value: 1 (7)
      objectReference: {fileID: 0}
    - target: {fileID: 9207274075573484653, guid: 20b9bc335bf8c4b34b38bc09f400f17c, type: 3}
      propertyPath: currentCell.cellIndex
      value: 35
      objectReference: {fileID: 0}
    m_RemovedComponents: []
  m_SourcePrefab: {fileID: 100100000, guid: 20b9bc335bf8c4b34b38bc09f400f17c, type: 3}
--- !u!224 &1276137348 stripped
RectTransform:
  m_CorrespondingSourceObject: {fileID: 8347933310647304346, guid: 20b9bc335bf8c4b34b38bc09f400f17c, type: 3}
  m_PrefabInstance: {fileID: 716918465}
  m_PrefabAsset: {fileID: 0}
--- !u!224 &1422792267 stripped
RectTransform:
  m_CorrespondingSourceObject: {fileID: 8347933310647304346, guid: 20b9bc335bf8c4b34b38bc09f400f17c, type: 3}
  m_PrefabInstance: {fileID: 605428976}
  m_PrefabAsset: {fileID: 0}
--- !u!1001 &1464086750
PrefabInstance:
  m_ObjectHideFlags: 0
  serializedVersion: 2
  m_Modification:
    m_TransformParent: {fileID: 1929805885}
    m_Modifications:
    - target: {fileID: 1806183069247344042, guid: 20b9bc335bf8c4b34b38bc09f400f17c, type: 3}
      propertyPath: m_Text
      value: 36
      objectReference: {fileID: 0}
    - target: {fileID: 8347933310647304346, guid: 20b9bc335bf8c4b34b38bc09f400f17c, type: 3}
      propertyPath: m_Pivot.x
      value: 0.5
      objectReference: {fileID: 0}
    - target: {fileID: 8347933310647304346, guid: 20b9bc335bf8c4b34b38bc09f400f17c, type: 3}
      propertyPath: m_Pivot.y
      value: 0.5
      objectReference: {fileID: 0}
    - target: {fileID: 8347933310647304346, guid: 20b9bc335bf8c4b34b38bc09f400f17c, type: 3}
      propertyPath: m_RootOrder
      value: 8
      objectReference: {fileID: 0}
    - target: {fileID: 8347933310647304346, guid: 20b9bc335bf8c4b34b38bc09f400f17c, type: 3}
      propertyPath: m_AnchorMax.x
      value: 0
      objectReference: {fileID: 0}
    - target: {fileID: 8347933310647304346, guid: 20b9bc335bf8c4b34b38bc09f400f17c, type: 3}
      propertyPath: m_AnchorMax.y
      value: 0
      objectReference: {fileID: 0}
    - target: {fileID: 8347933310647304346, guid: 20b9bc335bf8c4b34b38bc09f400f17c, type: 3}
      propertyPath: m_AnchorMin.x
      value: 0
      objectReference: {fileID: 0}
    - target: {fileID: 8347933310647304346, guid: 20b9bc335bf8c4b34b38bc09f400f17c, type: 3}
      propertyPath: m_AnchorMin.y
      value: 0
      objectReference: {fileID: 0}
    - target: {fileID: 8347933310647304346, guid: 20b9bc335bf8c4b34b38bc09f400f17c, type: 3}
      propertyPath: m_SizeDelta.x
      value: 0
      objectReference: {fileID: 0}
    - target: {fileID: 8347933310647304346, guid: 20b9bc335bf8c4b34b38bc09f400f17c, type: 3}
      propertyPath: m_SizeDelta.y
      value: 0
      objectReference: {fileID: 0}
    - target: {fileID: 8347933310647304346, guid: 20b9bc335bf8c4b34b38bc09f400f17c, type: 3}
      propertyPath: m_LocalPosition.x
      value: 0
      objectReference: {fileID: 0}
    - target: {fileID: 8347933310647304346, guid: 20b9bc335bf8c4b34b38bc09f400f17c, type: 3}
      propertyPath: m_LocalPosition.y
      value: 0
      objectReference: {fileID: 0}
    - target: {fileID: 8347933310647304346, guid: 20b9bc335bf8c4b34b38bc09f400f17c, type: 3}
      propertyPath: m_LocalPosition.z
      value: 0
      objectReference: {fileID: 0}
    - target: {fileID: 8347933310647304346, guid: 20b9bc335bf8c4b34b38bc09f400f17c, type: 3}
      propertyPath: m_LocalRotation.w
      value: 1
      objectReference: {fileID: 0}
    - target: {fileID: 8347933310647304346, guid: 20b9bc335bf8c4b34b38bc09f400f17c, type: 3}
      propertyPath: m_LocalRotation.x
      value: -0
      objectReference: {fileID: 0}
    - target: {fileID: 8347933310647304346, guid: 20b9bc335bf8c4b34b38bc09f400f17c, type: 3}
      propertyPath: m_LocalRotation.y
      value: -0
      objectReference: {fileID: 0}
    - target: {fileID: 8347933310647304346, guid: 20b9bc335bf8c4b34b38bc09f400f17c, type: 3}
      propertyPath: m_LocalRotation.z
      value: -0
      objectReference: {fileID: 0}
    - target: {fileID: 8347933310647304346, guid: 20b9bc335bf8c4b34b38bc09f400f17c, type: 3}
      propertyPath: m_AnchoredPosition.x
      value: 0
      objectReference: {fileID: 0}
    - target: {fileID: 8347933310647304346, guid: 20b9bc335bf8c4b34b38bc09f400f17c, type: 3}
      propertyPath: m_AnchoredPosition.y
      value: 0
      objectReference: {fileID: 0}
    - target: {fileID: 8347933310647304346, guid: 20b9bc335bf8c4b34b38bc09f400f17c, type: 3}
      propertyPath: m_LocalEulerAnglesHint.x
      value: 0
      objectReference: {fileID: 0}
    - target: {fileID: 8347933310647304346, guid: 20b9bc335bf8c4b34b38bc09f400f17c, type: 3}
      propertyPath: m_LocalEulerAnglesHint.y
      value: 0
      objectReference: {fileID: 0}
    - target: {fileID: 8347933310647304346, guid: 20b9bc335bf8c4b34b38bc09f400f17c, type: 3}
      propertyPath: m_LocalEulerAnglesHint.z
      value: 0
      objectReference: {fileID: 0}
    - target: {fileID: 9123702862749501608, guid: 20b9bc335bf8c4b34b38bc09f400f17c, type: 3}
      propertyPath: m_Name
      value: 1 (8)
      objectReference: {fileID: 0}
    - target: {fileID: 9207274075573484653, guid: 20b9bc335bf8c4b34b38bc09f400f17c, type: 3}
      propertyPath: currentCell.cellIndex
      value: 36
      objectReference: {fileID: 0}
    m_RemovedComponents: []
  m_SourcePrefab: {fileID: 100100000, guid: 20b9bc335bf8c4b34b38bc09f400f17c, type: 3}
--- !u!1001 &1498230104
PrefabInstance:
  m_ObjectHideFlags: 0
  serializedVersion: 2
  m_Modification:
    m_TransformParent: {fileID: 1929805885}
    m_Modifications:
    - target: {fileID: 1806183069247344042, guid: 20b9bc335bf8c4b34b38bc09f400f17c, type: 3}
      propertyPath: m_Text
      value: 32
      objectReference: {fileID: 0}
    - target: {fileID: 8347933310647304346, guid: 20b9bc335bf8c4b34b38bc09f400f17c, type: 3}
      propertyPath: m_Pivot.x
      value: 0.5
      objectReference: {fileID: 0}
    - target: {fileID: 8347933310647304346, guid: 20b9bc335bf8c4b34b38bc09f400f17c, type: 3}
      propertyPath: m_Pivot.y
      value: 0.5
      objectReference: {fileID: 0}
    - target: {fileID: 8347933310647304346, guid: 20b9bc335bf8c4b34b38bc09f400f17c, type: 3}
      propertyPath: m_RootOrder
      value: 4
      objectReference: {fileID: 0}
    - target: {fileID: 8347933310647304346, guid: 20b9bc335bf8c4b34b38bc09f400f17c, type: 3}
      propertyPath: m_AnchorMax.x
      value: 0
      objectReference: {fileID: 0}
    - target: {fileID: 8347933310647304346, guid: 20b9bc335bf8c4b34b38bc09f400f17c, type: 3}
      propertyPath: m_AnchorMax.y
      value: 0
      objectReference: {fileID: 0}
    - target: {fileID: 8347933310647304346, guid: 20b9bc335bf8c4b34b38bc09f400f17c, type: 3}
      propertyPath: m_AnchorMin.x
      value: 0
      objectReference: {fileID: 0}
    - target: {fileID: 8347933310647304346, guid: 20b9bc335bf8c4b34b38bc09f400f17c, type: 3}
      propertyPath: m_AnchorMin.y
      value: 0
      objectReference: {fileID: 0}
    - target: {fileID: 8347933310647304346, guid: 20b9bc335bf8c4b34b38bc09f400f17c, type: 3}
      propertyPath: m_SizeDelta.x
      value: 0
      objectReference: {fileID: 0}
    - target: {fileID: 8347933310647304346, guid: 20b9bc335bf8c4b34b38bc09f400f17c, type: 3}
      propertyPath: m_SizeDelta.y
      value: 0
      objectReference: {fileID: 0}
    - target: {fileID: 8347933310647304346, guid: 20b9bc335bf8c4b34b38bc09f400f17c, type: 3}
      propertyPath: m_LocalPosition.x
      value: 0
      objectReference: {fileID: 0}
    - target: {fileID: 8347933310647304346, guid: 20b9bc335bf8c4b34b38bc09f400f17c, type: 3}
      propertyPath: m_LocalPosition.y
      value: 0
      objectReference: {fileID: 0}
    - target: {fileID: 8347933310647304346, guid: 20b9bc335bf8c4b34b38bc09f400f17c, type: 3}
      propertyPath: m_LocalPosition.z
      value: 0
      objectReference: {fileID: 0}
    - target: {fileID: 8347933310647304346, guid: 20b9bc335bf8c4b34b38bc09f400f17c, type: 3}
      propertyPath: m_LocalRotation.w
      value: 1
      objectReference: {fileID: 0}
    - target: {fileID: 8347933310647304346, guid: 20b9bc335bf8c4b34b38bc09f400f17c, type: 3}
      propertyPath: m_LocalRotation.x
      value: -0
      objectReference: {fileID: 0}
    - target: {fileID: 8347933310647304346, guid: 20b9bc335bf8c4b34b38bc09f400f17c, type: 3}
      propertyPath: m_LocalRotation.y
      value: -0
      objectReference: {fileID: 0}
    - target: {fileID: 8347933310647304346, guid: 20b9bc335bf8c4b34b38bc09f400f17c, type: 3}
      propertyPath: m_LocalRotation.z
      value: -0
      objectReference: {fileID: 0}
    - target: {fileID: 8347933310647304346, guid: 20b9bc335bf8c4b34b38bc09f400f17c, type: 3}
      propertyPath: m_AnchoredPosition.x
      value: 0
      objectReference: {fileID: 0}
    - target: {fileID: 8347933310647304346, guid: 20b9bc335bf8c4b34b38bc09f400f17c, type: 3}
      propertyPath: m_AnchoredPosition.y
      value: 0
      objectReference: {fileID: 0}
    - target: {fileID: 8347933310647304346, guid: 20b9bc335bf8c4b34b38bc09f400f17c, type: 3}
      propertyPath: m_LocalEulerAnglesHint.x
      value: 0
      objectReference: {fileID: 0}
    - target: {fileID: 8347933310647304346, guid: 20b9bc335bf8c4b34b38bc09f400f17c, type: 3}
      propertyPath: m_LocalEulerAnglesHint.y
      value: 0
      objectReference: {fileID: 0}
    - target: {fileID: 8347933310647304346, guid: 20b9bc335bf8c4b34b38bc09f400f17c, type: 3}
      propertyPath: m_LocalEulerAnglesHint.z
      value: 0
      objectReference: {fileID: 0}
    - target: {fileID: 9123702862749501608, guid: 20b9bc335bf8c4b34b38bc09f400f17c, type: 3}
      propertyPath: m_Name
      value: 1 (4)
      objectReference: {fileID: 0}
    - target: {fileID: 9207274075573484653, guid: 20b9bc335bf8c4b34b38bc09f400f17c, type: 3}
      propertyPath: currentCell.cellIndex
      value: 32
      objectReference: {fileID: 0}
    m_RemovedComponents: []
  m_SourcePrefab: {fileID: 100100000, guid: 20b9bc335bf8c4b34b38bc09f400f17c, type: 3}
--- !u!224 &1508066832 stripped
RectTransform:
  m_CorrespondingSourceObject: {fileID: 8347933310647304346, guid: 20b9bc335bf8c4b34b38bc09f400f17c, type: 3}
  m_PrefabInstance: {fileID: 920460623}
  m_PrefabAsset: {fileID: 0}
--- !u!1 &1519749446
GameObject:
  m_ObjectHideFlags: 0
  m_CorrespondingSourceObject: {fileID: 0}
  m_PrefabInstance: {fileID: 0}
  m_PrefabAsset: {fileID: 0}
  serializedVersion: 6
  m_Component:
  - component: {fileID: 1519749447}
  - component: {fileID: 1519749449}
  - component: {fileID: 1519749448}
  m_Layer: 5
  m_Name: Feedback
  m_TagString: Untagged
  m_Icon: {fileID: 0}
  m_NavMeshLayer: 0
  m_StaticEditorFlags: 0
  m_IsActive: 1
--- !u!224 &1519749447
RectTransform:
  m_ObjectHideFlags: 0
  m_CorrespondingSourceObject: {fileID: 0}
  m_PrefabInstance: {fileID: 0}
  m_PrefabAsset: {fileID: 0}
  m_GameObject: {fileID: 1519749446}
  m_LocalRotation: {x: 0, y: 0, z: 0, w: 1}
  m_LocalPosition: {x: 0, y: 0, z: 0}
  m_LocalScale: {x: 1, y: 1, z: 1}
  m_Children: []
  m_Father: {fileID: 583992826}
  m_RootOrder: 1
  m_LocalEulerAnglesHint: {x: 0, y: 0, z: 0}
  m_AnchorMin: {x: 0.5, y: 1}
  m_AnchorMax: {x: 0.5, y: 1}
  m_AnchoredPosition: {x: 0, y: -100}
  m_SizeDelta: {x: 160, y: 30}
  m_Pivot: {x: 0.5, y: 0.5}
--- !u!114 &1519749448
MonoBehaviour:
  m_ObjectHideFlags: 0
  m_CorrespondingSourceObject: {fileID: 0}
  m_PrefabInstance: {fileID: 0}
  m_PrefabAsset: {fileID: 0}
  m_GameObject: {fileID: 1519749446}
  m_Enabled: 1
  m_EditorHideFlags: 0
  m_Script: {fileID: 11500000, guid: 5f7201a12d95ffc409449d95f23cf332, type: 3}
  m_Name: 
  m_EditorClassIdentifier: 
  m_Material: {fileID: 0}
  m_Color: {r: 0.19607843, g: 0.19607843, b: 0.19607843, a: 1}
  m_RaycastTarget: 1
  m_RaycastPadding: {x: 0, y: 0, z: 0, w: 0}
  m_Maskable: 1
  m_OnCullStateChanged:
    m_PersistentCalls:
      m_Calls: []
  m_FontData:
    m_Font: {fileID: 10102, guid: 0000000000000000e000000000000000, type: 0}
    m_FontSize: 14
    m_FontStyle: 0
    m_BestFit: 0
    m_MinSize: 10
    m_MaxSize: 40
    m_Alignment: 4
    m_AlignByGeometry: 0
    m_RichText: 1
    m_HorizontalOverflow: 0
    m_VerticalOverflow: 0
    m_LineSpacing: 1
  m_Text: Draw your pattern
--- !u!222 &1519749449
CanvasRenderer:
  m_ObjectHideFlags: 0
  m_CorrespondingSourceObject: {fileID: 0}
  m_PrefabInstance: {fileID: 0}
  m_PrefabAsset: {fileID: 0}
  m_GameObject: {fileID: 1519749446}
  m_CullTransparentMesh: 1
--- !u!224 &1553773167 stripped
RectTransform:
  m_CorrespondingSourceObject: {fileID: 8347933310647304346, guid: 20b9bc335bf8c4b34b38bc09f400f17c, type: 3}
  m_PrefabInstance: {fileID: 1607329214}
  m_PrefabAsset: {fileID: 0}
--- !u!1001 &1607329214
PrefabInstance:
  m_ObjectHideFlags: 0
  serializedVersion: 2
  m_Modification:
    m_TransformParent: {fileID: 1929805885}
    m_Modifications:
    - target: {fileID: 1806183069247344042, guid: 20b9bc335bf8c4b34b38bc09f400f17c, type: 3}
      propertyPath: m_Text
      value: 34
      objectReference: {fileID: 0}
    - target: {fileID: 8347933310647304346, guid: 20b9bc335bf8c4b34b38bc09f400f17c, type: 3}
      propertyPath: m_Pivot.x
      value: 0.5
      objectReference: {fileID: 0}
    - target: {fileID: 8347933310647304346, guid: 20b9bc335bf8c4b34b38bc09f400f17c, type: 3}
      propertyPath: m_Pivot.y
      value: 0.5
      objectReference: {fileID: 0}
    - target: {fileID: 8347933310647304346, guid: 20b9bc335bf8c4b34b38bc09f400f17c, type: 3}
      propertyPath: m_RootOrder
      value: 6
      objectReference: {fileID: 0}
    - target: {fileID: 8347933310647304346, guid: 20b9bc335bf8c4b34b38bc09f400f17c, type: 3}
      propertyPath: m_AnchorMax.x
      value: 0
      objectReference: {fileID: 0}
    - target: {fileID: 8347933310647304346, guid: 20b9bc335bf8c4b34b38bc09f400f17c, type: 3}
      propertyPath: m_AnchorMax.y
      value: 0
      objectReference: {fileID: 0}
    - target: {fileID: 8347933310647304346, guid: 20b9bc335bf8c4b34b38bc09f400f17c, type: 3}
      propertyPath: m_AnchorMin.x
      value: 0
      objectReference: {fileID: 0}
    - target: {fileID: 8347933310647304346, guid: 20b9bc335bf8c4b34b38bc09f400f17c, type: 3}
      propertyPath: m_AnchorMin.y
      value: 0
      objectReference: {fileID: 0}
    - target: {fileID: 8347933310647304346, guid: 20b9bc335bf8c4b34b38bc09f400f17c, type: 3}
      propertyPath: m_SizeDelta.x
      value: 0
      objectReference: {fileID: 0}
    - target: {fileID: 8347933310647304346, guid: 20b9bc335bf8c4b34b38bc09f400f17c, type: 3}
      propertyPath: m_SizeDelta.y
      value: 0
      objectReference: {fileID: 0}
    - target: {fileID: 8347933310647304346, guid: 20b9bc335bf8c4b34b38bc09f400f17c, type: 3}
      propertyPath: m_LocalPosition.x
      value: 0
      objectReference: {fileID: 0}
    - target: {fileID: 8347933310647304346, guid: 20b9bc335bf8c4b34b38bc09f400f17c, type: 3}
      propertyPath: m_LocalPosition.y
      value: 0
      objectReference: {fileID: 0}
    - target: {fileID: 8347933310647304346, guid: 20b9bc335bf8c4b34b38bc09f400f17c, type: 3}
      propertyPath: m_LocalPosition.z
      value: 0
      objectReference: {fileID: 0}
    - target: {fileID: 8347933310647304346, guid: 20b9bc335bf8c4b34b38bc09f400f17c, type: 3}
      propertyPath: m_LocalRotation.w
      value: 1
      objectReference: {fileID: 0}
    - target: {fileID: 8347933310647304346, guid: 20b9bc335bf8c4b34b38bc09f400f17c, type: 3}
      propertyPath: m_LocalRotation.x
      value: -0
      objectReference: {fileID: 0}
    - target: {fileID: 8347933310647304346, guid: 20b9bc335bf8c4b34b38bc09f400f17c, type: 3}
      propertyPath: m_LocalRotation.y
      value: -0
      objectReference: {fileID: 0}
    - target: {fileID: 8347933310647304346, guid: 20b9bc335bf8c4b34b38bc09f400f17c, type: 3}
      propertyPath: m_LocalRotation.z
      value: -0
      objectReference: {fileID: 0}
    - target: {fileID: 8347933310647304346, guid: 20b9bc335bf8c4b34b38bc09f400f17c, type: 3}
      propertyPath: m_AnchoredPosition.x
      value: 0
      objectReference: {fileID: 0}
    - target: {fileID: 8347933310647304346, guid: 20b9bc335bf8c4b34b38bc09f400f17c, type: 3}
      propertyPath: m_AnchoredPosition.y
      value: 0
      objectReference: {fileID: 0}
    - target: {fileID: 8347933310647304346, guid: 20b9bc335bf8c4b34b38bc09f400f17c, type: 3}
      propertyPath: m_LocalEulerAnglesHint.x
      value: 0
      objectReference: {fileID: 0}
    - target: {fileID: 8347933310647304346, guid: 20b9bc335bf8c4b34b38bc09f400f17c, type: 3}
      propertyPath: m_LocalEulerAnglesHint.y
      value: 0
      objectReference: {fileID: 0}
    - target: {fileID: 8347933310647304346, guid: 20b9bc335bf8c4b34b38bc09f400f17c, type: 3}
      propertyPath: m_LocalEulerAnglesHint.z
      value: 0
      objectReference: {fileID: 0}
    - target: {fileID: 9123702862749501608, guid: 20b9bc335bf8c4b34b38bc09f400f17c, type: 3}
      propertyPath: m_Name
      value: 1 (6)
      objectReference: {fileID: 0}
    - target: {fileID: 9207274075573484653, guid: 20b9bc335bf8c4b34b38bc09f400f17c, type: 3}
      propertyPath: currentCell.cellIndex
      value: 34
      objectReference: {fileID: 0}
    m_RemovedComponents: []
  m_SourcePrefab: {fileID: 100100000, guid: 20b9bc335bf8c4b34b38bc09f400f17c, type: 3}
--- !u!1001 &1642984202
PrefabInstance:
  m_ObjectHideFlags: 0
  serializedVersion: 2
  m_Modification:
    m_TransformParent: {fileID: 1929805885}
    m_Modifications:
    - target: {fileID: 1806183069247344042, guid: 20b9bc335bf8c4b34b38bc09f400f17c, type: 3}
      propertyPath: m_Text
      value: 37
      objectReference: {fileID: 0}
    - target: {fileID: 8347933310647304346, guid: 20b9bc335bf8c4b34b38bc09f400f17c, type: 3}
      propertyPath: m_Pivot.x
      value: 0.5
      objectReference: {fileID: 0}
    - target: {fileID: 8347933310647304346, guid: 20b9bc335bf8c4b34b38bc09f400f17c, type: 3}
      propertyPath: m_Pivot.y
      value: 0.5
      objectReference: {fileID: 0}
    - target: {fileID: 8347933310647304346, guid: 20b9bc335bf8c4b34b38bc09f400f17c, type: 3}
      propertyPath: m_RootOrder
      value: 9
      objectReference: {fileID: 0}
    - target: {fileID: 8347933310647304346, guid: 20b9bc335bf8c4b34b38bc09f400f17c, type: 3}
      propertyPath: m_AnchorMax.x
      value: 0
      objectReference: {fileID: 0}
    - target: {fileID: 8347933310647304346, guid: 20b9bc335bf8c4b34b38bc09f400f17c, type: 3}
      propertyPath: m_AnchorMax.y
      value: 0
      objectReference: {fileID: 0}
    - target: {fileID: 8347933310647304346, guid: 20b9bc335bf8c4b34b38bc09f400f17c, type: 3}
      propertyPath: m_AnchorMin.x
      value: 0
      objectReference: {fileID: 0}
    - target: {fileID: 8347933310647304346, guid: 20b9bc335bf8c4b34b38bc09f400f17c, type: 3}
      propertyPath: m_AnchorMin.y
      value: 0
      objectReference: {fileID: 0}
    - target: {fileID: 8347933310647304346, guid: 20b9bc335bf8c4b34b38bc09f400f17c, type: 3}
      propertyPath: m_SizeDelta.x
      value: 0
      objectReference: {fileID: 0}
    - target: {fileID: 8347933310647304346, guid: 20b9bc335bf8c4b34b38bc09f400f17c, type: 3}
      propertyPath: m_SizeDelta.y
      value: 0
      objectReference: {fileID: 0}
    - target: {fileID: 8347933310647304346, guid: 20b9bc335bf8c4b34b38bc09f400f17c, type: 3}
      propertyPath: m_LocalPosition.x
      value: 0
      objectReference: {fileID: 0}
    - target: {fileID: 8347933310647304346, guid: 20b9bc335bf8c4b34b38bc09f400f17c, type: 3}
      propertyPath: m_LocalPosition.y
      value: 0
      objectReference: {fileID: 0}
    - target: {fileID: 8347933310647304346, guid: 20b9bc335bf8c4b34b38bc09f400f17c, type: 3}
      propertyPath: m_LocalPosition.z
      value: 0
      objectReference: {fileID: 0}
    - target: {fileID: 8347933310647304346, guid: 20b9bc335bf8c4b34b38bc09f400f17c, type: 3}
      propertyPath: m_LocalRotation.w
      value: 1
      objectReference: {fileID: 0}
    - target: {fileID: 8347933310647304346, guid: 20b9bc335bf8c4b34b38bc09f400f17c, type: 3}
      propertyPath: m_LocalRotation.x
      value: -0
      objectReference: {fileID: 0}
    - target: {fileID: 8347933310647304346, guid: 20b9bc335bf8c4b34b38bc09f400f17c, type: 3}
      propertyPath: m_LocalRotation.y
      value: -0
      objectReference: {fileID: 0}
    - target: {fileID: 8347933310647304346, guid: 20b9bc335bf8c4b34b38bc09f400f17c, type: 3}
      propertyPath: m_LocalRotation.z
      value: -0
      objectReference: {fileID: 0}
    - target: {fileID: 8347933310647304346, guid: 20b9bc335bf8c4b34b38bc09f400f17c, type: 3}
      propertyPath: m_AnchoredPosition.x
      value: 0
      objectReference: {fileID: 0}
    - target: {fileID: 8347933310647304346, guid: 20b9bc335bf8c4b34b38bc09f400f17c, type: 3}
      propertyPath: m_AnchoredPosition.y
      value: 0
      objectReference: {fileID: 0}
    - target: {fileID: 8347933310647304346, guid: 20b9bc335bf8c4b34b38bc09f400f17c, type: 3}
      propertyPath: m_LocalEulerAnglesHint.x
      value: 0
      objectReference: {fileID: 0}
    - target: {fileID: 8347933310647304346, guid: 20b9bc335bf8c4b34b38bc09f400f17c, type: 3}
      propertyPath: m_LocalEulerAnglesHint.y
      value: 0
      objectReference: {fileID: 0}
    - target: {fileID: 8347933310647304346, guid: 20b9bc335bf8c4b34b38bc09f400f17c, type: 3}
      propertyPath: m_LocalEulerAnglesHint.z
      value: 0
      objectReference: {fileID: 0}
    - target: {fileID: 9123702862749501608, guid: 20b9bc335bf8c4b34b38bc09f400f17c, type: 3}
      propertyPath: m_Name
      value: 1 (9)
      objectReference: {fileID: 0}
    - target: {fileID: 9207274075573484653, guid: 20b9bc335bf8c4b34b38bc09f400f17c, type: 3}
      propertyPath: currentCell.cellIndex
      value: 37
      objectReference: {fileID: 0}
    m_RemovedComponents: []
  m_SourcePrefab: {fileID: 100100000, guid: 20b9bc335bf8c4b34b38bc09f400f17c, type: 3}
--- !u!224 &1837366715 stripped
RectTransform:
  m_CorrespondingSourceObject: {fileID: 8347933310647304346, guid: 20b9bc335bf8c4b34b38bc09f400f17c, type: 3}
  m_PrefabInstance: {fileID: 1260925776}
  m_PrefabAsset: {fileID: 0}
--- !u!224 &1845826326 stripped
RectTransform:
  m_CorrespondingSourceObject: {fileID: 8347933310647304346, guid: 20b9bc335bf8c4b34b38bc09f400f17c, type: 3}
  m_PrefabInstance: {fileID: 305783181}
  m_PrefabAsset: {fileID: 0}
--- !u!1 &1929805884
GameObject:
  m_ObjectHideFlags: 0
  m_CorrespondingSourceObject: {fileID: 0}
  m_PrefabInstance: {fileID: 0}
  m_PrefabAsset: {fileID: 0}
  serializedVersion: 6
  m_Component:
  - component: {fileID: 1929805885}
  - component: {fileID: 1929805886}
  - component: {fileID: 1929805887}
  - component: {fileID: 1929805889}
  - component: {fileID: 1929805890}
  - component: {fileID: 1929805888}
  m_Layer: 5
  m_Name: Grid
  m_TagString: CellManager
  m_Icon: {fileID: 0}
  m_NavMeshLayer: 0
  m_StaticEditorFlags: 0
  m_IsActive: 1
--- !u!224 &1929805885
RectTransform:
  m_ObjectHideFlags: 0
  m_CorrespondingSourceObject: {fileID: 0}
  m_PrefabInstance: {fileID: 0}
  m_PrefabAsset: {fileID: 0}
  m_GameObject: {fileID: 1929805884}
  m_LocalRotation: {x: 0, y: 0, z: 0, w: 1}
  m_LocalPosition: {x: 0, y: 0, z: 0}
  m_LocalScale: {x: 1, y: 1, z: 1}
  m_Children:
  - {fileID: 278723066}
  - {fileID: 1845826326}
  - {fileID: 1422792267}
  - {fileID: 751044525}
  - {fileID: 1242032399}
  - {fileID: 557745162}
  - {fileID: 1553773167}
  - {fileID: 1837366715}
  - {fileID: 530109956}
  - {fileID: 803084414}
  - {fileID: 1508066832}
  - {fileID: 1276137348}
  m_Father: {fileID: 583992826}
  m_RootOrder: 2
  m_LocalEulerAnglesHint: {x: 0, y: 0, z: 0}
  m_AnchorMin: {x: 0.5, y: 0.5}
  m_AnchorMax: {x: 0.5, y: 0.5}
  m_AnchoredPosition: {x: 0, y: 0}
  m_SizeDelta: {x: 314.2432, y: 200}
  m_Pivot: {x: 0.5, y: 0.5}
--- !u!114 &1929805886
MonoBehaviour:
  m_ObjectHideFlags: 0
  m_CorrespondingSourceObject: {fileID: 0}
  m_PrefabInstance: {fileID: 0}
  m_PrefabAsset: {fileID: 0}
  m_GameObject: {fileID: 1929805884}
  m_Enabled: 1
  m_EditorHideFlags: 0
  m_Script: {fileID: 11500000, guid: 8a8695521f0d02e499659fee002a26c2, type: 3}
  m_Name: 
  m_EditorClassIdentifier: 
  m_Padding:
    m_Left: 0
    m_Right: 0
    m_Top: 0
    m_Bottom: 0
  m_ChildAlignment: 1
  m_StartCorner: 0
  m_StartAxis: 0
  m_CellSize: {x: 50, y: 50}
  m_Spacing: {x: 20, y: 20}
  m_Constraint: 1
  m_ConstraintCount: 3
--- !u!114 &1929805887
MonoBehaviour:
  m_ObjectHideFlags: 0
  m_CorrespondingSourceObject: {fileID: 0}
  m_PrefabInstance: {fileID: 0}
  m_PrefabAsset: {fileID: 0}
  m_GameObject: {fileID: 1929805884}
  m_Enabled: 1
  m_EditorHideFlags: 0
  m_Script: {fileID: 11500000, guid: 42c9bd69a5b124b0fb5a14064bb1fba4, type: 3}
  m_Name: 
  m_EditorClassIdentifier: 
  theResulter: {fileID: 1929805889}
  ethalon:
  - cellIndex: 28
    cellObject: {fileID: 0}
  - cellIndex: 32
    cellObject: {fileID: 0}
  - cellIndex: 36
    cellObject: {fileID: 0}
  cellHolder: {fileID: 1929805884}
  cells:
  - cellIndex: 28
    cellObject: {fileID: 0}
  - cellIndex: 29
    cellObject: {fileID: 0}
  - cellIndex: 30
    cellObject: {fileID: 0}
  - cellIndex: 31
    cellObject: {fileID: 0}
  - cellIndex: 32
    cellObject: {fileID: 0}
  - cellIndex: 33
    cellObject: {fileID: 0}
  - cellIndex: 34
    cellObject: {fileID: 0}
  - cellIndex: 35
    cellObject: {fileID: 0}
  - cellIndex: 36
    cellObject: {fileID: 0}
  - cellIndex: 37
    cellObject: {fileID: 0}
  - cellIndex: 38
    cellObject: {fileID: 0}
  - cellIndex: 39
    cellObject: {fileID: 0}
  putinCells: 0
--- !u!114 &1929805888
MonoBehaviour:
  m_ObjectHideFlags: 0
  m_CorrespondingSourceObject: {fileID: 0}
  m_PrefabInstance: {fileID: 0}
  m_PrefabAsset: {fileID: 0}
  m_GameObject: {fileID: 1929805884}
  m_Enabled: 1
  m_EditorHideFlags: 0
  m_Script: {fileID: 11500000, guid: dbf28c88b15384a458bfbabb4418425a, type: 3}
  m_Name: 
  m_EditorClassIdentifier: 
--- !u!114 &1929805889
MonoBehaviour:
  m_ObjectHideFlags: 0
  m_CorrespondingSourceObject: {fileID: 0}
  m_PrefabInstance: {fileID: 0}
  m_PrefabAsset: {fileID: 0}
  m_GameObject: {fileID: 1929805884}
  m_Enabled: 1
  m_EditorHideFlags: 0
  m_Script: {fileID: 11500000, guid: d9d38523ff5d24abab6e5504ec5d026c, type: 3}
  m_Name: 
  m_EditorClassIdentifier: 
  theResultText: {fileID: 1519749448}
  granted:
    resultText: Access Granted
    resultColor: {r: 0.20797578, g: 0.990566, b: 0.2009167, a: 1}
  denied:
    resultText: Access Denied
    resultColor: {r: 0.6320754, g: 0, b: 0, a: 1}
--- !u!120 &1929805890
LineRenderer:
  m_ObjectHideFlags: 0
  m_CorrespondingSourceObject: {fileID: 0}
  m_PrefabInstance: {fileID: 0}
  m_PrefabAsset: {fileID: 0}
  m_GameObject: {fileID: 1929805884}
  m_Enabled: 1
  m_CastShadows: 1
  m_ReceiveShadows: 1
  m_DynamicOccludee: 1
  m_MotionVectors: 0
  m_LightProbeUsage: 0
  m_ReflectionProbeUsage: 0
  m_RayTracingMode: 0
  m_RayTraceProcedural: 0
  m_RenderingLayerMask: 1
  m_RendererPriority: 0
  m_Materials:
  - {fileID: 2100000, guid: 96160a731a89b4db4b29c43facc3eceb, type: 2}
  m_StaticBatchInfo:
    firstSubMesh: 0
    subMeshCount: 0
  m_StaticBatchRoot: {fileID: 0}
  m_ProbeAnchor: {fileID: 0}
  m_LightProbeVolumeOverride: {fileID: 0}
  m_ScaleInLightmap: 1
  m_ReceiveGI: 1
  m_PreserveUVs: 0
  m_IgnoreNormalsForChartDetection: 0
  m_ImportantGI: 0
  m_StitchLightmapSeams: 1
  m_SelectedEditorRenderState: 3
  m_MinimumChartSize: 4
  m_AutoUVMaxDistance: 0.5
  m_AutoUVMaxAngle: 89
  m_LightmapParameters: {fileID: 0}
  m_SortingLayerID: 0
  m_SortingLayer: 0
  m_SortingOrder: 0
  m_Positions: []
  m_Parameters:
    serializedVersion: 3
    widthMultiplier: 1
    widthCurve:
      serializedVersion: 2
      m_Curve:
      - serializedVersion: 3
        time: 0
        value: 0.4384613
        inSlope: 0
        outSlope: 0
        tangentMode: 0
        weightedMode: 0
        inWeight: 0.33333334
        outWeight: 0.33333334
      m_PreInfinity: 2
      m_PostInfinity: 2
      m_RotationOrder: 4
    colorGradient:
      serializedVersion: 2
      key0: {r: 1, g: 0.23113209, b: 0.23113209, a: 1}
      key1: {r: 0, g: 1, b: 0.12531853, a: 1}
      key2: {r: 0, g: 0, b: 0, a: 0}
      key3: {r: 0, g: 0, b: 0, a: 0}
      key4: {r: 0, g: 0, b: 0, a: 0}
      key5: {r: 0, g: 0, b: 0, a: 0}
      key6: {r: 0, g: 0, b: 0, a: 0}
      key7: {r: 0, g: 0, b: 0, a: 0}
      ctime0: 0
      ctime1: 65535
      ctime2: 0
      ctime3: 0
      ctime4: 0
      ctime5: 0
      ctime6: 0
      ctime7: 0
      atime0: 0
      atime1: 65535
      atime2: 0
      atime3: 0
      atime4: 0
      atime5: 0
      atime6: 0
      atime7: 0
      m_Mode: 0
      m_NumColorKeys: 2
      m_NumAlphaKeys: 2
    numCornerVertices: 0
    numCapVertices: 0
    alignment: 0
    textureMode: 0
    shadowBias: 0.5
    generateLightingData: 0
  m_UseWorldSpace: 1
  m_Loop: 0
--- !u!1 &2058545414
GameObject:
  m_ObjectHideFlags: 0
  m_CorrespondingSourceObject: {fileID: 0}
  m_PrefabInstance: {fileID: 0}
  m_PrefabAsset: {fileID: 0}
  serializedVersion: 6
  m_Component:
  - component: {fileID: 2058545415}
  - component: {fileID: 2058545417}
  - component: {fileID: 2058545416}
  m_Layer: 5
  m_Name: Panel
  m_TagString: Untagged
  m_Icon: {fileID: 0}
  m_NavMeshLayer: 0
  m_StaticEditorFlags: 0
  m_IsActive: 1
--- !u!224 &2058545415
RectTransform:
  m_ObjectHideFlags: 0
  m_CorrespondingSourceObject: {fileID: 0}
  m_PrefabInstance: {fileID: 0}
  m_PrefabAsset: {fileID: 0}
  m_GameObject: {fileID: 2058545414}
  m_LocalRotation: {x: 0, y: 0, z: 0, w: 1}
  m_LocalPosition: {x: 0, y: 0, z: 0}
  m_LocalScale: {x: 1, y: 1, z: 1}
  m_Children: []
  m_Father: {fileID: 583992826}
  m_RootOrder: 0
  m_LocalEulerAnglesHint: {x: 0, y: 0, z: 0}
  m_AnchorMin: {x: 0, y: 0}
  m_AnchorMax: {x: 1, y: 1}
  m_AnchoredPosition: {x: 0, y: 0}
  m_SizeDelta: {x: -100, y: -100}
  m_Pivot: {x: 0.5, y: 0.5}
--- !u!114 &2058545416
MonoBehaviour:
  m_ObjectHideFlags: 0
  m_CorrespondingSourceObject: {fileID: 0}
  m_PrefabInstance: {fileID: 0}
  m_PrefabAsset: {fileID: 0}
  m_GameObject: {fileID: 2058545414}
  m_Enabled: 1
  m_EditorHideFlags: 0
  m_Script: {fileID: 11500000, guid: fe87c0e1cc204ed48ad3b37840f39efc, type: 3}
  m_Name: 
  m_EditorClassIdentifier: 
  m_Material: {fileID: 0}
  m_Color: {r: 1, g: 1, b: 1, a: 0.392}
  m_RaycastTarget: 1
  m_RaycastPadding: {x: 0, y: 0, z: 0, w: 0}
  m_Maskable: 1
  m_OnCullStateChanged:
    m_PersistentCalls:
      m_Calls: []
  m_Sprite: {fileID: 10907, guid: 0000000000000000f000000000000000, type: 0}
  m_Type: 1
  m_PreserveAspect: 0
  m_FillCenter: 1
  m_FillMethod: 4
  m_FillAmount: 1
  m_FillClockwise: 1
  m_FillOrigin: 0
  m_UseSpriteMesh: 0
  m_PixelsPerUnitMultiplier: 1
--- !u!222 &2058545417
CanvasRenderer:
  m_ObjectHideFlags: 0
  m_CorrespondingSourceObject: {fileID: 0}
  m_PrefabInstance: {fileID: 0}
  m_PrefabAsset: {fileID: 0}
  m_GameObject: {fileID: 2058545414}
  m_CullTransparentMesh: 1
