// Jest Snapshot v1, https://goo.gl/fbAQLP

exports[`snapshot Modal 1`] = `
<div>
  <div
    class="modal"
  >
    <div
      class="modal_content"
    >
      <div
        class="modal__exit"
        data-testid="close-modal"
      >
        X
      </div>
      <div />
      <div
        class="modal_btn_conteiner"
      >
        <button
          class="modal_btn"
        >
          OK
        </button>
      </div>
    </div>
  </div>
</div>
`;
