-------------------------------------------------------------------------------
Test set: pages.AdminPageAndBlogTest
-------------------------------------------------------------------------------
Tests run: 1, Failures: 0, Errors: 0, Skipped: 0, Time elapsed: 48.543 sec - in pages.AdminPageAndBlogTest
