%YAML 1.1
%TAG !u! tag:unity3d.com,2011:
--- !u!21 &2100000
Material:
  serializedVersion: 6
  m_ObjectHideFlags: 0
  m_CorrespondingSourceObject: {fileID: 0}
  m_PrefabInstance: {fileID: 0}
  m_PrefabAsset: {fileID: 0}
  m_Name: M_Fir_02_Cross
  m_Shader: {fileID: 4800000, guid: 7bd9a74c0a3251f429b6131c73340f07, type: 3}
  m_ShaderKeywords: _ALPHATEST_ON _DISABLE_SSR_TRANSPARENT _DOUBLESIDED_ON _KEYWORD0_ON
    _WINDVERTEXCOLORMAINR_ON
  m_LightmapFlags: 4
  m_EnableInstancingVariants: 1
  m_DoubleSidedGI: 1
  m_CustomRenderQueue: 2475
  stringTagMap:
    MotionVector: User
    RenderType: TransparentCutout
  disabledShaderPasses:
  - MOTIONVECTORS
  - TransparentDepthPrepass
  - TransparentDepthPostpass
  - TransparentBackface
  - RayTracingPrepass
  m_SavedProperties:
    serializedVersion: 3
    m_TexEnvs:
    - WIND_SETTINGS_TexGust:
        m_Texture: {fileID: 0}
        m_Scale: {x: 1, y: 1}
        m_Offset: {x: 0, y: 0}
    - WIND_SETTINGS_TexNoise:
        m_Texture: {fileID: 0}
        m_Scale: {x: 1, y: 1}
        m_Offset: {x: 0, y: 0}
    - _BaseColorMap:
        m_Texture: {fileID: 2800000, guid: bf0e6e3094417e0499408282a72dccf7, type: 3}
        m_Scale: {x: 1, y: 1}
        m_Offset: {x: 0, y: 0}
    - _BumpMap:
        m_Texture: {fileID: 2800000, guid: c9ca3d403d284d54e933498cac14a5a4, type: 3}
        m_Scale: {x: 1, y: 1}
        m_Offset: {x: 0, y: 0}
    - _DetailAlbedoMap:
        m_Texture: {fileID: 0}
        m_Scale: {x: 1, y: 1}
        m_Offset: {x: 0, y: 0}
    - _DetailMask:
        m_Texture: {fileID: 0}
        m_Scale: {x: 1, y: 1}
        m_Offset: {x: 0, y: 0}
    - _DetailNormalMap:
        m_Texture: {fileID: 0}
        m_Scale: {x: 1, y: 1}
        m_Offset: {x: 0, y: 0}
    - _EmissionMap:
        m_Texture: {fileID: 0}
        m_Scale: {x: 1, y: 1}
        m_Offset: {x: 0, y: 0}
    - _MainTex:
        m_Texture: {fileID: 2800000, guid: bf0e6e3094417e0499408282a72dccf7, type: 3}
        m_Scale: {x: 1, y: 1}
        m_Offset: {x: 0, y: 0}
    - _MaskMap:
        m_Texture: {fileID: 0}
        m_Scale: {x: 1, y: 1}
        m_Offset: {x: 0, y: 0}
    - _MetalicRAOGSmothnessA:
        m_Texture: {fileID: 2800000, guid: f39f6bc6ea266c048be3fb238b793654, type: 3}
        m_Scale: {x: 1, y: 1}
        m_Offset: {x: 0, y: 0}
    - _MetallicGlossMap:
        m_Texture: {fileID: 0}
        m_Scale: {x: 1, y: 1}
        m_Offset: {x: 0, y: 0}
    - _NormalMap:
        m_Texture: {fileID: 2800000, guid: 561eb40787ade1f4cabbf5906b840ac9, type: 3}
        m_Scale: {x: 1, y: 1}
        m_Offset: {x: 0, y: 0}
    - _OcclusionMap:
        m_Texture: {fileID: 0}
        m_Scale: {x: 1, y: 1}
        m_Offset: {x: 0, y: 0}
    - _ParallaxMap:
        m_Texture: {fileID: 0}
        m_Scale: {x: 1, y: 1}
        m_Offset: {x: 0, y: 0}
    - _SpecGlossMap:
        m_Texture: {fileID: 0}
        m_Scale: {x: 1, y: 1}
        m_Offset: {x: 0, y: 0}
    - _ThicknessMap:
        m_Texture: {fileID: 0}
        m_Scale: {x: 1, y: 1}
        m_Offset: {x: 0, y: 0}
    - _texcoord:
        m_Texture: {fileID: 0}
        m_Scale: {x: 1, y: 1}
        m_Offset: {x: 0, y: 0}
    - unity_Lightmaps:
        m_Texture: {fileID: 0}
        m_Scale: {x: 1, y: 1}
        m_Offset: {x: 0, y: 0}
    - unity_LightmapsInd:
        m_Texture: {fileID: 0}
        m_Scale: {x: 1, y: 1}
        m_Offset: {x: 0, y: 0}
    - unity_ShadowMasks:
        m_Texture: {fileID: 0}
        m_Scale: {x: 1, y: 1}
        m_Offset: {x: 0, y: 0}
    m_Floats:
    - WIND_SETTINGS_FlexNoiseScale: 0
    - WIND_SETTINGS_GustScale: 0
    - WIND_SETTINGS_GustSpeed: 0
    - WIND_SETTINGS_GustWorldScale: 0
    - WIND_SETTINGS_ShiverNoiseScale: 0
    - WIND_SETTINGS_Turbulence: 0
    - _AO: 1
    - _AORemapMax: 1
    - _AORemapMin: 0
    - _AddPrecomputedVelocity: 0
    - _AlphaCutOut: 0.5
    - _AlphaCutoff: 0.65
    - _AlphaCutoffEnable: 1
    - _AlphaDstBlend: 0
    - _AlphaShadowThreshold: 0.5
    - _AlphaSrcBlend: 1
    - _AlphaToMask: 0
    - _AlphaToMaskInspectorValue: 0
    - _AmbientOcclusionPower: 1
    - _BlendMode: 0
    - _Brightness: 4.79
    - _BumpScale: 1
    - _ColorNoiseSpread: 2
    - _CullFarDistance: 20
    - _CullFarStart: 60
    - _CullMode: 0
    - _CullModeForward: 0
    - _Cutoff: 0.65
    - _DepthOffsetEnable: 0
    - _DetailNormalMapScale: 1
    - _DiffusionProfileHash: 2.64331
    - _DistanceBlend: 0
    - _DoubleSidedEnable: 1
    - _DoubleSidedNormalMode: 1
    - _Drag: 0.3
    - _DstBlend: 0
    - _EnableBlendModePreserveSpecularLighting: 1
    - _EnableFogOnTransparent: 1
    - _GlossMapScale: 1
    - _Glossiness: 0
    - _GlossyReflections: 1
    - _HeightDrag: 0
    - _InitialBend: 1
    - _InvertBackfaceNormal: 0
    - _Keyword0: 1
    - _MaskClipValue: 0.7
    - _MetalicPower: 1
    - _Metallic: 0.06
    - _Mode: 1
    - _NormalScale: 1
    - _OcclusionStrength: 1
    - _OpaqueCullMode: 2
    - _Parallax: 0.02
    - _RayTracing: 0
    - _ReceivesSSR: 1
    - _ReceivesSSRTransparent: 0
    - _RefractionModel: 0
    - _RenderQueueType: 1
    - _RequireSplitLighting: 0
    - _ShiverDirectionality: 0
    - _ShiverDrag: 0
    - _Smooothness: 0.06
    - _SmoothnessRemapMax: 0.1
    - _SmoothnessRemapMin: 0
    - _SmoothnessTextureChannel: 0
    - _SmothnessPower: 1
    - _Specular: 0.1
    - _SpecularHighlights: 1
    - _SrcBlend: 1
    - _StencilRef: 0
    - _StencilRefDepth: 8
    - _StencilRefDistortionVec: 4
    - _StencilRefGBuffer: 10
    - _StencilRefMV: 40
    - _StencilWriteMask: 6
    - _StencilWriteMaskDepth: 8
    - _StencilWriteMaskDistortionVec: 4
    - _StencilWriteMaskGBuffer: 14
    - _StencilWriteMaskMV: 40
    - _Stiffness: 1
    - _SupportDecals: 1
    - _SurfaceType: 0
    - _Thickness: 0.746
    - _TransAmbient: 0
    - _TransDirect: 0.258
    - _TransNormalDistortion: 1
    - _TransScattering: 1
    - _TransShadow: 0
    - _Translucency: 50
    - _TransparentBackfaceEnable: 0
    - _TransparentCullMode: 2
    - _TransparentDepthPostpassEnable: 0
    - _TransparentDepthPrepassEnable: 0
    - _TransparentSortPriority: 0
    - _TransparentWritingMotionVec: 0
    - _TransparentZWrite: 0
    - _UVSec: 0
    - _UseShadowThreshold: 0
    - _WindColorMix: 0
    - _WindColorThreshold: 1
    - _WindNoisePower: 0
    - _WindNormalInfluence: 0
    - _WindPower: 0.25
    - _WindPowerDirectionX: 1
    - _WindPowerDirectionZ: 0.3
    - _WindVertexColorMainR: 1
    - _WindVertexColorMainRNoiseB: 0
    - _ZTestDepthEqualForOpaque: 3
    - _ZTestGBuffer: 3
    - _ZTestTransparent: 4
    - _ZWrite: 1
    - __dirty: 0
    m_Colors:
    - NewNormal: {r: 0, g: 0, b: 0, a: 0}
    - WIND_SETTINGS_WorldDirectionAndSpeed: {r: 0, g: 0, b: 0, a: 0}
    - _Color: {r: 1, g: 1, b: 1, a: 1}
    - _ColorAdjustment: {r: 1.8, g: 1.8, b: 1.6, a: 0}
    - _DiffusionProfileAsset: {r: -1.8019567e-30, g: 2.8583547e+22, b: 2.0825967e+12,
        a: 8.838735e-11}
    - _DoubleSidedConstants: {r: 1, g: 1, b: -1, a: 0}
    - _DryColor: {r: 0.8773585, g: 0.8440883, b: 0.7076807, a: 1}
    - _EmissionColor: {r: 1, g: 1, b: 1, a: 1}
    - _HealthyColor: {r: 1, g: 1, b: 1, a: 1}
    - _NewNormal: {r: 1, g: 1, b: 1, a: 1}
    - _SpecColor: {r: 0, g: 0, b: 0, a: 1}
    - _TilingOffset: {r: 1, g: 1, b: 0, a: 0}
    - _Tiling_and_Offset: {r: 1, g: 1, b: 0, a: 0}
    - _TranslucencyColor: {r: 0.34034553, g: 0.48529398, b: 0.14630184, a: 0}
    - _Vector0: {r: 1, g: 1, b: 1, a: 0}
    - _VertexNormalMultiply: {r: 0, g: 0, b: 0, a: 0}
    - _WindColorInfluence: {r: 0, g: 0, b: 0, a: 0}
    - _WindColorMultiply: {r: 1, g: 1, b: 1, a: 0}
  m_BuildTextureStacks: []
