%YAML 1.1
%TAG !u! tag:unity3d.com,2011:
--- !u!114 &11400000
MonoBehaviour:
  m_ObjectHideFlags: 0
  m_CorrespondingSourceObject: {fileID: 0}
  m_PrefabInstance: {fileID: 0}
  m_PrefabAsset: {fileID: 0}
  m_GameObject: {fileID: 0}
  m_Enabled: 1
  m_EditorHideFlags: 0
  m_Script: {fileID: 11500000, guid: b2b0f2e7fc23e46c78f6dc1a54c32708, type: 3}
  m_Name: Material Map
  m_EditorClassIdentifier: 
  surfaceMaterialFromGuid:
    guids:
    - 73c176f402d2c2f4d929aa5da7585d17
    - 4641a3de9c00fa74fb295fbddbbfa890
    - 02709e61a9fb163408caabe5804296e8
    - bc3f3d2085e2fab49bc6bc5adb6bffc3
    - 3ace0c8100354e345b84f8efe29b7e52
    - 6dae7e74276480741943884153a02835
    - 73c8da5eaf41c414aa8bc96170fa99b1
    - 1cfdb7943d3947a42b25af13ecd82f6a
    - b3e91bf8c72c1ec4b814459f1e1367ac
    - 0baa2096541b30040836b1e15e58bc89
    - 3e353751833795047bbb4250ef1ad64b
    - d048f6f77a0c80e4fba79bcdaefe13f5
    - e2234b4e7bc1d0c488e3f02b17006fc5
    - d4b19da55f337bd46a8a3e80ea2734f9
    - 35592617f47da9c4faccd85d5562994d
    - aec0c3479a56e694e94e8a408d946072
    - 92a942861fb3b25468471a6768b93a8f
    - 524f9da96b60b2c41a9059a32fe9fb63
    - 07108e1e3917657458ad768f2b3dacec
    - d48820592dc22de44adca72e1da5a749
    - b246eeed2a958c541a297fe3db789e18
    - 645c5bbe1350db141a5f4bb0a8f3e68b
    - 1bdaa92c77ab2fc448e8fc5913b132e3
    - 58ca683bba6286047b40ad1906c12329
    - ac58310c03eb84e4894eee37d2ac5255
    surfaceMaterials: 100000000200000000000000020000000d000000000000000a0000000a0000000a0000000a0000000a0000000a0000000a0000000a0000000a0000000a0000000a0000000a0000000a0000000a0000000100000016000000160000000a0000000a000000
